{"text_format":"1","workbook":"xlsx","n_sheets":11,"sheets":["FAL 7","Languages","Slowniki_Dictionaries","DangerousGood","FuelType","DicWaste","RecProvider","Kraje_Countries","PackType","Porty_Ports","Version"],"not_rendered":{"charts":0,"images":1,"macros":1,"external_links":0,"defined_names":40,"comments":0,"pivot_tables":0},"unopened":[],"bounds":{"document_bytes":16777216,"sheet_cells":100000,"rows_first":2000,"rows_last":500,"rows_between":2000,"halvings":0,"cell_chars":16384,"cell_head_chars":4096},"cells_cut":0,"cells_raw":0,"read":"whole","date_system":"1900"}

{"sheet":"FAL 7","index":0,"n_rows":10,"n_cols":15,"rows_kept":10,"cut":false,"hidden":false,"merged":[]}
[{"$f":"\"Ver: \" & Version!B1","v":"Ver: 1.2.0"}]
[{"$f":"INDEX((Languages!$A$8:$B$8),0,MATCH(B4,Languages,0))","v":"Dangerous and polluting goods notification form"}]
[]
["Wybierz język / Choose language","English",null,null,null,"* Pole obowiązkowe / Mandatory field"]
[null,{"$f":"INDEX((Languages!$V$3:$W$3),0,MATCH(B4,Languages,0))","v":"Date of signing"},{"$f":"INDEX((Languages!$V$4:$W$4),0,MATCH(B4,Languages,0))","v":"Place of signing"},{"$f":"INDEX((Languages!$V$5:$W$5),0,MATCH(B4,Languages,0))","v":"Ship's position"},{"$f":"INDEX((Languages!$V$6:$W$6),0,MATCH(B4,Languages,0))","v":"INF class"},{"$f":"INDEX((Languages!$V$8:$W$8),0,MATCH(B4,Languages,0))","v":"DG confirmation *"},{"$f":"INDEX((Languages!$V$7:$W$7),0,MATCH(B4,Languages,0))","v":"Additional information"}]
[]
[{"$f":"INDEX((Languages!$V$9:$W$9),0,MATCH(B4,Languages,0))","v":"Contact details of the institution from which detailed information on dangerous or polluting goods can be obtained"},{"$f":"INDEX((Languages!$V$10:$W$10),0,MATCH(B4,Languages,0))","v":"Contact name"},{"$f":"INDEX((Languages!$V$11:$W$11),0,MATCH(B4,Languages,0))","v":"Address"},{"$f":"INDEX((Languages!$V$12:$W$12),0,MATCH(B4,Languages,0))","v":"Phone *"},{"$f":"INDEX((Languages!$V$13:$W$13),0,MATCH(B4,Languages,0))","v":"Fax"},{"$f":"INDEX((Languages!$V$14:$W$14),0,MATCH(B4,Languages,0))","v":"E-mail"}]
[]
[]
[{"$f":"INDEX((Languages!$S$3:$T$3),0,MATCH(B4,Languages,0))","v":"Booking / Reference number"},{"$f":"INDEX((Languages!$S$4:$T$4),0,MATCH(B4,Languages,0))","v":"Marks and numbers *"},{"$f":"INDEX((Languages!$S$5:$T$5),0,MATCH(B4,Languages,0))","v":"No. of packages"},{"$f":"INDEX((Languages!$S$6:$T$6),0,MATCH(B4,Languages,0))","v":"Kind of packages"},{"$f":"INDEX((Languages!$S$7:$T$7),0,MATCH(B4,Languages,0))","v":"Transport document"},{"$f":"INDEX((Languages!$S$8:$T$8),0,MATCH(B4,Languages,0))","v":"Transport equipment"},{"$f":"INDEX((Languages!$S$11:$T$11),0,MATCH(B4,Languages,0))","v":"hazmatID / Packing group / Proper shipping name *"},{"$f":"INDEX((Languages!$S$15:$T$15),0,MATCH(B4,Languages,0))","v":"Flashpoint"},{"$f":"INDEX((Languages!$S$17:$T$17),0,MATCH(B4,Languages,0))","v":"Mass/Volume of goods *"},{"$f":"INDEX((Languages!$S$18:$T$18),0,MATCH(B4,Languages,0))","v":"Netto quantity"},{"$f":"INDEX((Languages!$S$19:$T$19),0,MATCH(B4,Languages,0))","v":"Unit of measure *"},{"$f":"INDEX((Languages!$S$20:$T$20),0,MATCH(B4,Languages,0))","v":"Emergency procedures EmS"},{"$f":"INDEX((Languages!$S$21:$T$21),0,MATCH(B4,Languages,0))","v":"Location on board *"},{"$f":"INDEX((Languages!$S$22:$T$22),0,MATCH(B4,Languages,0))","v":"Port of loading *"},{"$f":"INDEX((Languages!$S$23:$T$23),0,MATCH(B4,Languages,0))","v":"Port of discharge *"}]

{"sheet":"Languages","index":1,"n_rows":24,"n_cols":68,"rows_kept":24,"cut":false,"hidden":true,"merged":[]}
["English","Polski",null,"English","Polski",null,"English","Polski",null,"English","Polski",null,"English","Polski",null,"English","Polski",null,"English","Polski",null,"English","Polski",null,"English","Polski",null,"English","Polski",null,"English","Polski",null,"English","Polski",null,"English","Polski",null,"English","Polski",null,"English","Polski",null,"English","Polski",null,"English","Polski",null,"English","Polski",null,"English","Polski",null,"English","Polski",null,"English","Polski",null,"English","Polski",null,"English","Polski"]
["Language – Title","Język – Nagłówki",null,"Language – FAL 2","Język – FAL 2",null,"Language - FAL 3","Język - FAL 3",null,"Language – FAL 4","Język – FAL 4",null,"Language – FAL 5","Język – FAL 5",null,"Language – FAL 6","Język – FAL 6",null,"Language – FAL 7","Język – FAL 7",null,"Language – FAL 7 Headline","Język – FAL 7 Nagłówek",null,"Language – PSC","Język – PSC",null,"Language – HEALTH Headline","Język – HEALTH  Nagłówek",null,"Language – HEALTH Infected area","Język – HEALTH Zawinięcia na obszarze dotkniętym",null,"Language – HEALTH Sanitary measure","Język – HEALTH Zastosowanie środków sanitarnych",null,"Language – HEALTH Anex to the Maritime Declaration","Język – HEALTH Zal do morskiej dekl",null,"Language – WASTE Headline","Język – WASTE Nagłówek",null,"Language – Waste items","Język – Waste Pozycje",null,"Language – Waste receipt","Język – Waste Pokwitowanie",null,"Language – ISPS Headline","Język – ISPS Nagłówek",null,"Language – ISPS for the last 10 calls","Język – ISPS for the last 10 calls",null,"Language - Ship to ship activities","Język - Ship to ship activities",null,"Language - FAL 3 Bunker","Język - FAL 3 Bunker",null,"Language - Ferry Manifest","Język - Manifest Promowy",null,"Language - Ballast","Język - Wody balastowe",null,"Language - Ballast Hist","Język - Wody balastowe Hist"]
["Cargo notification form","Zgłoszenie ładunku",null,"Transport document","Dokument transportowy",null,"Ship’s stores (name of article) *","Nazwa artykułu *",null,"Family name *","Nazwisko *",null,"Family name *","Nazwisko *",null,"Family name *","Nazwisko *",null,"Booking / Reference number","Numer bukingowy / referencyjny",null,"Date of signing","Data podpisania",null,"Planned duration of the call *","Planowany czas postoju *",null,"Place of signing","Miejsce podpisania",null,"Date of visit","Data zawinięcia na dotkniętym obszarze"," ","Sanitary measure date","Data zastosowania środków sanitarnych"," ","Crew or passenger","Załoga czy pasażer",null,"Are you delivering waste? *","Czy statek zamierza zdawać odpady? *",null,"Type of waste ","Rodzaj odpadów",null,"Port reception facility provider *","Dostawca portowych urządzeń do odbioru odpadów *",null,"Does the ship have a valid International Ship Security Certificate (ISSC)? *","Czy statek posiada ważny Międzynarodowy certyfikat ochrony statku (ISSC)? *",null,"Date from *","Data zawinięcia *",null,"Date from *","Data początkowa *",null,"Type / category of bunkers *","Typ / kategoria paliwa bunkrowego *",null,"Carrier name","Nazwa przewoźnika",null,"Date of submission *","Data przekazania *",null,"Tanks / Holds","Zbiorniki / Ładownie"]
["Ship's store notification form","Zgłoszenie zasobów statku",null,"No. of packages","Ilość opakowań",null,"Quantity *","Ilość zasobów  *",null,"First names *","Imiona *",null,"First names *","Imiona *",null,"First names *","Imiona *",null,"Marks and numbers *","Znaki i numery *",null,"Place of signing","Miejsce podpisania",null,"Planned operations (loading, unloading, other) *","Planowane działania (przeładunkowe, bunkrowania) *",null,"Date of signing","Data podpisania",null,"Port of call","Port zawinięcia na obszarze dotkniętym"," ","Sanitary measure type","Typ zastosowanych środków sanitarnych"," ","Person name","Nazwisko osoby",null,"Last port of delivery *","Ostatni port zdania odpadów *",null,"Code of waste ","Kod odpadu",null,"Treatment facility provider - if different from PRF provider","Podmiot świadczący usługi przetwarzania odpadów - jeżeli inny niż dostawca",null,"Cause of invalid International Ship Security Certificate","Powody nieważności Międzynarodowego certyfikatu ochrony statku (ISSC)",null,"Date to *","Data wyjścia *",null,"Date to *","Data końcowa *",null,"Bunker description","Opis paliwa bunkrowego",null,"Family name","Nazwisko",null,"Amended form? *","Formularz zmieniony? *",null,"Tank capacity (m3)","Pojemność zbiornika (m3)"]
["Crew's effects notification form","Zgłoszenie rzeczy załogi",null,"Kind of packages","Typ opakowania",null,"Unit *","Jednostka *",null,"Rank/post *","Stopień/stanowisko *",null,"Gender *","Płeć *",null,"Gender *","Płeć *",null,"No. of packages","Ilość paczek",null,"Ship's position","Pozycja statku",null,"Planned inspections, surveys, maintenance and repair works *","Planowane inspekcje, przeglądy, prace remontowe *",null,"Valid Sanitation Control Exemption/Control Certificate carried on board?","Czy na pokładzie statku znajduje się ważne Świadectwo SSCEC / SSCC?"," ",null,null,null,"Sanitary measure place","Miejsce zastosowania środków sanitarnych"," ","Age","Wiek",null,"Date of last delivery *","Data ostatniego zdania odpadów *",null,"Description","Dodatkowy opis",null,"Waste delivery date/time, from *","Data/czas początkowa odprowadzenia odpadów *",null,"Security certificate status *","Status Certyfikatu ISSC *",null,"UN/LOCODE *","Kod portu *",null,"UN/LOCODE","Kod portu",null,"Quantity *","Ilość *",null,"First name","Imię",null,"Total ballast water on board (m3) *","Całkowita ilość wód balastowych na statku (m3) *",null,"Date","Data"]
["Crew notification form ","Zgłoszenie listy załogi",null,"Description of the goods *","Opis towaru *",null,"Official Use *","Użytek służbowy *",null,"Crew effect *","Mienie załogi *",null,"Nationality *","Obywatelstwo *",null,"Nationality *","Obywatelstwo *",null,"Kind of packages","Typ opakowania",null,"INF class","Klasa INF",null,"Hull configuration (for tankers)","Konstrukcja kadłuba (zbiornikowce)",null,"Place of issue","Miejsce wystawienia Świadectwa",null,null,null,null,null,null,null,"Gender","Płeć",null,"Next port of waste delivery","Następny port odprowadzenia odpadów",null,"Waste to be delivered (m3)","Ilość odpadów do zdania (w m3)",null,"Waste delivery date/time, to *","Data/czas końcowa odprowadzenia odpadów *",null,"Type of organization issuing ISSC","Typ organizacji wystawiającej ISSC",null,"Port facility *","Obiekt portowy *",null,"Location description","Opis lokalizacji działania",null,"Unit *","Jednostka *",null,"Ticket number","Nr biletu",null,"Number of tanks and holds in ballast *","Liczba zbiorników i ładowni pod balastem *",null,"Location","Lokalizacja"]
["Passenger notification form ","Zgłoszenie listy pasażerów",null,"HS code","Kod towaru HS",null,"Location on board *","Lokalizacja na pokładzie *",null,"Quantity","Zgłaszana ilość",null,"Country of birth *","Kraj urodzenia *",null,"Country of birth *","Kraj urodzenia *",null,"Transport document","Dokument transportowy",null,"Additional information","Dodatkowe informacje",null,"Volume and nature of the cargo (for tankers)","Ilość i rodzaj ładunku(zbiornikowce)",null,"Date of issue","Data wystawienia Świadectwa",null,null,null,null,null,null,null,"Nationality","Obywatelstwo",null,"Accurate details *","Dokładne dane *",null,"Maximum dedicated storage capacity (m3)","Maksymalna pojemność zbiornika na odpady (w m3)",null,"Type of waste delivered *","Rodzaj odprowadzonych odpadów *",null,"ISSC issuer *","Organizacja wystawiająca ISSC *",null,"Security level *","Poziom ochrony statku *",null,"Location latitude\n(numeric from -90 to +90)","Szerokość geograficzna lokalizacji\n(numeric from -90 to +90)",null,"Quantity delivered at port *","Ilość dostarczona w porcie *",null,"Vehicle reg no","Nr pojazdu",null,"Total ballast water capacity (m3) *","Całkowita pojemność zbiorników balastowych (m3) *",null,"Volume (m3)","Ilość (m3)"]
["Dangerous and polluting goods notification form","Zgłoszenie ładunków niebezpiecznych lub zanieczyszczających",null,"Mass/Volume of goods *","Masa/Ilość towaru *",null,null,null,null,"Unit of items","Jednostka miary",null,"Date of birth *","Data urodzenia *",null,"Date of birth *","Data urodzenia *",null,"Transport equipment","Środek transportu",null,"DG confirmation *","Potwierdzenie deklaracji DG *",null,"Condition of the cargo and ballast tanks (for tankers)","Stan zapełnienia zbiorników (zbiornikowce)",null,"Re-inspection required?","Czy jest wymagana ponowna inspekcja?",null,null,null,null,null,null,null,"Embarkation port","Port zaokrętowania",null,"Sufficient capacity *","Wystarczające miejsce *",null,"Amount of waste retained on board (m3)","Ilość odpadów które pozostaną na statku (w m3)",null,"Description","Dodatkowy opis",null,"ISSC expiry date *","Data wygaśnięcia ISSC *",null,"Special or additional security measures taken by the ship","Specjalne lub dodatkowe środki ochrony wprowadzone na statku",null,"Location longitude\n(numeric from -180 to +180)","Długość geograficzna lokalizacji\n(numeric from -180 to +180)",null,"Date of delivery *","Data dostawy paliwa *",null,"Vehicle type","Typ pojazdu",null,"Total number of tanks and holds *","Liczba zbiorników i ładowni balastowych *",null,"Date","Data"]
["PSC expanded inspection information","Informacje o rozszerzonej inspekcji PSC",null,"Unit *","Jednostka *",null,null,null,null,null,null,null,"Birth place *","Miejsce urodzenia *",null,"Birth place *","Miejsce urodzenia *",null,"Type of classification *","Typ klasyfikacji *",null,"Contact details of the institution from which detailed information on dangerous or polluting goods can be obtained","Dane kontaktowe instytucji, od której można uzyskać szczegółowe informacje na temat ładunków niebezpiecznych lub zanieczyszczających",null,"Date of last expanded inspection in the Paris MoU region","Data ostatniej rozszerzonej inspekcji",null,"Has ship/vessel visited an affected area identified by the WHO?","Czy statek przebywał na obszarze określonym przez Światową Organizację Zdrowia za dotknięty?",null,null,null,null,null,null,null,"Date of embarkation","Data zaokrętowania",null,"Contact","Kontakt",null,"Port at which remaining waste will be delivered","Port w którym zostaną zdane odpady pozostające na statku",null,"Amount of waste delivered (m3) *","Ilość odprowadzonych odpadów (m3) *",null,"Current ship security level *","Aktualny poziom ochrony statku *",null,null,null,null,"Ship-to-ship activity *","Działanie między statkami *",null,"Bunker delivery receipt *","Potwierdzenie dostawy paliwa *",null,"Trailer reg no","Nr przyczepy",null,"Number of ballast water tanks to be discharged *","Liczba zbiorników balastowych, z których zostanie usunięta WB *",null,"Start point","Rozpoczęcie"]
["Ballast Water notification form","Zgłoszenie wód balastowych",null,"Netto quantity","Ilość netto",null,null,null,null,null,null,null,"Rank/post *","Stopień/ranga *",null,"Identify Document Type *","Typ dokumentu *",null,"UN number","Numer UN",null,"Contact name","Nazwa podmiotu",null,null,null,null,"Has any person died on board during the voyage otherwise than as a result of accident?","Czy na pokładzie podczas podróży zmarła jakakolwiek osoba z przyczyn innych niż wypadek?",null,null,null,null,null,null,null,"Nature of illness","Natura choroby",null,"Comment","Komentarz",null,"Estimated amount of waste to be generated between this notification and arrival at next port of call (m3)","Szacunkowa ilość odpadów, które powstaną od momentu przekazania tej informacji do czasu zawinięcia do następnego portu (w m3)",null,null,null,null,"Location of ship at the time this report is made","Położenie statku w chwili dokonania zgłoszenia",null,null,null,null,"Security measures applied in lieu of those stated in SSP","Środki ochrony podjęte zamiast środków określonych w planie ochrony statku",null,null,null,null,"Cargo description","Opis ładunku",null,"Number of ballast water tanks underwent exchange *","Liczba zbiorników balastowych, dla których dokonano wymiany WB *",null,"End point","Zakończenie"]
["Ferry manifest notification","Manifest promowy",null,"Unit","Jednostka",null,null,null,null,null,null,null,"Document Type *","Typ dokumentu *",null,"Identify Document Number *","Numer dokumentu *",null,"hazmatID / Packing group / Proper shipping name *","hazmatID / Grupa ładunkowa / Poprawna nazwa przewozowa *",null,"Address","Adres",null,null,null,null,"Total no. of deaths","Łączna liczba przypadków zgonów",null,null,null,null,null,null,null,"Date of onset of symptoms","Data pierwszych objawów choroby",null,null,null,null,"Waste that has been delivered at the last port of delivery (m3)","Odpady, które zostały zdane w ostatnim porcie zdania (m3)",null,null,null,null,"CSO given name","Imię CSO",null,null,null,null,null,null,null,null,null,null,"Country cargo send","Kraj nadania towaru",null,"Number of ballast water tanks were treated *","Liczba zbiorników balastowych, z których WB poddano obróbce *",null,"Volume (m3)","Ilość (m3)"]
["Maritime declaration of health","Morska deklaracja o stanie zdrowia",null,"Dimensions","Wymiary",null,null,null,null,null,null,null,"Document ID *","Numer dokumentu *",null,"Document issuing country","Państwo wydania dokumentu",null,"Class","Klasa",null,"Phone *","Telefon *",null,null,null,null,"Is there on board or has there been during the international voyage any case of disease which you suspect to be of an infectious nature?","Czy na pokładzie podczas podróży ma lub miał miejsce przypadek choroby, co do której istnieje podejrzenie, że jest chorobą zakaźną?",null,null,null,null,null,null,null,"Reported to a port medical officer?","Czy został powiadomiony lekarz portowy?",null,null,null,null,"Do not fill this row","Nie wypełniaj tego wiersza",null,null,null,null,"CSO family name *","Nazwisko CSO *",null,null,null,null,null,null,null,null,null,null,"Country cargo destination","Kraj docelowy towaru",null,"Name of ballast water mamagement system used on ship","Nazwa systemu obróbki wód balastowych na statku",null,"% Exch","% wymiany"]
["Ship security notification form","Zgłoszenie wstępne ochrony statku",null,"Unit","Jednostka",null,null,null,null,null,null,null,"Document issuing country","Państwo wydania dokumentu",null,"Document expiration date","Data wygaśnięcia dokumentu",null,"Packing Group","Grupa ładunkowa",null,"Fax","Fax",null,null,null,null,"Has the total number of ill passengers during the voyage been greater than normal/expected?","Czy łączna liczba chorych pasażerów podczas podróży była większa niż normalna /oczekiwana?",null,null,null,null,null,null,null,"Disposal of case (see Note above)","Rozwiązanie przypadku (zobacz Uwagę powyżej)",null,null,null,null,"Fill at least one row of this type","Wypełnij przynajmniej jeden wiersz tego rodzaju",null,null,null,null,"CSO phone *","Telefon CSO *",null,null,null,null,null,null,null,null,null,null,null,null,null,"The reason why ballast water management not conducted","Powód, dlaczego wody balastowe nie poddano obróbce",null,"Method","Metoda"]
["Advance waste notification form","Wcześniejsze powiadomienie o odpadach",null,"ENS declaration","Deklaracja celna",null,null,null,null,null,null,null,"Document expiration date","Data wygaśnięcia dokumentu",null,"Embarkation port *","Port zaokrętowania *",null,"Subsidiary risks","Dodatkowe zagrożenia",null,"E-mail","E-mail",null,null,null,null,"How many ill persons?","Ile osób jest chorych?",null,null,null,null,null,null,null,"Drugs, medicines or other treatment given to patient","Podane środki farmakologiczne lub zastosowane inne leczenie pacjenta",null,null,null,null,"Fill this row","Wypełnij ten wiersz",null,null,null,null,"CSO fax","Fax CSO",null,null,null,null,null,null,null,null,null,null,null,null,null,"Approved ballast water management plan on board? *","Czy jest na statku plan postępowania z wodami balastowymi? *",null,"Salinity (PSU)","Zasolenie (PSU)"]
["Waste receipt information","Pokwitowanie zdania odpadów",null,"Marks and numbers","Znaki i numery",null,null,null,null,null,null,null,"Visa number","Numer Wizy",null,"Disembarkation port *","Port wyokrętowania *",null,"Flashpoint","Temperatura zapłonu",null,null,null,null,null,null,null,"Is there any ill person on board now?","Czy obecnie na statku znajduje się jakakolwiek chora osoba?",null,null,null,null,null,null,null,"Comments","Komentarz",null,null,null,null,null,null,null,null,null,null,"CSO e-mail","E-mail CSO",null,null,null,null,null,null,null,null,null,null,null,null,null,"Management plan implemented? *","Czy plan został wdrożony? *",null,"Date","Data"]
["Bunker fuel received at port","Zgłoszenie przyjętego paliwa w porcie",null,"Location on board","Miejsce na pokładzie",null,null,null,null,null,null,null,null,null,null,"Transit passenger *","Pasażer tranzytowy *",null,"MARPOL code","Kod MARPOL",null,null,null,null,null,null,null,"Was a medical practitioner consulted?","Czy konsultowano się z lekarzem?",null,null,null,null,null,null,null,"Place of evacuation of the person","Miejsce ewakuacji pacjenta",null,null,null,null,null,null,null,null,null,null,"Did the ship take any special or additional security measures, beyond those in the approved SSP? *","Czy na statku były wprowadzane specjalne lub dodatkowe środki ochrony poza określonymi w zatwierdzonym Planie Ochrony Statku? *",null,null,null,null,null,null,null,null,null,null,null,null,null,"Ballast water record book on board? *","Czy jest na statku książka zapisów balastowych? *",null,"Location","Lokalizacja"]
[null,null,null,"Port of loading","Port załadunku",null,null,null,null,null,null,null,null,null,null,"Visa number","Numer wizy",null,"Mass/Volume of goods *","Masa/Ilość towaru *",null,null,null,null,null,null,null,"Are you aware of any condition on board which may lead to infection or spread of disease?","Czy wiesz o jakichkolwiek warunkach na statku, które mogą doprowadzić do zakażenia lub rozpowszechnienia choroby?",null,null,null,null,null,null,null,null,null,null,null,null,null,null,null,null,null,null,null,"Is there any security-related matter you wish to report? *","Czy istnieją inne informacje związane z ochroną statku, które należy zgłosić? *",null,null,null,null,null,null,null,null,null,null,null,null,null,"Does ship carry an International BW Management Certificate? *","Czy jest na statku Międzynarodowy Certyfikat Postępowania z WB? *",null,"Volume (m3)","Ilość (m3)"]
[null,null,null,"Port of discharge","Port rozładunku",null,null,null,null,null,null,null,null,null,null,"Special care or assistant","Specjalna opieka",null,"Netto quantity","Ilość netto",null,null,null,null,null,null,null,"Has any sanitary measure (e.g. quarantine, isolation, disinfection or decontamination) been applied on board?","Czy jakiekolwiek środki sanitarne (np. kwarantanna, odizolowanie, dezynfekcja lub odkażanie) zostały zastosowane na pokładzie?",null,null,null,null,null,null,null,null,null,null,null,null,null,null,null,null,null,null,null,"Other security related information details","Inne szczegółowe informacje związane z ochroną statku",null,null,null,null,null,null,null,null,null,null,null,null,null,"Date of issue of certificate","Data wydania certyfikatu",null,"Salinity (PSU)","Zasolenie (PSU)"]
[null,null,null,"Transport equipment","Środek transportu",null,null,null,null,null,null,null,null,null,null,"Emergency contact number","Telefon w niebezpieczeństwie",null,"Unit of measure *","Jednostka miary *",null,null,null,null,null,null,null,"Where did the stowaways join the ship (if known)?","Gdzie pasażerowie na gapę dostali się na statek (jeżeli wiadomo)?",null,null,null,null,null,null,null,null,null,null,null,null,null,null,null,null,null,null,null,"Does the ship have an approved SSP on board? *","Czy statek posiada zatwierdzony Plan Ochrony Statku (SSP)? *",null,null,null,null,null,null,null,null,null,null,null,null,null,"Expiry date of certificate","Data wygaśnięcia certyfikatu"]
[null,null,null,null,null,null,null,null,null,null,null,null,null,null,null,"Ticket No","Numer biletu",null,"Emergency procedures EmS","Procedury awaryjne EmS",null,null,null,null,null,null,null,"Is there a sick animal or pet on board?","Czy na pokładzie znajduje się chore zwierzę?",null,"Port calls in the affected area identified by the WHO ","Zawinięcia statku do portów na obszarze określonym za dotknięty",null,null,null,null,null,null,null,null,null,null,null,null,null,null,null,null,"Were the ship security procedures specified in the approved SSP maintained during each of ship-to-ship activities? *","Czy procedury dotyczące ochrony określone w zatwierdzonym planie ochrony statku zostały podjęte w trakcie działań statek-statek? *",null,"Last 10 Port Calls (most recent first)","Lista ostatnich 10 zawinięć (począwszy od ostatniego)",null,"Ship-to-ship activities (most recent first)","Lista działań statek-statek (począwszy od ostatniego)",null,null,null,null,null,null,null,"Authority that issued certificate","Organ wydający certyfikat",null,"BW SOURCES","POCHODZENIE WB"]
[null,null,null,null,null,null,null,null,null,null,null,null,null,null,null,null,null,null,"Location on board *","Miejsce na pokładzie *",null,null,null,null,null,null,null,null,null,null,"Sanitary measures applied on board","Środki sanitarne zastosowane na statku",null,null,null,null,null,null,null,null,null,null,null,null,null,null,null,null,null,null,null,null,null,null,null,null,null,null,null,null,null,null,null,"Place of issue certificate","Miejsce wydania certyfikatu",null,"BW MANAGEMENT PRACTICES","POSTĘPOWANIE Z WB"]
[null,null,null,null,null,null,null,null,null,null,null,null,null,null,null,null,null,null,"Port of loading *","Port załadunku *",null,null,null,null,null,null,null,null,null,null,"Attachment to Maritime Declaration of Health","Załącznik do morskiej deklaracji o stanie zdrowia",null,null,null,null,null,null,null,null,null,null,null,null,null,null,null,null,null,null,null,null,null,null,null,null,null,null,null,null,null,null,null,"Date required to meet regulation D-2 *","Od kiedy statek zobowiązany jest stosować standard D-2 *",null,"PROPOSED BW DISCHARGE","WB PRZEZNACZONE DO ZRZUTU"]
[null,null,null,null,null,null,null,null,null,null,null,null,null,null,null,null,null,null,"Port of discharge *","Port rozładunku *",null,null,null,null,null,null,null,null,null,null,null,null,null,null,null,null,null,null,null,null,null,null,null,null,null,null,null,null,null,null,null,null,null,null,null,null,null,null,null,null,null,null,null,"Name and title","Imię, nazwisko, stanowisko "]
[null,null,null,null,null,null,null,null,null,null,null,null,null,null,null,null,null,null,null,null,null,null,null,null,null,null,null,null,null,null,"Note. Disposal of case means condition: 1) whether the person recovered, is still ill or died, and 2) whether the person is still on board, was evacuated (including the name of the port or airport to be provided in the last column), was buried at sea.","Uwaga. Rozwiązanie przypadku oznacza stan: 1) czy osoba wyzdrowiała, jest nadal chora czy umarła i 2) czy osoba nadal znajduje się na pokładzie, została ewakuowana (w tym nazwę portu lub lotniska, które należy podać w ostatniej kolumnie) czy została pochowana w morzu."]

{"sheet":"Slowniki_Dictionaries","index":2,"n_rows":24,"n_cols":27,"rows_kept":24,"cut":false,"hidden":true,"merged":[]}
["Arr/Dep","Checkbox","Checkbox","Units ","Jednostki","Units ","Jednostki","Document Type crew / passenger ","Gender","Plec","INF class ","Type of dangerous goods ","Marine pollutant ","Does ship intend to dispose waste? ","Informacja czy statek zamierza zdać odpady","ISSC Type","Typ dokumentu ISSC","ISSC issuing authority code ","Current ship security level ","Packing Group","Rating","Rating","Destination / Activity ","Tanks / Zbiorniki","Method / Metoda","Tankers","Vehicle Type"]
["Arrival","Yes","Tak","BLL - Barrel","BLL - Beczki","KGM - Kilogram","KGM - Kilogramy","MusterBook","Unknown","Nieznana","INF1","IMDG","P","Yes for all","Tak, wszystkie","Full","Pełny","GVT","SL1","I","Crew","Załoga","1 - Cargo operations : Discharging and/or loading of cargo.","AP - Rufowy / Aftpeak","DM - Rozcieńczania / Dilution","DHT - Double hull tanker","CAR - CAR | Samochód osobowy | Passenger car"]
["Departure","No","Nie","CMT - Centimetre","CMT - Centymetry","M3 - Cubic metre","M3 - Metry sześcienne","Passport","Female","Kobieta","INF2","IGC","X","Yes for some","Tak, część","Interim","Okresowy","RSO","SL2","II","Passenger","Pasażer","2 - Passenger movement : Embarking and/or disembarking of passengers.","CH - Ładownia / Cargo Hold","FM - Przepływowa / Flow through","SHT - Single hull tanker","COA - COACH | Autobus | Bus"]
[null,null,null,"CT - Carton","CT - Kartony","TNE - Metric ton","TNE - Tony","ResidentialPermit","Male","Mężczyzna","INF3","IBC","Y","Not intending","Nie zamierza",null,null,null,"SL3","III",null,null,"3 - Taking bunkers : Taking bunker (refuelling).","DB - Podwójny / Double Bottom","SM - Sekwencyjna / Sequential","SHT-SBT - Single hull with segregated ballast tanks (SBT)","CT - CAR + TRAILER | Samochód osobowy z przyczepą | Passenger car with trailer"]
[null,null,null,"FOT - Foot","FOT - Stopy",null,null,"PictureId",null,null,null,"MARPOL_ANNEX1","Z",null,null,null,null,null,null,null,null,null,"4 - Changing crew : Changing crew member(s).","FP - Dziobowy / Forepeak","T - Obróbka / Treatment",null,"LO - LORRY | Ciągnik siodłowy | Road tractor for semi-trailer"]
[null,null,null,"GRM - Gram","GRM - Gramy",null,null,"Other",null,null,null,"IMSBC","OS",null,null,null,null,null,null,null,null,null,"5 - Goodwill visit : Friendly visit.","TS - Szczytowy / Topside",null,null,"MBUS - BUS | Mini Bus | Mini Bus"]
[null,null,null,"KGM - Kilogram","KGM - Kilogramy",null,null,null,null,null,null,null,null,null,null,null,null,null,null,null,null,null,"6 - Taking supplies : Taking supplies.","WT - Burtowy / Wing",null,null,"MC - MOTORCYCLE | Motocykl | Motorbike"]
[null,null,null,"LTR - Litre","LTR - Litry",null,null,null,null,null,null,null,null,null,null,null,null,null,null,null,null,null,"7 - Repair : To effect repair.","O - Inny / Other",null,null,"TRL - TRAILER | Przyczepa/Naczepa | Trailer/semi-trailer"]
[null,null,null,"M3 - Cubic metre","M3 - Metry sześcienne",null,null,null,null,null,null,null,null,null,null,null,null,null,null,null,null,null,"8 - Laid-upInactive service.",null,null,null,"SE - LORRY + TRAILER | Zestaw ciężarowy – ciągnik z przyczepą/naczepą | Truck combination - road tractor with trailer/semi-trailer"]
[null,null,null,"MTR - Metre","MTR - Metry",null,null,null,null,null,null,null,null,null,null,null,null,null,null,null,null,null,"9 - Awaiting orders : Awaiting job order.",null,null,null,"SHO - TRUCK | Ciężarówka | Truck"]
[null,null,null,"NAR - Number of articles","NAR - Sztuki",null,null,null,null,null,null,null,null,null,null,null,null,null,null,null,null,null,"10 - Miscellaneous : Miscellaneous purpose of call.",null,null,null,"OTH - OTHER | Inne/pozostałe – czołg, ciągnik rolniczy itp | Other/other - tank, agricultural tractor, etc"]
[null,null,null,"TNE - Metric ton","TNE - Tony",null,null,null,null,null,null,null,null,null,null,null,null,null,null,null,null,null,"11 - Crew movement : Embarking and/or disembarking of crews."]
[null,null,null,null,null,null,null,null,null,null,null,null,null,null,null,null,null,null,null,null,null,null,"12 - Cruise, leisure and recreation : To visit a port for cruise, leisure and recreation."]
[null,null,null,null,null,null,null,null,null,null,null,null,null,null,null,null,null,null,null,null,null,null,"13 - Under government order : This is a visit to a port which has been ordered by government."]
[null,null,null,null,null,null,null,null,null,null,null,null,null,null,null,null,null,null,null,null,null,null,"14 - Quarantine inspection : To have a quarantine inspection."]
[null,null,null,null,null,null,null,null,null,null,null,null,null,null,null,null,null,null,null,null,null,null,"15 - Refuge : To seek protection against something unpleasant and/or threatening such as bad weather or danger."]
[null,null,null,null,null,null,null,null,null,null,null,null,null,null,null,null,null,null,null,null,null,null,"16 - Unloading cargo : Discharging of cargo from the means of transport."]
[null,null,null,null,null,null,null,null,null,null,null,null,null,null,null,null,null,null,null,null,null,null,"17 - Loading cargo : Loading of cargo onto the means of transport."]
[null,null,null,null,null,null,null,null,null,null,null,null,null,null,null,null,null,null,null,null,null,null,"18 - Repair in dry dock : Vessel to undergo repair in a dry dock."]
[null,null,null,null,null,null,null,null,null,null,null,null,null,null,null,null,null,null,null,null,null,null,"19 - Repair in wet dock : Repair of a vessel in a dock without removing the surrounding water."]
[null,null,null,null,null,null,null,null,null,null,null,null,null,null,null,null,null,null,null,null,null,null,"20 - Cargo tank cleaning : Cargo tanks of the means of transport will be cleaned."]
[null,null,null,null,null,null,null,null,null,null,null,null,null,null,null,null,null,null,null,null,null,null,"21 - Means of transport customs clearance : Means of transport will be customs cleared."]
[null,null,null,null,null,null,null,null,null,null,null,null,null,null,null,null,null,null,null,null,null,null,"22 - De-gassing : Means of transport will be de-gassed."]
[null,null,null,null,null,null,null,null,null,null,null,null,null,null,null,null,null,null,null,null,null,null,"23 - Waste disposal : Means of transport will dispose of her waste."]

{"sheet":"DangerousGood","index":3,"n_rows":4116,"n_cols":4,"rows_kept":4116,"cut":false,"hidden":true,"merged":[]}
["Słownik ładunków niebezpiecznych / Dangerous goods dictionary"]
["HazmatID / Packing group / Proper shipping name","Packing group","Marine Pollutant","EmS"]
["IBC_0000_10000/ /Triethylbenzene",null,"X"]
["IBC_0000_10041/ /Triethylenetetramine",null,"Y"]
["IBC_0000_10042/ /Triethyl phosphate",null,"Z"]
["IBC_0000_10043/ /Triethyl phosphite",null,"Z"]
["IBC_0000_10044/ /Triisopropanolamine",null,"Z"]
["IBC_0000_10045/ /Triisopropylated phenyl phosphates",null,"X"]
["IBC_0000_10046/ /Trimethylacetic acid",null,"Y"]
["IBC_0000_10047/ /Trimethylamine solution (30% or less)",null,"Z"]
["IBC_0000_10048/ /Trimethylbenzene (all isomers)",null,"X"]
["IBC_0000_10049/ /Trimethylol propane propoxylated",null,"Z"]
["IBC_0000_10050/ /2,2,4-Trimethyl-1,3-pentanediol diisobutyrate",null,"Y"]
["IBC_0000_10051/ /2,2,4-Trimethyl-1,3-pentanediol-1-isobutyrate",null,"Y"]
["IBC_0000_10052/ /1,3,5-Trioxane",null,"Y"]
["IBC_0000_10053/ /Tripropylene glycol",null,"Z"]
["IBC_0000_10054/ /Trixylyl phosphate",null,"X"]
["IBC_0000_10055/ /Tung oil",null,"Y"]
["IBC_0000_10056/ /Turpentine",null,"X"]
["IBC_0000_10057/ /Undecanoic acid",null,"Y"]
["IBC_0000_10058/ /1-Undecene",null,"X"]
["IBC_0000_10059/ /Undecyl alcohol",null,"X"]
["IBC_0000_10060/ /Urea/Ammonium nitrate solution",null,"Y"]
["IBC_0000_10082/ /Urea/Ammonium phosphate solution",null,"Y"]
["IBC_0000_10083/ /Urea solution",null,"Z"]
["IBC_0000_10084/ /Valeraldehyde (all isomers)",null,"Y"]
["IBC_0000_10085/ /Vegetable acid oils (m)",null,"Y"]
["IBC_0000_10086/ /Vegetable fatty acid distillates (m)",null,"Y"]
["IBC_0000_10087/ /Vinyl acetate",null,"Y"]
["IBC_0000_10088/ /Vinyl ethyl ether",null,"Z"]
["IBC_0000_10089/ /Vinylidene chloride",null,"Y"]
["IBC_0000_10090/ /Vinyl neodecanoate",null,"Y"]
["IBC_0000_10091/ /Vinyltoluene",null,"Y"]
["IBC_0000_10093/ /White spirit, low (15-20%) aromatic",null,"Y"]
["IBC_0000_10094/ /Wood lignin with sodium acetate/oxalate",null,"Z"]
["IBC_0000_10095/ /Xylenes",null,"Y"]
["IBC_0000_10096/ /Xylenes/ethylbenzene (10% or more) mixture",null,"Y"]
["IBC_0000_10097/ /Xylenol",null,"Y"]
["IBC_0000_10098/ /Zinc alkaryl dithiophosphate (C7-C16)",null,"Y"]
["IBC_0000_10099/ /Zinc alkenyl carboxamide",null,"Y"]
["IBC_0000_10100/ /Zinc alkyl dithiophosphate (C3-C14)",null,"Y"]
["IBC_0000_12481/ /(Polyisobutene) amino products in aliphatic hydrocarbons",null,"Y"]
["IBC_0000_12482/ /1-Dodecene",null,"Y"]
["IBC_0000_12483/ /2,6-Diaminohexanoic acid phosphonate mixed salts solution",null,"Z"]
["IBC_0000_12484/ /2-Butoxyethanol (58%)/Hyperbranched polyesteramide (42%) (mixture)",null,"Y"]
["IBC_0000_12485/ /2-Propene-1-aminium, N,N-dimethyl-N-2-propenyl-, chloride, homopolymer solution",null,"Y"]
["IBC_0000_12486/ /Acid oil mixture from soya bean, corn (maize) and sunflower oil refining",null,"Y"]
["IBC_0000_12487/ /Acrylic acid/ethenesulphonic acid copolymer with phosphonate groups, sodium salt solution",null,"Z"]
["IBC_0000_12488/ /Alcohol (C10-C18) poly(7) ethoxylate",null,"Y"]
["IBC_0000_12489/ /Alcohol (C12-C16) poly(1-6) ethoxylates",null,"Y"]
["IBC_0000_12490/ /Alcohol (C12-C16) poly(20+) ethoxylates",null,"Y"]
["IBC_0000_12491/ /Alcohol (C12-C16) poly(7-19) ethoxylates",null,"Y"]
["IBC_0000_12492/ /Alcohol (C6-C17) (secondary) poly(3-6) ethoxylates",null,"Y"]
["IBC_0000_12493/ /Alcohol (C6-C17) (secondary) poly(7-12) ethoxylates",null,"Y"]
["IBC_0000_12494/ /Alkyl (C10-C15, C12 rich) phenol poly (4-12) ethoxylate",null,"Y"]
["IBC_0000_12495/ /Alkyl (C10-C20, saturated and unsaturated) phosphite",null,"Y"]
["IBC_0000_12496/ /Alkyl (C12-C16) propoxyamine ethoxylate",null,"X"]
["IBC_0000_12497/ /Alkyl (C18-C28) toluenesulphonic acid",null,"Y"]
["IBC_0000_12498/ /Alkyl (C18-C28) toluenesulphonic acid, calcium salts, borated",null,"Y"]
["IBC_0000_12499/ /Alkyl (C18-C28) toluenesulphonic acid, calcium salts, low overbase",null,"Y"]
["IBC_0000_12500/ /Alkyl (C7-C11)phenol poly(4-12) ethoxylate",null,"Y"]
["IBC_0000_12501/ /Alkyl (C8-C10)/(C12-C14):(40% or less/60% or more) polyglucoside solution (55% or less)",null,"Y"]
["IBC_0000_12502/ /Alkyl (C8-C10)/(C12-C14):(50%/50%) polyglucoside solution (55% or less)",null,"Y"]
["IBC_0000_12503/ /Alkyl (C8-C10)/(C12-C14):(60% or more/40% or less) polyglucoside solution(55% or less)",null,"Y"]
["IBC_0000_12504/ /Alkyl (C9+)benzenes",null,"Y"]
["IBC_0000_12505/ /Alkyl acrylate/vinylpyridine copolymer in toluene",null,"Y"]
["IBC_0000_12506/ /Alkyl/cyclo (C4-C5) alcohols",null,"Y"]
["IBC_0000_12507/ /Alkylaryl phosphate mixtures (more than 40% Diphenyl tolyl phosphate, less than 0.02% ortho-isomers)",null,"X"]
["IBC_0000_12508/ /Alkylbenzene mixtures (containing at least 50% of toluene)",null,"Y"]
["IBC_0000_12509/ /Alkylbenzenes mixtures (containing naphthalene)",null,"X"]
["IBC_0000_12510/ /Aluminium hydroxide, sodium hydroxide, sodium carbonate solution (40% or less)",null,"Y"]
["IBC_0000_12511/ /Ammonium nitrate solution (93% or less) (*)",null,"Z"]
["IBC_0000_12512/ /Ammonium sulphide solution (45% or less) (*)",null,"Y"]
["IBC_0000_12513/ /Bis (2-ethylhexyl) terephthalate",null,"Y"]
["IBC_0000_12514/ /Calcium long-chain alkyl (C11-C40) phenate",null,"Y"]
["IBC_0000_12515/ /Calcium long-chain alkyl (C18-C28) salicylate",null,"Y"]
["IBC_0000_12516/ /Calcium long-chain alkyl (C5-C10) phenate",null,"Y"]
["IBC_0000_12517/ /Calcium nitrate solution (50% or less)",null,"Z"]
["IBC_0000_12518/ /Camelina oil",null,"Y"]
["IBC_0000_12519/ /Chlorinated paraffins (C14-C17) (with 50% chlorine or more, and less than 1% C13 or shorter chains)",null,"X"]
["IBC_0000_12520/ /Coal tar pitch (molten) (*)",null,"X"]
["IBC_0000_12521/ /Copper salt of long chain (C17+) alkanoic acid",null,"Y"]
["IBC_0000_12522/ /Cresol/Phenol/Xylenol mixture",null,"Y"]
["IBC_0000_12523/ /Cyclohexane oxidation products, sodium salts solution",null,"Z"]
["IBC_0000_12524/ /Cyclohexane-1,2-dicarboxylic acid, diisononyl ester",null,"Y"]
["IBC_0000_12525/ /Dialkyl (C9-C10) phthalates",null,"Y"]
["IBC_0000_12526/ /Diethyl ether (*)",null,"Z"]
["IBC_0000_12527/ /Diethylene glycol",null,"Z"]
["IBC_0000_12528/ /Drilling brines (containing calcium bromide)",null,"Z"]
["IBC_0000_12529/ /Drilling brines (containing zinc chloride)",null,"X"]
["IBC_0000_12530/ /Ethoxylated tallow amine (>95%)",null,"X"]
["IBC_0000_12531/ /Ethylamine (*)",null,"Y"]
["IBC_0000_12532/ /Ethylene carbonate",null,"Z"]
["IBC_0000_12533/ /Ethylene glycol (>75%)/sodium alkyl carboxylates/borax mixture",null,"Y"]
["IBC_0000_12534/ /Ethylene glycol (>85%)/sodium alkyl carboxylates mixture",null,"Z"]
["IBC_0000_12535/ /Ethylene oxide/Propylene oxide mixture with an ethylene oxide content of not more than 30% by mass",null,"Y"]
["IBC_0000_12536/ /Fish protein concentrate (containing 4% or less formic acid)",null,"Z"]
["IBC_0000_12537/ /Fish silage protein concentrate (containing 4% or less formic acid)",null,"Y"]
["IBC_0000_12538/ /Fluorosilicic acid solution (20-30%)",null,"Y"]
["IBC_0000_12539/ /Formic acid mixture (containing up to 18% propionic acid and up to 25% sodium formate)",null,"Z"]
["IBC_0000_12540/ /Glucitol/glycerol blend propoxylated (containing 10% or more amines)",null,"Y"]
["IBC_0000_12541/ /Glucitol/glycerol blend propoxylated (containing less than 10% amines)",null,"Z"]
["IBC_0000_12542/ /Glycerine",null,"Z"]
["IBC_0000_12543/ /Glyoxylic acid solution (50% or less)",null,"Y"]
["IBC_0000_12544/ /Glyphosate solution (not containing surfactant)",null,"Y"]
["IBC_0000_12545/ /Grape Seed Oil",null,"Y"]
["IBC_0000_12546/ /Hexamethylenetetramine solutions",null,"Z"]
["IBC_0000_12547/ /Hexylene glycol",null,"Z"]
["IBC_0000_12548/ /Hydrocarbon wax",null,"X"]
["IBC_0000_12549/ /Hydrochloric acid (*)",null,"Z"]
["IBC_0000_12550/ /Long-chain alkylphenol (C14-C18)",null,"Y"]
["IBC_0000_12551/ /Long-chain alkylphenol (C18-C30)",null,"Y"]
["IBC_0000_12552/ /Magnesium hydroxide slurry",null,"Z"]
["IBC_0000_12553/ /Maleic anhydride-sodium allylsulphonate copolymer solution",null,"Z"]
["IBC_0000_12554/ /Methacrylic acid - alkoxypoly (alkylene oxide) methacrylate copolymer, sodium salt aqueous solution (45% or less)",null,"Z"]
["IBC_0000_12555/ /Methyl alcohol (*)",null,"Y"]
["IBC_0000_12556/ /Methyl propyl ketone",null,"Z"]
["IBC_0000_12557/ /Molybdenum polysulphide long chain alkyl dithiocarbamide complex",null,"Y"]
["IBC_0000_12558/ /Motor fuel anti-knock compound (containing lead alkyls)",null,"X"]
["IBC_0000_12559/ /n-Alkanes (C10 – C20)",null,"Y"]
["IBC_0000_12560/ /n-Alkanes (C9-C11)",null,"Y"]
["IBC_0000_12561/ /Naphthalene crude (molten)",null,"Y"]
["IBC_0000_12562/ /n-Dodecyl mercaptan",null,"X"]
["IBC_0000_12563/ /Nitroethane (80%)/ Nitropropane(20%)",null,"Y"]
["IBC_0000_12564/ /N-Methylglucamine solution (70% or less)",null,"Z"]
["IBC_0000_12565/ /n-Octyl mercaptan",null,"X"]
["IBC_0000_12566/ /Noxious liquid, F, (10) n.o.s. (trade name ...., contains ....) ST3, Cat. Z",null,"Z"]
["IBC_0000_12567/ /Noxious liquid, F, (2) n.o.s. (trade name ...., contains ....) ST1, Cat. X",null,"X"]
["IBC_0000_12568/ /Noxious liquid, F, (4) n.o.s. (trade name ...., contains ....) ST2, Cat. X",null,"X"]
["IBC_0000_12569/ /Noxious liquid, F, (6) n.o.s. (trade name ...., contains ....) ST2, Cat. Y",null,"Y"]
["IBC_0000_12570/ /Noxious liquid, F, (8) n.o.s. (trade name ...., contains ....) ST3, Cat. Y",null,"Y"]
["IBC_0000_12571/ /Noxious liquid, NF, (1) n.o.s. (trade name ...., contains ....) ST1, Cat. X",null,"X"]
["IBC_0000_12572/ /Noxious liquid, NF, (3) n.o.s. (trade name ...., contains ....) ST2, Cat. X",null,"X"]
["IBC_0000_12573/ /Noxious liquid, NF, (5) n.o.s. (trade name ...., contains ....) ST2, Cat. Y",null,"Y"]
["IBC_0000_12574/ /Noxious liquid, NF, (7) n.o.s. (trade name ...., contains ....) ST3, Cat. Y",null,"Y"]
["IBC_0000_12575/ /Noxious liquid, NF, (9) n.o.s. (trade name ...., contains ....) ST3, Cat. Z",null,"Z"]
["IBC_0000_12576/ /Offshore contaminated bulk liquid P (o)",null,"X"]
["IBC_0000_12577/ /Offshore contaminated bulk liquid S (o)",null,"X"]
["IBC_0000_12578/ /Paraffin wax, highly-refined",null,"Y"]
["IBC_0000_12579/ /Paraffin wax, semi-refined",null,"X"]
["IBC_0000_12580/ /Phosphorus, yellow or white (*)",null,"X"]
["IBC_0000_12581/ /Piperazine, 68% solution",null,"Y"]
["IBC_0000_12582/ /Poly(4+)isobutylene (MW>224)",null,"X"]
["IBC_0000_12583/ /Polyaluminium chloride solution",null,"Z"]
["IBC_0000_12584/ /Polyglycerin, sodium salt solution (containing less than 3% sodium hydroxide)",null,"Z"]
["IBC_0000_12585/ /Polyisobutylene (MW≤224)",null,"Y"]
["IBC_0000_12586/ /Potassium formate solutions (*)",null,"Z"]
["IBC_0000_12587/ /Potassium hydroxide solution (*)",null,"Y"]
["IBC_0000_12588/ /Propylene carbonate",null,"Z"]
["IBC_0000_12589/ /Pyrolysis gasoline (containing benzene)",null,"Y"]
["IBC_0000_12590/ /Rapeseed oil (low erucic acid containing less than 4% free fatty acids)",null,"Y"]
["IBC_0000_12591/ /Sodium borohydride (15% or less)/Sodium hydroxide solution (*)",null,"Y"]
["IBC_0000_12592/ /Sodium carbonate solution (*)",null,"Z"]
["IBC_0000_12593/ /Sodium chlorate solution (50% or less) (*)",null,"Z"]
["IBC_0000_12594/ /Sodium hydrogen sulphide (6% or less)/Sodium carbonate (3% or less) solution",null,"Z"]
["IBC_0000_12595/ /Sodium hydrosulphide solution (45% or less) (*)",null,"Z"]
["IBC_0000_12596/ /Sodium hydrosulphide/Ammonium sulphide solution (*)",null,"Y"]
["IBC_0000_12597/ /Sodium hydroxide solution (*)",null,"Y"]
["IBC_0000_12598/ /Sodium methylate 21-30% in methyl alcohol",null,"Y"]
["IBC_0000_12599/ /Sodium sulphate solutions",null,"Z"]
["IBC_0000_12600/ /Soybean Oil Fatty Acid Methyl Ester",null,"Y"]
["IBC_0000_12601/ /Sulphur (molten) (*)",null,"Z"]
["IBC_0000_12602/ /Tall oil soap, crude",null,"Y"]
["IBC_0000_12603/ /tert-Amyl ethyl ether",null,"Z"]
["IBC_0000_12604/ /Tricresyl phosphate (containing 1% or more ortho-isomer)",null,"Y"]
["IBC_0000_12605/ /Tricresyl phosphate (containing less than 1% ortho-isomer)",null,"Y"]
["IBC_0000_12606/ /Used cooking oil (m)",null,"X"]
["IBC_0000_12607/ /Used cooking oil (Triglycerides, C16-C18 and C18 unsaturated) (m) (n)",null,"Y"]
["IBC_0000_12608/ /Vegetable oil mixtures, containing less than 15% free fatty acid (m)",null,"Y"]
["IBC_0000_8429/ /Acetic acid",null,"Z"]
["IBC_0000_8430/ /Acetic anhydride",null,"Z"]
["IBC_0000_8431/ /Acetochlor",null,"X"]
["IBC_0000_8432/ /Acetone cyanohydrin",null,"Y"]
["IBC_0000_8433/ /Acetonitrile",null,"Z"]
["IBC_0000_8434/ /Acetonitrile (Low purity grade)",null,"Y"]
["IBC_0000_8436/ /Acrylamide solution (50% or less)",null,"Y"]
["IBC_0000_8437/ /Acrylic acid",null,"Y"]
["IBC_0000_8438/ /Acrylonitrile",null,"Y"]
["IBC_0000_8439/ /Acrylonitrile-Styrene copolymer dispersion in polyether polyol",null,"Y"]
["IBC_0000_8440/ /Adiponitrile",null,"Z"]
["IBC_0000_8441/ /Alachlor technical (90% or more)",null,"X"]
["IBC_0000_8442/ /Alcohol (C9-C11) poly (2.5-9) ethoxylate",null,"Y"]
["IBC_0000_8448/ /Alcohols (C13+)",null,"Y"]
["IBC_0000_8449/ /Alcohols (C12+), primary, linear",null,"Y"]
["IBC_0000_8450/ /Alcohols (C8-C11), primary, linear and essentially linear",null,"Y"]
["IBC_0000_8451/ /Alcohols (C12-C13), primary, linear and essentially linear",null,"Y"]
["IBC_0000_8452/ /Alcohols (C14-C18), primary, linear and essentially linear",null,"Y"]
["IBC_0000_8453/ /Alkanes (C6-C9)",null,"X"]
["IBC_0000_8454/ /Iso- and cyclo-alkanes (C10-C11)",null,"Y"]
["IBC_0000_8455/ /Iso- and cyclo-alkanes (C12+)",null,"Y"]
["IBC_0000_8458/ /Alkaryl polyethers (C9-C20)",null,"Y"]
["IBC_0000_8459/ /Alkenoic acid, polyhydroxy ester borated",null,"Y"]
["IBC_0000_8460/ /Alkenyl (C11+) amide",null,"X"]
["IBC_0000_8461/ /Alkenyl (C16-C20) succinic anhydride",null,"Z"]
["IBC_0000_8464/ /Alkylated (C4-C9) hindered phenols",null,"Y"]
["IBC_0000_8465/ /Alkylbenzene, alkylindane, alkylindene mixture (each C12-C17)",null,"Z"]
["IBC_0000_8466/ /Alkyl benzene distillation bottoms",null,"Y"]
["IBC_0000_8468/ /Alkyl (C3-C4) benzenes",null,"Y"]
["IBC_0000_8469/ /Alkyl (C5-C8) benzenes",null,"X"]
["IBC_0000_8471/ /Alkyl (C11-C17) benzene sulphonic acid",null,"Y"]
["IBC_0000_8472/ /Alkylbenzene sulphonic acid, sodium salt solution",null,"Y"]
["IBC_0000_8473/ /Alkyl (C12+) dimethylamine",null,"X"]
["IBC_0000_8474/ /Alkyl dithiocarbamate (C19-C35)",null,"Y"]
["IBC_0000_8475/ /Alkyldithiothiadiazole (C6-C24)",null,"Y"]
["IBC_0000_8476/ /Alkyl ester copolymer (C4-C20)",null,"Y"]
["IBC_0000_8479/ /Alkyl (C7-C9) nitrates",null,"Y"]
["IBC_0000_8481/ /Alkyl (C8-C40) phenol sulphide",null,"Z"]
["IBC_0000_8482/ /Alkyl (C8-C9) phenylamine in aromatic solvents",null,"Y"]
["IBC_0000_8483/ /Alkyl (C9-C15) phenyl propoxylate",null,"Z"]
["IBC_0000_8484/ /Alkyl (C8-C10) polyglucoside solution (65% or less)",null,"Y"]
["IBC_0000_8486/ /Alkyl (C12-C14) polyglucoside solution (55% or less)",null,"Y"]
["IBC_0000_8489/ /Alkyl sulphonic acid ester of phenol",null,"Y"]
["IBC_0000_8490/ /Alkyl (C18+) toluenes",null,"Y"]
["IBC_0000_8494/ /Alkyl (C18-C28) toluenesulphonic acid, calcium salts, high overbase",null,"Y"]
["IBC_0000_8495/ /Allyl alcohol",null,"Y"]
["IBC_0000_8496/ /Allyl chloride",null,"Y"]
["IBC_0000_8497/ /Aluminium chloride/Hydrogen chloride solution",null,"Y"]
["IBC_0000_8498/ /Aluminium sulphate solution",null,"Y"]
["IBC_0000_8499/ /2-(2-Aminoethoxy) ethanol",null,"Z"]
["IBC_0000_8500/ /Aminoethyldiethanolamine/Aminoethylethanolamine solution",null,"Z"]
["IBC_0000_8501/ /Aminoethyl ethanolamine",null,"Z"]
["IBC_0000_8502/ /N-Aminoethylpiperazine",null,"Z"]
["IBC_0000_8503/ /2-Amino-2-methyl-1-propanol",null,"Z"]
["IBC_0000_8504/ /Ammonia aqueous (28% or less)",null,"Y"]
["IBC_0000_8505/ /Ammonium chloride solution (less than 25%) (*)",null,"Z"]
["IBC_0000_8506/ /Ammonium hydrogen phosphate solution",null,"Z"]
["IBC_0000_8507/ /Ammonium lignosulphonate solutions",null,"Z"]
["IBC_0000_8509/ /Ammonium polyphosphate solution",null,"Z"]
["IBC_0000_8510/ /Ammonium sulphate solution",null,"Z"]
["IBC_0000_8512/ /Ammonium thiosulphate solution (60% or less)",null,"Z"]
["IBC_0000_8513/ /Amyl acetate (all isomers)",null,"Y"]
["IBC_0000_8514/ /n-Amyl alcohol",null,"Z"]
["IBC_0000_8515/ /Amyl alcohol, primary",null,"Z"]
["IBC_0000_8516/ /sec-Amyl alcohol",null,"Z"]
["IBC_0000_8517/ /tert-Amyl alcohol",null,"Z"]
["IBC_0000_8518/ /tert-Amyl methyl ether",null,"X"]
["IBC_0000_8519/ /Aniline",null,"Y"]
["IBC_0000_8520/ /Aryl polyolefins (C11-C50)",null,"Y"]
["IBC_0000_8521/ /Aviation alkylates (C8 paraffins and iso-paraffins BPT 95 - 120°C)",null,"X"]
["IBC_0000_8522/ /Barium long chain (C11-C50) alkaryl sulphonate",null,"Y"]
["IBC_0000_8523/ /Benzene and mixtures having 10% benzene or more (i)",null,"Y"]
["IBC_0000_8524/ /Benzene sulphonyl chloride",null,"Y"]
["IBC_0000_8525/ /Benzenetricarboxylic acid, trioctyl ester",null,"Y"]
["IBC_0000_8526/ /Benzyl acetate",null,"Y"]
["IBC_0000_8527/ /Benzyl alcohol",null,"Y"]
["IBC_0000_8528/ /Benzyl chloride",null,"Y"]
["IBC_0000_8531/ /Bio-fuel blends of Diesel/gas oil and FAME (>25% but <99% by volume)",null,"X"]
["IBC_0000_8532/ /Bio-fuel blends of Diesel/gas oil and vegetable oil (>25% but <99% by volume)",null,"X"]
["IBC_0000_8533/ /Bio-fuel blends of Gasoline and Ethyl alcohol (>25% but <99% by volume)",null,"X"]
["IBC_0000_8534/ /Brake fluid base mix: Poly(2-8)alkylene (C2-C3) glycols/Polyalkylene (C2-C10) glycols monoalkyl (C1-C4) ethers and their borate esters",null,"Z"]
["IBC_0000_8535/ /Bromochloromethane",null,"Z"]
["IBC_0000_8536/ /Butene oligomer",null,"X"]
["IBC_0000_8537/ /Butyl acetate (all isomers)",null,"Y"]
["IBC_0000_8538/ /Butyl acrylate (all isomers)",null,"Y"]
["IBC_0000_8539/ /tert-Butyl alcohol",null,"Z"]
["IBC_0000_8540/ /Butylamine (all isomers)",null,"Y"]
["IBC_0000_8541/ /Butylbenzene (all isomers)",null,"X"]
["IBC_0000_8542/ /Butyl benzyl phthalate",null,"X"]
["IBC_0000_8543/ /Butyl butyrate (all isomers)",null,"Y"]
["IBC_0000_8544/ /Butyl/Decyl/Cetyl/Eicosyl methacrylate mixture",null,"Y"]
["IBC_0000_8545/ /Butylene glycol",null,"Z"]
["IBC_0000_8546/ /1,2-Butylene oxide",null,"Y"]
["IBC_0000_8547/ /n-Butyl ether",null,"Y"]
["IBC_0000_8548/ /Butyl methacrylate",null,"Z"]
["IBC_0000_8549/ /n-Butyl propionate",null,"Y"]
["IBC_0000_8550/ /Butyraldehyde (all isomers)",null,"Y"]
["IBC_0000_8551/ /Butyric acid",null,"Y"]
["IBC_0000_8552/ /gamma-Butyrolactone",null,"Y"]
["IBC_0000_8553/ /Calcium alkaryl sulphonate (C11-C50)",null,"Z"]
["IBC_0000_8554/ /Calcium alkyl (C10-C28) salicylate",null,"Y"]
["IBC_0000_8555/ /Calcium hydroxide slurry",null,"Y"]
["IBC_0000_8556/ /Calcium hypochlorite solution (15% or less)",null,"Y"]
["IBC_0000_8557/ /Calcium hypochlorite solution (more than 15%)",null,"X"]
["IBC_0000_8558/ /Calcium lignosulphonate solutions",null,"Z"]
["IBC_0000_8561/ /Calcium long-chain alkyl phenate sulphide (C8-C40)",null,"Y"]
["IBC_0000_8562/ /Calcium long-chain alkyl salicylate (C13+)",null,"Y"]
["IBC_0000_8564/ /Calcium nitrate/Magnesium nitrate/Potassium chloride solution",null,"Z"]
["IBC_0000_8565/ /epsilon-Caprolactam (molten or aqueous solutions)",null,"Z"]
["IBC_0000_8566/ /Carbolic oil",null,"Y"]
["IBC_0000_8567/ /Carbon disulphide",null,"Y"]
["IBC_0000_8568/ /Carbon tetrachloride",null,"Y"]
["IBC_0000_8569/ /Cashew nut shell oil (untreated)",null,"Y"]
["IBC_0000_8570/ /Castor oil",null,"Y"]
["IBC_0000_8571/ /Cesium formate solution (*)",null,"Y"]
["IBC_0000_8572/ /Cetyl/Eicosyl methacrylate mixture",null,"Y"]
["IBC_0000_8573/ /Chlorinated paraffins (C10-C13)",null,"X"]
["IBC_0000_8575/ /Chloroacetic acid (80% or less)",null,"Y"]
["IBC_0000_8576/ /Chlorobenzene",null,"Y"]
["IBC_0000_8577/ /Chloroform",null,"Y"]
["IBC_0000_8578/ /Chlorohydrins (crude)",null,"Y"]
["IBC_0000_8579/ /4-Chloro-2-methylphenoxyacetic acid, dimethylamine salt solution",null,"Y"]
["IBC_0000_8580/ /o-Chloronitrobenzene",null,"Y"]
["IBC_0000_8581/ /1-(4-Chlorophenyl)-4,4- dimethyl-pentan-3-one",null,"Y"]
["IBC_0000_8582/ /2- or 3-Chloropropionic acid",null,"Z"]
["IBC_0000_8583/ /Chlorosulphonic acid",null,"Y"]
["IBC_0000_8584/ /m-Chlorotoluene",null,"Y"]
["IBC_0000_8585/ /o-Chlorotoluene",null,"Y"]
["IBC_0000_8586/ /p-Chlorotoluene",null,"Y"]
["IBC_0000_8587/ /Chlorotoluenes (mixed isomers)",null,"Y"]
["IBC_0000_8588/ /Choline chloride solutions",null,"Z"]
["IBC_0000_8589/ /Citric acid (70% or less)",null,"Z"]
["IBC_0000_8590/ /Coal tar",null,"X"]
["IBC_0000_8591/ /Coal tar naphtha solvent",null,"Y"]
["IBC_0000_8593/ /Cocoa butter",null,"Y"]
["IBC_0000_8594/ /Coconut oil",null,"Y"]
["IBC_0000_8595/ /Coconut oil fatty acid",null,"Y"]
["IBC_0000_8596/ /Coconut oil fatty acid methyl ester",null,"Y"]
["IBC_0000_8598/ /Corn Oil",null,"Y"]
["IBC_0000_8599/ /Cotton seed oil",null,"Y"]
["IBC_0000_8600/ /Creosote (coal tar)",null,"X"]
["IBC_0000_8601/ /Cresols (all isomers)",null,"Y"]
["IBC_0000_8602/ /Cresylic acid, dephenolized",null,"Y"]
["IBC_0000_8603/ /Cresylic acid, sodium salt solution",null,"Y"]
["IBC_0000_8604/ /Crotonaldehyde",null,"X"]
["IBC_0000_8605/ /1,5,9-Cyclododecatriene",null,"X"]
["IBC_0000_8606/ /Cycloheptane",null,"X"]
["IBC_0000_8607/ /Cyclohexane",null,"Y"]
["IBC_0000_8608/ /Cyclohexanol",null,"Y"]
["IBC_0000_8609/ /Cyclohexanone",null,"Z"]
["IBC_0000_8610/ /Cyclohexanone, Cyclohexanol mixture",null,"Y"]
["IBC_0000_8611/ /Cyclohexyl acetate",null,"Y"]
["IBC_0000_8612/ /Cyclohexylamine",null,"Y"]
["IBC_0000_8613/ /1,3-Cyclopentadiene dimer (molten)",null,"Y"]
["IBC_0000_8614/ /Cyclopentane",null,"Y"]
["IBC_0000_8615/ /Cyclopentene",null,"Y"]
["IBC_0000_8616/ /p-Cymene",null,"Y"]
["IBC_0000_8617/ /Decahydronaphthalene",null,"Y"]
["IBC_0000_8618/ /Decanoic acid",null,"X"]
["IBC_0000_8619/ /Decene",null,"X"]
["IBC_0000_8620/ /Decyl acrylate",null,"X"]
["IBC_0000_8621/ /Decyl alcohol (all isomers)",null,"Y"]
["IBC_0000_8622/ /Decyl/Dodecyl/Tetradecyl alcohol mixture",null,"Y"]
["IBC_0000_8623/ /Decyloxytetrahydrothiophene dioxide",null,"X"]
["IBC_0000_8624/ /Diacetone alcohol",null,"Z"]
["IBC_0000_8625/ /Dialkyl (C8-C9) diphenylamines",null,"Z"]
["IBC_0000_8626/ /Dialkyl (C7-C13) phthalates",null,"X"]
["IBC_0000_8628/ /Dialkyl thiophosphates sodium salts solution",null,"Y"]
["IBC_0000_8629/ /Dibromomethane",null,"Y"]
["IBC_0000_8630/ /Dibutylamine",null,"Y"]
["IBC_0000_8631/ /Dibutyl hydrogen phosphonate",null,"Y"]
["IBC_0000_8632/ /2,6-Di-tert-butylphenol",null,"X"]
["IBC_0000_8633/ /Dibutyl phthalate",null,"X"]
["IBC_0000_8634/ /Dibutyl terephthalate",null,"Y"]
["IBC_0000_8635/ /Dichlorobenzene (all isomers)",null,"X"]
["IBC_0000_8636/ /3,4-Dichloro-1-butene",null,"Y"]
["IBC_0000_8637/ /1,1-Dichloroethane",null,"Z"]
["IBC_0000_8638/ /Dichloroethyl ether",null,"Y"]
["IBC_0000_8639/ /1,6-Dichlorohexane",null,"Y"]
["IBC_0000_8640/ /2,2'-Dichloroisopropyl ether",null,"Y"]
["IBC_0000_8641/ /Dichloromethane",null,"Y"]
["IBC_0000_8642/ /2,4-Dichlorophenol",null,"Y"]
["IBC_0000_8643/ /2,4-Dichlorophenoxyacetic acid, diethanolamine salt solution",null,"Y"]
["IBC_0000_8644/ /2,4-Dichlorophenoxyacetic acid, dimethylamine salt solution (70% or less)",null,"Y"]
["IBC_0000_8645/ /2,4-Dichlorophenoxyacetic acid, triisopropanolamine salt solution",null,"Y"]
["IBC_0000_8646/ /1,1-Dichloropropane",null,"Y"]
["IBC_0000_8647/ /1,2-Dichloropropane",null,"Y"]
["IBC_0000_8648/ /1,3-Dichloropropene",null,"X"]
["IBC_0000_8649/ /Dichloropropene/Dichloropropane mixtures",null,"X"]
["IBC_0000_8650/ /2,2-Dichloropropionic acid",null,"Y"]
["IBC_0000_8651/ /Dicyclopentadiene, Resin Grade, 81-89%",null,"Y"]
["IBC_0000_8652/ /Diethanolamine",null,"Y"]
["IBC_0000_8653/ /Diethylamine",null,"Y"]
["IBC_0000_8654/ /Diethylaminoethanol",null,"Y"]
["IBC_0000_8655/ /2,6-Diethylaniline",null,"Y"]
["IBC_0000_8656/ /Diethylbenzene",null,"Y"]
["IBC_0000_8657/ /Diethylene glycol dibutyl ether",null,"Z"]
["IBC_0000_8658/ /Diethylene glycol diethyl ether",null,"Z"]
["IBC_0000_8659/ /Diethylene glycol phthalate",null,"Y"]
["IBC_0000_8660/ /Diethylenetriamine",null,"Y"]
["IBC_0000_8661/ /Diethylenetriaminepentaacetic acid, pentasodium salt solution",null,"Z"]
["IBC_0000_8663/ /Di-(2-ethylhexyl) adipate",null,"Y"]
["IBC_0000_8664/ /Di-(2-ethylhexyl) phosphoric acid",null,"Y"]
["IBC_0000_8665/ /Diethyl phthalate",null,"Y"]
["IBC_0000_8666/ /Diethyl sulphate",null,"Y"]
["IBC_0000_8667/ /Diglycidyl ether of bisphenol A",null,"X"]
["IBC_0000_8668/ /Diglycidyl ether of bisphenol F",null,"Y"]
["IBC_0000_8669/ /Diheptyl phthalate",null,"Y"]
["IBC_0000_8670/ /Di-n-hexyl adipate",null,"X"]
["IBC_0000_8671/ /Dihexyl phthalate",null,"Y"]
["IBC_0000_8672/ /Diisobutylamine",null,"Y"]
["IBC_0000_8673/ /Diisobutylene",null,"Y"]
["IBC_0000_8674/ /Diisobutyl ketone",null,"Y"]
["IBC_0000_8675/ /Diisobutyl phthalate",null,"X"]
["IBC_0000_8676/ /Diisononyl adipate",null,"Y"]
["IBC_0000_8677/ /Diisooctyl phthalate",null,"Y"]
["IBC_0000_8678/ /Diisopropanolamine",null,"Z"]
["IBC_0000_8679/ /Diisopropylamine",null,"Y"]
["IBC_0000_8680/ /Diisopropylbenzene (all isomers)",null,"X"]
["IBC_0000_8681/ /Diisopropylnaphthalene",null,"Y"]
["IBC_0000_8682/ /N,N-Dimethylacetamide",null,"Z"]
["IBC_0000_8683/ /N,N-Dimethylacetamide solution (40% or less)",null,"Z"]
["IBC_0000_8684/ /Dimethyl adipate",null,"Y"]
["IBC_0000_8685/ /Dimethylamine solution (45% or less)",null,"Y"]
["IBC_0000_8686/ /Dimethylamine solution (greater than 45% but not greater than 55%)",null,"Y"]
["IBC_0000_8687/ /Dimethylamine solution (greater than 55% but not greater than 65%)",null,"Y"]
["IBC_0000_8688/ /N,N-Dimethylcyclohexylamine",null,"Y"]
["IBC_0000_8689/ /Dimethyl disulphide",null,"Y"]
["IBC_0000_8690/ /N,N-Dimethyldodecylamine",null,"Y"]
["IBC_0000_8691/ /Dimethylethanolamine",null,"Y"]
["IBC_0000_8692/ /Dimethylformamide",null,"Y"]
["IBC_0000_8693/ /Dimethyl glutarate",null,"Y"]
["IBC_0000_8694/ /Dimethyl hydrogen phosphite",null,"Y"]
["IBC_0000_8695/ /Dimethyl octanoic acid",null,"Y"]
["IBC_0000_8696/ /Dimethyl phthalate",null,"Y"]
["IBC_0000_8697/ /Dimethylpolysiloxane",null,"Y"]
["IBC_0000_8698/ /2,2-Dimethylpropane-1,3-diol (molten or solution)",null,"Z"]
["IBC_0000_8699/ /Dimethyl succinate",null,"Y"]
["IBC_0000_8700/ /Dinitrotoluene (molten)",null,"X"]
["IBC_0000_8741/ /Dinonyl phthalate",null,"Y"]
["IBC_0000_8742/ /Dioctyl phthalate",null,"Y"]
["IBC_0000_8743/ /1,4-Dioxane",null,"Y"]
["IBC_0000_8744/ /Dipentene",null,"Y"]
["IBC_0000_8745/ /Diphenyl",null,"X"]
["IBC_0000_8746/ /Diphenylamine (molten)",null,"Y"]
["IBC_0000_8747/ /Diphenylamine, reaction product with 2,2,4-Trimethylpentene",null,"Y"]
["IBC_0000_8748/ /Diphenylamines, alkylated",null,"Y"]
["IBC_0000_8749/ /Diphenyl/Diphenyl ether mixtures",null,"X"]
["IBC_0000_8750/ /Diphenyl ether",null,"X"]
["IBC_0000_8751/ /Diphenyl ether/Diphenyl phenyl ether mixture",null,"X"]
["IBC_0000_8752/ /Diphenylmethane diisocyanate",null,"Y"]
["IBC_0000_8753/ /Diphenylol propane-epichlorohydrin resins",null,"X"]
["IBC_0000_8754/ /Di-n-propylamine",null,"Y"]
["IBC_0000_8755/ /Dipropylene glycol",null,"Z"]
["IBC_0000_8756/ /Dithiocarbamate ester (C7-C35)",null,"X"]
["IBC_0000_8757/ /Ditridecyl adipate",null,"Y"]
["IBC_0000_8758/ /Ditridecyl phthalate",null,"Y"]
["IBC_0000_8759/ /Diundecyl phthalate",null,"Y"]
["IBC_0000_8760/ /Dodecane (all isomers)",null,"Y"]
["IBC_0000_8801/ /tert-Dodecanethiol",null,"Y"]
["IBC_0000_8802/ /Dodecene (all isomers)",null,"X"]
["IBC_0000_8803/ /Dodecyl alcohol",null,"Y"]
["IBC_0000_8804/ /Dodecylamine/Tetradecylamine mixture",null,"Y"]
["IBC_0000_8805/ /Dodecylbenzene",null,"Y"]
["IBC_0000_8806/ /Dodecyl diphenyl ether disulphonate solution",null,"X"]
["IBC_0000_8807/ /Dodecyl hydroxypropyl sulphide",null,"X"]
["IBC_0000_8808/ /Dodecyl methacrylate",null,"Y"]
["IBC_0000_8809/ /Dodecyl/Octadecyl methacrylate mixture",null,"Y"]
["IBC_0000_8810/ /Dodecyl/Pentadecyl methacrylate mixture",null,"Y"]
["IBC_0000_8811/ /Dodecyl phenol",null,"X"]
["IBC_0000_8812/ /Dodecyl Xylene",null,"Y"]
["IBC_0000_8815/ /Epichlorohydrin",null,"Y"]
["IBC_0000_8816/ /Ethanolamine",null,"Y"]
["IBC_0000_8817/ /2-Ethoxyethyl acetate",null,"Y"]
["IBC_0000_8818/ /Ethoxylated long chain (C16+) alkyloxyalkylamine",null,"Y"]
["IBC_0000_8820/ /Ethyl acetate",null,"Z"]
["IBC_0000_8901/ /Ethyl acetoacetate",null,"Z"]
["IBC_0000_8902/ /Ethyl acrylate",null,"Y"]
["IBC_0000_8905/ /Ethyl amyl ketone",null,"Y"]
["IBC_0000_8906/ /Ethylbenzene",null,"Y"]
["IBC_0000_8907/ /Ethyl tert-butyl ether",null,"Y"]
["IBC_0000_8908/ /Ethyl butyrate",null,"Y"]
["IBC_0000_8909/ /Ethylcyclohexane",null,"Y"]
["IBC_0000_8910/ /N-Ethylcyclohexylamine",null,"Y"]
["IBC_0000_8911/ /S-Ethyl dipropylthiocarbamate",null,"Y"]
["IBC_0000_8912/ /Ethylene chlorohydrin",null,"Y"]
["IBC_0000_8913/ /Ethylene cyanohydrin",null,"Y"]
["IBC_0000_8914/ /Ethylenediamine",null,"Y"]
["IBC_0000_8915/ /Ethylenediaminetetraacetic acid, tetrasodium salt solution",null,"Y"]
["IBC_0000_8916/ /Ethylene dibromide",null,"Y"]
["IBC_0000_8917/ /Ethylene dichloride",null,"Y"]
["IBC_0000_8918/ /Ethylene glycol",null,"Z"]
["IBC_0000_8919/ /Ethylene glycol acetate",null,"Y"]
["IBC_0000_8920/ /Ethylene glycol butyl ether acetate",null,"Y"]
["IBC_0000_8981/ /Ethylene glycol diacetate",null,"Y"]
["IBC_0000_8982/ /Ethylene glycol methyl ether acetate",null,"Y"]
["IBC_0000_8983/ /Ethylene glycol monoalkyl ethers",null,"Y"]
["IBC_0000_8984/ /Ethylene glycol phenyl ether",null,"Z"]
["IBC_0000_8985/ /Ethylene glycol phenyl ether/Diethylene glycol phenyl ether mixture",null,"Z"]
["IBC_0000_8987/ /Ethylene-vinyl acetate copolymer (emulsion)",null,"Y"]
["IBC_0000_8988/ /Ethyl-3-ethoxypropionate",null,"Y"]
["IBC_0000_8989/ /2-Ethylhexanoic acid",null,"Y"]
["IBC_0000_8990/ /2-Ethylhexyl acrylate",null,"Y"]
["IBC_0000_8991/ /2-Ethylhexylamine",null,"Y"]
["IBC_0000_8992/ /2-Ethyl-2-(hydroxymethyl) propane-1,3-diol (C8-C10) ester",null,"Y"]
["IBC_0000_8993/ /Ethylidene norbornene",null,"Y"]
["IBC_0000_8994/ /Ethyl methacrylate",null,"Y"]
["IBC_0000_8995/ /N-Ethylmethylallylamine",null,"Y"]
["IBC_0000_8996/ /Ethyl propionate",null,"Y"]
["IBC_0000_8997/ /2-Ethyl-3-propylacrolein",null,"Y"]
["IBC_0000_8998/ /Ethyl toluene",null,"Y"]
["IBC_0000_8999/ /Fatty acid (saturated C13+)",null,"Y"]
["IBC_0000_9000/ /Fatty acid methyl esters (m)",null,"Y"]
["IBC_0000_9041/ /Fatty acids, (C8-C10)",null,"Y"]
["IBC_0000_9042/ /Fatty acids, (C12+)",null,"Y"]
["IBC_0000_9043/ /Fatty acids, (C16+)",null,"Y"]
["IBC_0000_9044/ /Fatty acids, essentially linear (C6-C18) 2-ethylhexyl ester",null,"Y"]
["IBC_0000_9045/ /Ferric chloride solutions",null,"Y"]
["IBC_0000_9046/ /Ferric nitrate/Nitric acid solution",null,"Y"]
["IBC_0000_9047/ /Fish oil",null,"Y"]
["IBC_0000_9049/ /Formaldehyde solutions (45% or less)",null,"Y"]
["IBC_0000_9050/ /Formamide",null,"Y"]
["IBC_0000_9051/ /Formic acid (85% or less acid)",null,"Y"]
["IBC_0000_9052/ /Formic acid (over 85%)",null,"Y"]
["IBC_0000_9054/ /Furfural",null,"Y"]
["IBC_0000_9055/ /Furfuryl alcohol",null,"Y"]
["IBC_0000_9057/ /Glutaraldehyde solutions (50% or less)",null,"Y"]
["IBC_0000_9058/ /Glycerol monooleate",null,"Y"]
["IBC_0000_9059/ /Glycerol propoxylated",null,"Z"]
["IBC_0000_9060/ /Glycerol, propoxylated and ethoxylated",null,"Z"]
["IBC_0000_9121/ /Glycerol/sucrose blend propoxylated and ethoxylated",null,"Z"]
["IBC_0000_9122/ /Glyceryl triacetate",null,"Z"]
["IBC_0000_9123/ /Glycidyl ester of C10 trialkylacetic acid",null,"Y"]
["IBC_0000_9124/ /Glycine, sodium salt solution",null,"Z"]
["IBC_0000_9125/ /Glycolic acid solution (70% or less)",null,"Z"]
["IBC_0000_9126/ /Glyoxal solution (40% or less)",null,"Y"]
["IBC_0000_9129/ /Groundnut oil",null,"Y"]
["IBC_0000_9130/ /Heptane (all isomers)",null,"X"]
["IBC_0000_9131/ /n-Heptanoic acid",null,"Z"]
["IBC_0000_9132/ /Heptanol (all isomers) (d)",null,"Y"]
["IBC_0000_9133/ /Heptene (all isomers)",null,"Y"]
["IBC_0000_9134/ /Heptyl acetate",null,"Y"]
["IBC_0000_9135/ /1-Hexadecylnaphthalene / 1,4-bis(hexadecyl)naphthalene mixture",null,"Y"]
["IBC_0000_9136/ /Hexamethylenediamine (molten)",null,"Y"]
["IBC_0000_9137/ /Hexamethylenediamine adipate (50% in water)",null,"Z"]
["IBC_0000_9138/ /Hexamethylenediamine solution",null,"Y"]
["IBC_0000_9139/ /Hexamethylene diisocyanate",null,"Y"]
["IBC_0000_9140/ /Hexamethylene glycol",null,"Z"]
["IBC_0000_9181/ /Hexamethyleneimine",null,"Y"]
["IBC_0000_9182/ /Hexane (all isomers)",null,"Y"]
["IBC_0000_9183/ /1,6-Hexanediol, distillation overheads",null,"Y"]
["IBC_0000_9184/ /Hexanoic acid",null,"Y"]
["IBC_0000_9185/ /Hexanol",null,"Y"]
["IBC_0000_9186/ /Hexene (all isomers)",null,"Y"]
["IBC_0000_9187/ /Hexyl acetate",null,"Y"]
["IBC_0000_9189/ /Hydrogen peroxide solutions (over 60% but not over 70% by mass)",null,"Y"]
["IBC_0000_9190/ /Hydrogen peroxide solutions (over 8% but not over 60% by mass)",null,"Y"]
["IBC_0000_9191/ /2-Hydroxyethyl acrylate",null,"Y"]
["IBC_0000_9192/ /N-(Hydroxyethyl)ethylenediaminetriacetic acid, trisodium salt solution",null,"Y"]
["IBC_0000_9193/ /2-Hydroxy-4-(methylthio)butanoic acid",null,"Z"]
["IBC_0000_9194/ /Illipe oil",null,"Y"]
["IBC_0000_9195/ /Isoamyl alcohol",null,"Z"]
["IBC_0000_9196/ /Isobutyl alcohol",null,"Z"]
["IBC_0000_9197/ /Isobutyl formate",null,"Z"]
["IBC_0000_9198/ /Isobutyl methacrylate",null,"Z"]
["IBC_0000_9199/ /Isophorone",null,"Y"]
["IBC_0000_9200/ /Isophoronediamine",null,"Y"]
["IBC_0000_9241/ /Isophorone diisocyanate",null,"Y"]
["IBC_0000_9242/ /Isoprene",null,"Y"]
["IBC_0000_9243/ /Isopropanolamine",null,"Y"]
["IBC_0000_9244/ /Isopropyl acetate",null,"Z"]
["IBC_0000_9245/ /Isopropylamine",null,"Y"]
["IBC_0000_9246/ /Isopropylamine (70% or less) solution",null,"Y"]
["IBC_0000_9247/ /Isopropylcyclohexane",null,"Y"]
["IBC_0000_9248/ /Isopropyl ether",null,"Y"]
["IBC_0000_9249/ /Jatropha oil",null,"Y"]
["IBC_0000_9250/ /Lactic acid",null,"Z"]
["IBC_0000_9251/ /Lactonitrile solution (80% or less)",null,"Y"]
["IBC_0000_9252/ /Lard",null,"Y"]
["IBC_0000_9253/ /Latex, ammonia (1% or less)- inhibited",null,"Y"]
["IBC_0000_9254/ /Latex: Carboxylated styrene-Butadiene copolymer; Styrene-Butadiene rubber",null,"Z"]
["IBC_0000_9255/ /Lauric acid",null,"X"]
["IBC_0000_9256/ /Ligninsulphonic acid, magnesium salt solution",null,"Z"]
["IBC_0000_9257/ /Ligninsulphonic acid, sodium salt solution",null,"Z"]
["IBC_0000_9258/ /Linseed oil",null,"Y"]
["IBC_0000_9259/ /Liquid chemical wastes",null,"X"]
["IBC_0000_9260/ /Long-chain alkaryl polyether (C11-C20)",null,"Y"]
["IBC_0000_9301/ /Long-chain alkaryl sulphonic acid (C16-C60)",null,"Y"]
["IBC_0000_9302/ /Long-chain alkylphenate/Phenol sulphide mixture",null,"Y"]
["IBC_0000_9303/ /L-Lysine solution (60% or less)",null,"Z"]
["IBC_0000_9304/ /Magnesium chloride solution",null,"Z"]
["IBC_0000_9305/ /Magnesium long-chain alkaryl sulphonate (C11-C50)",null,"Y"]
["IBC_0000_9306/ /Magnesium long-chain alkyl salicylate (C11+)",null,"Y"]
["IBC_0000_9307/ /Maleic anhydride",null,"Y"]
["IBC_0000_9308/ /Mango kernel oil",null,"Y"]
["IBC_0000_9309/ /Mercaptobenzothiazol, sodium salt solution",null,"X"]
["IBC_0000_9310/ /Mesityl oxide",null,"Z"]
["IBC_0000_9311/ /Metam sodium solution",null,"X"]
["IBC_0000_9312/ /Methacrylic acid",null,"Y"]
["IBC_0000_9314/ /Methacrylic resin in ethylene dichloride",null,"Y"]
["IBC_0000_9315/ /Methacrylonitrile",null,"Y"]
["IBC_0000_9316/ /3-Methoxy-1-butanol",null,"Z"]
["IBC_0000_9317/ /3-Methoxybutyl acetate",null,"Y"]
["IBC_0000_9318/ /N-(2-Methoxy-1-methyl ethyl)-2-ethyl-6-methyl chloroacetanilide",null,"X"]
["IBC_0000_9319/ /Methyl acetate",null,"Z"]
["IBC_0000_9320/ /Methyl acetoacetate",null,"Z"]
["IBC_0000_9341/ /Methyl acrylate",null,"Y"]
["IBC_0000_9343/ /Methylamine solutions (42% or less)",null,"Y"]
["IBC_0000_9344/ /Methylamyl acetate",null,"Y"]
["IBC_0000_9345/ /Methylamyl alcohol",null,"Z"]
["IBC_0000_9346/ /Methyl amyl ketone",null,"Z"]
["IBC_0000_9347/ /N-Methylaniline",null,"Y"]
["IBC_0000_9348/ /alpha-Methylbenzyl alcohol with acetophenone (15% or less)",null,"Y"]
["IBC_0000_9349/ /Methylbutenol",null,"Y"]
["IBC_0000_9350/ /Methyl tert-butyl ether",null,"Z"]
["IBC_0000_9351/ /Methyl butyl ketone",null,"Y"]
["IBC_0000_9352/ /Methylbutynol",null,"Z"]
["IBC_0000_9353/ /Methyl butyrate",null,"Y"]
["IBC_0000_9354/ /Methylcyclohexane",null,"Y"]
["IBC_0000_9355/ /Methylcyclopentadiene dimer",null,"Y"]
["IBC_0000_9356/ /Methylcyclopentadienyl manganese tricarbonyl",null,"X"]
["IBC_0000_9357/ /Methyl diethanolamine",null,"Y"]
["IBC_0000_9358/ /2-Methyl-6-ethyl aniline",null,"Y"]
["IBC_0000_9359/ /Methyl ethyl ketone",null,"Z"]
["IBC_0000_9360/ /2-Methyl-5-ethyl pyridine",null,"Y"]
["IBC_0000_9401/ /Methyl formate",null,"Z"]
["IBC_0000_9402/ /2-Methylglutaronitrile with 2-Ethylsuccinonitrile (12% or less)",null,"Z"]
["IBC_0000_9403/ /2-Methyl-2-hydroxy-3-butyne",null,"Z"]
["IBC_0000_9404/ /Methyl isobutyl ketone",null,"Z"]
["IBC_0000_9405/ /Methyl methacrylate",null,"Y"]
["IBC_0000_9406/ /3-Methyl-3-methoxybutanol",null,"Z"]
["IBC_0000_9407/ /Methyl naphthalene (molten)",null,"X"]
["IBC_0000_9408/ /2-Methyl-1,3-propanediol",null,"Z"]
["IBC_0000_9409/ /2-Methylpyridine",null,"Z"]
["IBC_0000_9410/ /3-Methylpyridine",null,"Z"]
["IBC_0000_9411/ /4-Methylpyridine",null,"Z"]
["IBC_0000_9412/ /N-Methyl-2-pyrrolidone",null,"Y"]
["IBC_0000_9413/ /Methyl salicylate",null,"Y"]
["IBC_0000_9414/ /alpha-Methylstyrene",null,"Y"]
["IBC_0000_9415/ /3-(methylthio)propionaldehyde",null,"Y"]
["IBC_0000_9417/ /Morpholine",null,"Y"]
["IBC_0000_9419/ /Myrcene",null,"X"]
["IBC_0000_9420/ /Naphthalene (molten)",null,"X"]
["IBC_0000_9461/ /Naphthalenesulphonic acid-Formaldehyde copolymer, sodium salt solution",null,"Z"]
["IBC_0000_9462/ /Neodecanoic acid",null,"Y"]
["IBC_0000_9463/ /Nitrating acid (mixture of sulphuric and nitric acids)",null,"Y"]
["IBC_0000_9464/ /Nitric acid (70% and over)",null,"Y"]
["IBC_0000_9465/ /Nitric acid (less than 70%)",null,"Y"]
["IBC_0000_9466/ /Nitrilotriacetic acid, trisodium salt solution",null,"Y"]
["IBC_0000_9467/ /Nitrobenzene",null,"Y"]
["IBC_0000_9468/ /Nitroethane",null,"Y"]
["IBC_0000_9470/ /Nitroethane, 1-Nitropropane (each 15% or more) mixture",null,"Y"]
["IBC_0000_9471/ /o-Nitrophenol (molten)",null,"Y"]
["IBC_0000_9472/ /1- or 2-Nitropropane",null,"Y"]
["IBC_0000_9473/ /Nitropropane (60%)/Nitroethane (40%) mixture",null,"Y"]
["IBC_0000_9474/ /o- or p-Nitrotoluenes",null,"Y"]
["IBC_0000_9475/ /Nonane (all isomers)",null,"X"]
["IBC_0000_9476/ /Nonanoic acid (all isomers)",null,"Y"]
["IBC_0000_9477/ /Non-edible industrial grade palm oil",null,"Y"]
["IBC_0000_9478/ /Nonene (all isomers)",null,"Y"]
["IBC_0000_9479/ /Nonyl alcohol (all isomers)",null,"Y"]
["IBC_0000_9480/ /Nonyl methacrylate monomer",null,"Y"]
["IBC_0000_9521/ /Nonylphenol",null,"X"]
["IBC_0000_9522/ /Nonylphenol poly(4+)ethoxylate",null,"Y"]
["IBC_0000_9533/ /Octamethylcyclotetrasiloxane",null,"Y"]
["IBC_0000_9534/ /Octane (all isomers)",null,"X"]
["IBC_0000_9535/ /Octanoic acid (all isomers)",null,"Y"]
["IBC_0000_9536/ /Octanol (all isomers)",null,"Y"]
["IBC_0000_9537/ /Octene (all isomers)",null,"Y"]
["IBC_0000_9538/ /n-Octyl acetate",null,"Y"]
["IBC_0000_9539/ /Octyl aldehydes",null,"Y"]
["IBC_0000_9540/ /Octyl decyl adipate",null,"Y"]
["IBC_0000_9581/ /Olefin-Alkyl ester copolymer (molecular weight 2000+)",null,"Y"]
["IBC_0000_9582/ /Olefin Mixture (C7-C9) C8 rich, stabilised",null,"X"]
["IBC_0000_9583/ /Olefin mixtures (C5-C7)",null,"Y"]
["IBC_0000_9584/ /Olefin mixtures (C5-C15)",null,"X"]
["IBC_0000_9585/ /Olefins (C13+, all isomers)",null,"Y"]
["IBC_0000_9586/ /alpha-Olefins (C6-C18) mixtures",null,"X"]
["IBC_0000_9587/ /Oleic acid",null,"Y"]
["IBC_0000_9588/ /Oleum",null,"Y"]
["IBC_0000_9589/ /Oleylamine",null,"X"]
["IBC_0000_9590/ /Olive oil",null,"Y"]
["IBC_0000_9591/ /Oxygenated aliphatic hydrocarbon mixture",null,"Z"]
["IBC_0000_9592/ /Palm acid oil",null,"Y"]
["IBC_0000_9593/ /Palm fatty acid distillate",null,"Y"]
["IBC_0000_9594/ /Palm kernel acid oil",null,"Y"]
["IBC_0000_9595/ /Palm kernel fatty acid distillate",null,"Y"]
["IBC_0000_9596/ /Palm kernel oil",null,"Y"]
["IBC_0000_9597/ /Palm kernel olein",null,"Y"]
["IBC_0000_9598/ /Palm kernel stearin",null,"Y"]
["IBC_0000_9599/ /Palm mid-fraction",null,"Y"]
["IBC_0000_9600/ /Palm oil",null,"Y"]
["IBC_0000_9621/ /Palm oil fatty acid methyl ester",null,"Y"]
["IBC_0000_9622/ /Palm olein",null,"Y"]
["IBC_0000_9623/ /Palm stearin",null,"Y"]
["IBC_0000_9625/ /Paraldehyde",null,"Z"]
["IBC_0000_9626/ /Paraldehyde-ammonia reaction product",null,"Y"]
["IBC_0000_9627/ /Pentachloroethane",null,"Y"]
["IBC_0000_9628/ /1,3-Pentadiene",null,"Y"]
["IBC_0000_9629/ /1,3-Pentadiene (greater than 50%), cyclopentene and isomers, mixtures",null,"Y"]
["IBC_0000_9630/ /Pentaethylenehexamine",null,"X"]
["IBC_0000_9631/ /Pentane (all isomers)",null,"Y"]
["IBC_0000_9632/ /Pentanoic acid",null,"Y"]
["IBC_0000_9633/ /n-Pentanoic acid (64%)/2-Methyl butyric acid (36%) mixture",null,"Y"]
["IBC_0000_9634/ /Pentene (all isomers)",null,"Y"]
["IBC_0000_9635/ /n-Pentyl propionate",null,"Y"]
["IBC_0000_9636/ /Perchloroethylene",null,"Y"]
["IBC_0000_9638/ /Phenol",null,"Y"]
["IBC_0000_9639/ /1-Phenyl-1-xylyl ethane",null,"Y"]
["IBC_0000_9640/ /Phosphate esters, alkyl (C12-C14) amine",null,"Y"]
["IBC_0000_9681/ /Phosphoric acid",null,"Z"]
["IBC_0000_9683/ /Phthalic anhydride (molten)",null,"Y"]
["IBC_0000_9684/ /alpha-Pinene",null,"X"]
["IBC_0000_9685/ /beta-Pinene",null,"X"]
["IBC_0000_9686/ /Pine oil",null,"X"]
["IBC_0000_9687/ /Polyacrylic acid solution (40% or less)",null,"Z"]
["IBC_0000_9688/ /Polyalkyl (C18-C22) acrylate in xylene",null,"Y"]
["IBC_0000_9689/ /Polyalkylalkenaminesuccinimide, molybdenum oxysulphide",null,"Y"]
["IBC_0000_9690/ /Poly(2-8)alkylene glycol monoalkyl(C1-C6) ether",null,"Z"]
["IBC_0000_9691/ /Poly(2-8)alkylene glycol monoalkyl (C1-C6) ether acetate",null,"Y"]
["IBC_0000_9692/ /Polyalkyl (C10-C20) methacrylate",null,"Y"]
["IBC_0000_9693/ /Polyalkyl (C10-C18) methacrylate/ethylene-propylene copolymer mixture",null,"Y"]
["IBC_0000_9694/ /Polybutene",null,"Y"]
["IBC_0000_9695/ /Polybutenyl succinimide",null,"Y"]
["IBC_0000_9696/ /Poly(2+)cyclic aromatics",null,"X"]
["IBC_0000_9697/ /Polyether (molecular weight 1350+)",null,"Y"]
["IBC_0000_9698/ /Polyethylene glycol",null,"Z"]
["IBC_0000_9699/ /Polyethylene glycol dimethyl ether",null,"Z"]
["IBC_0000_9700/ /Poly(ethylene glycol) methylbutenyl ether (MW>1000)",null,"Z"]
["IBC_0000_9721/ /Polyethylene polyamines",null,"Y"]
["IBC_0000_9722/ /Polyethylene polyamines (more than 50% C5 -C20 paraffin oil)",null,"Y"]
["IBC_0000_9723/ /Polyferric sulphate solution",null,"Y"]
["IBC_0000_9724/ /Poly(iminoethylene)-graft-N-poly(ethyleneoxy) solution (90% or less)",null,"Z"]
["IBC_0000_9725/ /Polyisobutenamine in aliphatic (C10-C14) solvent",null,"Y"]
["IBC_0000_9726/ /Polyisobutenyl anhydride adduct",null,"Z"]
["IBC_0000_9728/ /Polymethylene polyphenyl isocyanate",null,"Y"]
["IBC_0000_9729/ /Polyolefin (molecular weight 300+)",null,"Y"]
["IBC_0000_9730/ /Polyolefin amide alkeneamine (C17+)",null,"Y"]
["IBC_0000_9731/ /Polyolefin amide alkeneamine borate (C28-C250)",null,"Y"]
["IBC_0000_9732/ /Polyolefin amide alkeneamine polyol",null,"Y"]
["IBC_0000_9733/ /Polyolefinamine (C28-C250)",null,"Y"]
["IBC_0000_9734/ /Polyolefinamine in alkyl (C2-C4) benzenes",null,"Y"]
["IBC_0000_9735/ /Polyolefinamine in aromatic solvent",null,"Y"]
["IBC_0000_9736/ /Polyolefin aminoester salts (molecular weight 2000+)",null,"Y"]
["IBC_0000_9737/ /Polyolefin anhydride",null,"Y"]
["IBC_0000_9738/ /Polyolefin ester (C28-C250)",null,"Y"]
["IBC_0000_9739/ /Polyolefin phenolic amine (C28-C250)",null,"Y"]
["IBC_0000_9740/ /Polyolefin phosphorosulphide, barium derivative (C28-C250)",null,"Y"]
["IBC_0000_9781/ /Poly(20)oxyethylene sorbitan monooleate",null,"Y"]
["IBC_0000_9782/ /Poly(5+)propylene",null,"Y"]
["IBC_0000_9783/ /Polypropylene glycol",null,"Z"]
["IBC_0000_9784/ /Polysiloxane",null,"Y"]
["IBC_0000_9785/ /Potassium chloride solution",null,"Z"]
["IBC_0000_9787/ /Potassium oleate",null,"Y"]
["IBC_0000_9788/ /Potassium thiosulphate (50% or less)",null,"Y"]
["IBC_0000_9789/ /n-Propanolamine",null,"Y"]
["IBC_0000_9791/ /beta-Propiolactone",null,"Y"]
["IBC_0000_9792/ /Propionaldehyde",null,"Y"]
["IBC_0000_9793/ /Propionic acid",null,"Y"]
["IBC_0000_9794/ /Propionic anhydride",null,"Y"]
["IBC_0000_9795/ /Propionitrile",null,"Y"]
["IBC_0000_9796/ /n-Propyl acetate",null,"Y"]
["IBC_0000_9797/ /n-Propyl alcohol",null,"Y"]
["IBC_0000_9798/ /n-Propylamine",null,"Z"]
["IBC_0000_9799/ /Propylbenzene (all isomers)",null,"Y"]
["IBC_0000_9800/ /Propylene glycol methyl ether acetate",null,"Z"]
["IBC_0000_9821/ /Propylene glycol monoalkyl ether",null,"Z"]
["IBC_0000_9822/ /Propylene glycol phenyl ether",null,"Z"]
["IBC_0000_9823/ /Propylene oxide",null,"Y"]
["IBC_0000_9824/ /Propylene tetramer",null,"X"]
["IBC_0000_9825/ /Propylene trimer",null,"Y"]
["IBC_0000_9826/ /Pyridine",null,"Y"]
["IBC_0000_9828/ /Rapeseed oil",null,"Y"]
["IBC_0000_9830/ /Rape seed oil fatty acid methyl esters",null,"Y"]
["IBC_0000_9831/ /Resin oil, distilled",null,"Y"]
["IBC_0000_9832/ /Rice bran oil",null,"Y"]
["IBC_0000_9833/ /Rosin",null,"Y"]
["IBC_0000_9834/ /Safflower oil",null,"Y"]
["IBC_0000_9835/ /Shea butter",null,"Y"]
["IBC_0000_9836/ /Sodium alkyl (C14-C17) sulphonates (60-65% solution)",null,"Y"]
["IBC_0000_9837/ /Sodium aluminosilicate slurry",null,"Z"]
["IBC_0000_9838/ /Sodium benzoate",null,"Z"]
["IBC_0000_9840/ /Sodium bromide solution (less than 50%) (*)",null,"Y"]
["IBC_0000_9883/ /Sodium dichromate solution (70% or less)",null,"Y"]
["IBC_0000_9885/ /Sodium hydrogen sulphite solution (45% or less)",null,"Z"]
["IBC_0000_9889/ /Sodium hypochlorite solution (15% or less)",null,"Y"]
["IBC_0000_9891/ /Sodium nitrite solution",null,"Y"]
["IBC_0000_9892/ /Sodium petroleum sulphonate",null,"Y"]
["IBC_0000_9893/ /Sodium poly(4+)acrylate solutions",null,"Z"]
["IBC_0000_9894/ /Sodium silicate solution",null,"Y"]
["IBC_0000_9895/ /Sodium sulphide solution (15% or less)",null,"Y"]
["IBC_0000_9896/ /Sodium sulphite solution (25% or less)",null,"Y"]
["IBC_0000_9897/ /Sodium thiocyanate solution (56% or less)",null,"Y"]
["IBC_0000_9898/ /Soyabean oil",null,"Y"]
["IBC_0000_9899/ /Styrene monomer",null,"Y"]
["IBC_0000_9900/ /Sulphohydrocarbon (C3-C88)",null,"Y"]
["IBC_0000_9941/ /Sulpholane",null,"Y"]
["IBC_0000_9943/ /Sulphuric acid",null,"Y"]
["IBC_0000_9944/ /Sulphuric acid, spent",null,"Y"]
["IBC_0000_9945/ /Sulphurized fat (C14-C20)",null,"Z"]
["IBC_0000_9946/ /Sulphurized polyolefinamide alkene (C28-C250) amine",null,"Z"]
["IBC_0000_9947/ /Sunflower seed oil",null,"Y"]
["IBC_0000_9948/ /Tall oil, crude",null,"Y"]
["IBC_0000_9949/ /Tall oil, distilled",null,"Y"]
["IBC_0000_9950/ /Tall oil fatty acid (resin acids less than 20%)",null,"Y"]
["IBC_0000_9951/ /Tall oil pitch",null,"Y"]
["IBC_0000_9952/ /Tallow",null,"Y"]
["IBC_0000_9953/ /Tallow fatty acid",null,"Y"]
["IBC_0000_9954/ /Tetrachloroethane",null,"Y"]
["IBC_0000_9955/ /Tetraethylene glycol",null,"Z"]
["IBC_0000_9956/ /Tetraethylene pentamine",null,"Y"]
["IBC_0000_9957/ /Tetrahydrofuran",null,"Z"]
["IBC_0000_9958/ /Tetrahydronaphthalene",null,"Y"]
["IBC_0000_9959/ /Tetramethylbenzene (all isomers)",null,"X"]
["IBC_0000_9960/ /Titanium dioxide slurry",null,"Z"]
["IBC_0000_9981/ /Toluene",null,"Y"]
["IBC_0000_9982/ /Toluenediamine",null,"Y"]
["IBC_0000_9983/ /Toluene diisocyanate",null,"Y"]
["IBC_0000_9984/ /o-Toluidine",null,"Y"]
["IBC_0000_9985/ /Tributyl phosphate",null,"Y"]
["IBC_0000_9986/ /1,2,3-Trichlorobenzene (molten)",null,"X"]
["IBC_0000_9987/ /1,2,4-Trichlorobenzene",null,"X"]
["IBC_0000_9988/ /1,1,1-Trichloroethane",null,"Y"]
["IBC_0000_9989/ /1,1,2-Trichloroethane",null,"Y"]
["IBC_0000_9990/ /Trichloroethylene",null,"Y"]
["IBC_0000_9991/ /1,2,3-Trichloropropane",null,"Y"]
["IBC_0000_9992/ /1,1,2-Trichloro-1,2,2-Trifluoroethane",null,"Y"]
["IBC_0000_9995/ /Tridecane",null,"Y"]
["IBC_0000_9996/ /Tridecanoic acid",null,"Y"]
["IBC_0000_9997/ /Tridecyl acetate",null,"Y"]
["IBC_0000_9998/ /Triethanolamine",null,"Z"]
["IBC_0000_9999/ /Triethylamine",null,"Y"]
["IGC_0000_8065/ /Acetaldehyde"]
["IGC_0000_8066/ /Ammonia, anhydrous"]
["IGC_0000_8067/ /Butadiene (all isomers)"]
["IGC_0000_8068/ /Butane (all isomers)"]
["IGC_0000_8069/ /Butane-propane mixture"]
["IGC_0000_8070/ /Butylenes (all isomers)"]
["IGC_0000_8071/ /Carbon Dioxide (high purity)"]
["IGC_0000_8072/ /Carbon Dioxide (Reclaimed quality)"]
["IGC_0000_8073/ /Chlorine"]
["IGC_0000_8074/ /Diethyl ether*"]
["IGC_0000_8075/ /Dimethylamine"]
["IGC_0000_8076/ /Dimethyl Ether"]
["IGC_0000_8077/ /Ethane"]
["IGC_0000_8078/ /Ethyl Chloride"]
["IGC_0000_8079/ /Ethylene"]
["IGC_0000_8080/ /Ethylene oxide"]
["IGC_0000_8081/ /Ethylene oxide-propylene oxide mixtures with ethylene oxide content of not more than 30% by weight*"]
["IGC_0000_8082/ /Isoprene* (all isomers)"]
["IGC_0000_8083/ /Isoprene (part refined)*"]
["IGC_0000_8084/ /Isopropylamine*"]
["IGC_0000_8085/ /Methane (LNG)"]
["IGC_0000_8086/ /Methyl acetylene-propadiene mixtures"]
["IGC_0000_8087/ /Methyl bromide"]
["IGC_0000_8088/ /Methyl chloride"]
["IGC_0000_8089/ /Mixed C4 Cargoes"]
["IGC_0000_8090/ /Monoethylamine*"]
["IGC_0000_8091/ /Nitrogen"]
["IGC_0000_8092/ /Pentane (all isomers)*"]
["IGC_0000_8093/ /Pentene (all isomers)*"]
["IGC_0000_8094/ /Propane"]
["IGC_0000_8095/ /Propylene"]
["IGC_0000_8096/ /Propylene oxide*"]
["IGC_0000_8097/ /Refrigerant gases"]
["IGC_0000_8098/ /Sulphur dioxide"]
["IGC_0000_8099/ /Vinyl chloride"]
["IGC_0000_8100/ /Vinyl ethyl ether*"]
["IGC_0000_8101/ /Vinylidene chloride*"]
["IMDG_0004_4589/ /AMMONIUM PICRATE dry or wetted with less than 10% water, by mass",null,null,"F-B S-Y"]
["IMDG_0005_4590/ /CARTRIDGES FOR WEAPONS with bursting charge",null,null,"F-B S-X"]
["IMDG_0006_4591/ /CARTRIDGES FOR WEAPONS with bursting charge",null,null,"F-B S-X"]
["IMDG_0007_4592/ /CARTRIDGES FOR WEAPONS with bursting charge",null,null,"F-B S-X"]
["IMDG_0009_4593/ /AMMUNITION, INCENDIARY with or without burster, expelling charge or propelling charge",null,null,"F-B S-X"]
["IMDG_0010_4594/ /AMMUNITION, INCENDIARY with or without burster, expelling charge or propelling charge",null,null,"F-B S-X"]
["IMDG_0012_4595/ /CARTRIDGES FOR WEAPONS, INERT PROJECTILE or CARTRIDGES, SMALL ARMS",null,null,"F-B S-X"]
["IMDG_0014_4596/ /CARTRIDGES FOR WEAPONS, BLANK or CARTRIDGES, SMALL ARMS, BLANK or CARTRIDGES FOR TOOLS, BLANK",null,null,"F-B S-X"]
["IMDG_0015_4597/ /AMMUNITION, SMOKE with or without burster, expelling charge or propelling charge",null,null,"F-B S-X"]
["IMDG_0016_4598/ /AMMUNITION, SMOKE with or without burster, expelling charge or propelling charge",null,null,"F-B S-X"]
["IMDG_0018_12021/ /AMMUNITION, TEAR- PRODUCING with burster, expelling charge or propelling charge",null,null,"F-B S-Z"]
["IMDG_0019_4600/ /AMMUNITION, TEAR-PRODUCING with burster, expelling charge or propelling charge",null,null,"F-B S-Z"]
["IMDG_0020_8701/ /AMMUNITION, TOXIC with burster, expelling charge or propelling charge",null,null,"F-B S-Z"]
["IMDG_0021_8702/ /AMMUNITION, TOXIC with burster, expelling charge or propelling charge",null,null,"F-B S-Z"]
["IMDG_0027_8703/ /BLACK POWDER (GUNPOWDER) granular, or as a meal",null,null,"F-B S-Y"]
["IMDG_0028_8704/ /BLACK POWDER (GUNPOWDER), COMPRESSED or BLACK POWDER (GUNPOWDER) IN PELLETS",null,null,"F-B S-Y"]
["IMDG_0029_8705/ /DETONATORS, NON-ELECTRIC for blasting",null,null,"F-B S-X"]
["IMDG_0030_8706/ /DETONATORS, ELECTRIC for blasting",null,null,"F-B S-X"]
["IMDG_0033_8707/ /BOMBS with bursting charge",null,null,"F-B S-X"]
["IMDG_0034_8708/ /BOMBS with bursting charge",null,null,"F-B S-X"]
["IMDG_0035_8709/ /BOMBS with bursting charge",null,null,"F-B S-X"]
["IMDG_0037_8710/ /BOMBS, PHOTO-FLASH",null,null,"F-B S-X"]
["IMDG_0038_8711/ /BOMBS, PHOTO-FLASH",null,null,"F-B S-X"]
["IMDG_0039_8712/ /BOMBS, PHOTO-FLASH",null,null,"F-B S-X"]
["IMDG_0042_8713/ /BOOSTERS without detonator",null,null,"F-B S-X"]
["IMDG_0043_8714/ /BURSTERS explosive",null,null,"F-B S-X"]
["IMDG_0044_8715/ /PRIMERS, CAP TYPE",null,null,"F-B S-X"]
["IMDG_0048_8716/ /CHARGES, DEMOLITION",null,null,"F-B S-X"]
["IMDG_0049_8717/ /CARTRIDGES, FLASH",null,null,"F-B S-X"]
["IMDG_0050_8718/ /CARTRIDGES, FLASH",null,null,"F-B S-X"]
["IMDG_0054_8719/ /CARTRIDGES, SIGNAL",null,null,"F-B S-X"]
["IMDG_0055_8720/ /CASES, CARTRIDGE, EMPTY, WITH PRIMER",null,null,"F-B S-X"]
["IMDG_0056_8721/ /CHARGES, DEPTH",null,null,"F-B S-X"]
["IMDG_0059_8722/ /CHARGES, SHAPED without detonator",null,null,"F-B S-X"]
["IMDG_0060_8723/ /CHARGES, SUPPLEMENTARY, EXPLOSIVE",null,null,"F-B S-X"]
["IMDG_0065_8724/ /CORD, DETONATING flexible",null,null,"F-B S-X"]
["IMDG_0066_8725/ /CORD, IGNITER",null,null,"F-B S-X"]
["IMDG_0070_8726/ /CUTTERS, CABLE, EXPLOSIVE",null,null,"F-B S-X"]
["IMDG_0072_12022/ /CYCLOTRIMETHYLENE- TRINITRAMINE (CYCLONITE), (RDX), (HEXOGEN), WETTED with not less than 15% water, by mass",null,null,"F-B S-Y"]
["IMDG_0073_8728/ /DETONATORS FOR AMMUNITION",null,null,"F-B S-X"]
["IMDG_0074_8729/ /DIAZODINITROPHENOL, WETTED with not less than 40% water or mixture of alcohol and water, by mass",null,null,"F-B S-Y"]
["IMDG_0075_8730/ /DIETHYLENEGLYCOL DINITRATE, DESENSITIZED with not less than 25% non-volatile water-insoluble phlegmatizer, by mass",null,null,"F-B S-Y"]
["IMDG_0076_8731/ /DINITROPHENOL dry or wetted with less than 15% water, by mass",null,"P","F-B S-Z"]
["IMDG_0077_8732/ /DINITROPHENOLATES alkali metals, dry or wetted with less than 15% water, by mass",null,"P","F-B S-Z"]
["IMDG_0078_8733/ /DINITRORESORCINOL dry or wetted with less than 15% water, by mass",null,null,"F-B S-Y"]
["IMDG_0079_8734/ /HEXANITRODIPHENYLAMINE (DIPICRYLAMINE), (HEXYL)",null,null,"F-B S-Y"]
["IMDG_0081_8735/ /EXPLOSIVE, BLASTING, TYPE A",null,null,"F-B S-Y"]
["IMDG_0082_8736/ /EXPLOSIVE, BLASTING, TYPE B",null,null,"F-B S-Y"]
["IMDG_0083_8737/ /EXPLOSIVE, BLASTING, TYPE C",null,null,"F-B S-Y"]
["IMDG_0084_8738/ /EXPLOSIVE, BLASTING, TYPE D",null,null,"F-B S-Y"]
["IMDG_0092_8739/ /FLARES, SURFACE",null,null,"F-B S-X"]
["IMDG_0093_8740/ /FLARES, AERIAL",null,null,"F-B S-X"]
["IMDG_0094_8761/ /FLASH POWDER",null,null,"F-B S-Y"]
["IMDG_0099_12023/ /FRACTURING DEVICES, EXPLOSIVE for oil wells, without detonator",null,null,"F-B S-X"]
["IMDG_0101_8763/ /FUSE, NON-DETONATING",null,null,"F-B S-X"]
["IMDG_0102_8764/ /CORD (FUSE), DETONATING metal-clad",null,null,"F-B S-X"]
["IMDG_0103_8765/ /FUSE, IGNITER tubular, metal-clad",null,null,"F-B S-X"]
["IMDG_0104_12024/ /CORD (FUSE), DETONATING, MILD EFFECT metal-clad",null,null,"F-B S-X"]
["IMDG_0105_8767/ /FUSE, SAFETY",null,null,"F-B S-X"]
["IMDG_0106_8768/ /FUZES, DETONATING",null,null,"F-B S-X"]
["IMDG_0107_8769/ /FUZES, DETONATING",null,null,"F-B S-X"]
["IMDG_0110_8770/ /GRENADES, PRACTICE hand or rifle",null,null,"F-B S-X"]
["IMDG_0113_12025/ /GUANYL NITROSAMINO- GUANYLIDENEHYDRAZINE, WETTED with not less than 30% water, by mass",null,null,"F-B S-Y"]
["IMDG_0114_12026/ /GUANYL NITROSAMINO- GUANYLTETRAZENE (TETRAZENE), WETTED with not less than 30% water, or mixture of alcohol and water, by mass",null,null,"F-B S-Y"]
["IMDG_0118_8773/ /HEXOLITE (HEXOTOL) dry or wetted with less than 15% water, by mass",null,null,"F-B S-Y"]
["IMDG_0121_8774/ /IGNITERS",null,null,"F-B S-X"]
["IMDG_0124_8775/ /JET PERFORATING GUNS, CHARGED oil well, without detonator",null,null,"F-B S-X"]
["IMDG_0129_8776/ /LEAD AZIDE, WETTED with not less than 20% water, or mixture of alcohol and water, by mass",null,null,"F-B S-Y"]
["IMDG_0130_8777/ /LEAD STYPHNATE (LEAD TRINITRORESORCINATE), WETTED with not less than 20% water, or mixture of alcohol and water, by mass",null,null,"F-B S-Y"]
["IMDG_0131_8778/ /LIGHTERS, FUSE",null,null,"F-B S-X"]
["IMDG_0132_12027/ /DEFLAGRATING METAL SALTS OF AROMATIC NITRO- DERIVATIVES, N.O.S.",null,null,"F-B S-Y"]
["IMDG_0133_8780/ /MANNITOL HEXANITRATE (NITROMANNITE), WETTED with not less than 40% water, or mixture of alcohol and water, by mass",null,null,"F-B S-Y"]
["IMDG_0135_8781/ /MERCURY FULMINATE, WETTED with not less than 20% water, or mixture of alcohol and water, by mass",null,null,"F-B S-Y"]
["IMDG_0136_8782/ /MINES with bursting charge",null,null,"F-B S-X"]
["IMDG_0137_8783/ /MINES with bursting charge",null,null,"F-B S-X"]
["IMDG_0138_8784/ /MINES with bursting charge",null,null,"F-B S-X"]
["IMDG_0143_8785/ /NITROGLYCERIN, DESENSITIZED with not less than 40% non-volatile water-insoluble phlegmatizer, by mass",null,null,"F-B S-Z"]
["IMDG_0144_8786/ /NITROGLYCERIN SOLUTION IN ALCOHOL with more than 1% but not more than 10% nitroglycerin",null,null,"F-B S-Y"]
["IMDG_0146_8787/ /NITROSTARCH dry or wetted, with less than 20% water, by mass",null,null,"F-B S-Y"]
["IMDG_0147_8788/ /NITRO UREA",null,null,"F-B S-Y"]
["IMDG_0150_12028/ /PENTAERYTHRITE TETRANITRATE (PENTAERYTHRITOL TETRANITRATE; PETN), WETTED with not less than 25% water, by mass or PENTAERYTHRITE TETRANITRATE (PENTAERYTHRITOL TETRANITRATE; PETN), DESENSITIZED with not less than 15% phlegmatizer, by mass",null,null,"F-B S-Y"]
["IMDG_0151_8790/ /PENTOLITE dry or wetted with less than 15% water, by mass",null,null,"F-B S-Y"]
["IMDG_0153_8791/ /TRINITROANILINE (PICRAMIDE)",null,null,"F-B S-Y"]
["IMDG_0154_12029/ /TRINITROPHENOL (PICRIC ACID) dry or wetted with less than 30% water, by mass",null,null,"F-B S-Y"]
["IMDG_0155_8793/ /TRINITROCHLOROBENZENE (PICRYL CHLORIDE)",null,null,"F-B S-Y"]
["IMDG_0159_8794/ /POWDER CAKE (POWDER PASTE), WETTED with not less than 25% water, by mass",null,null,"F-B S-Y"]
["IMDG_0160_8795/ /POWDER, SMOKELESS",null,null,"F-B S-Y"]
["IMDG_0161_8796/ /POWDER, SMOKELESS",null,null,"F-B S-Y"]
["IMDG_0167_8797/ /PROJECTILES with bursting charge",null,null,"F-B S-X"]
["IMDG_0168_8798/ /PROJECTILES with bursting charge",null,null,"F-B S-X"]
["IMDG_0169_8799/ /PROJECTILES with bursting charge",null,null,"F-B S-X"]
["IMDG_0171_8800/ /AMMUNITION, ILLUMINATING with or without burster, expelling charge or propelling charge",null,null,"F-B S-X"]
["IMDG_0173_8821/ /RELEASE DEVICES, EXPLOSIVE",null,null,"F-B S-X"]
["IMDG_0174_8822/ /RIVETS, EXPLOSIVE",null,null,"F-B S-X"]
["IMDG_0180_8823/ /ROCKETS with bursting charge",null,null,"F-B S-X"]
["IMDG_0181_8824/ /ROCKETS with bursting charge",null,null,"F-B S-X"]
["IMDG_0182_8825/ /ROCKETS with bursting charge",null,null,"F-B S-X"]
["IMDG_0183_8826/ /ROCKETS with inert head",null,null,"F-B S-X"]
["IMDG_0186_8827/ /ROCKET MOTORS",null,null,"F-B S-X"]
["IMDG_0190_8828/ /SAMPLES, EXPLOSIVE other than initiating explosive",null,null,"F-B S-X"]
["IMDG_0191_8829/ /SIGNAL DEVICES, HAND",null,null,"F-B S-X"]
["IMDG_0192_8830/ /SIGNALS, RAILWAY TRACK, EXPLOSIVE",null,null,"F-B S-X"]
["IMDG_0193_8831/ /SIGNALS, RAILWAY TRACK, EXPLOSIVE",null,null,"F-B S-X"]
["IMDG_0194_8832/ /SIGNALS, DISTRESS, ship",null,null,"F-B S-X"]
["IMDG_0195_8833/ /SIGNALS, DISTRESS, ship",null,null,"F-B S-X"]
["IMDG_0196_8834/ /SIGNALS, SMOKE",null,null,"F-B S-X"]
["IMDG_0197_8835/ /SIGNALS, SMOKE",null,null,"F-B S-X"]
["IMDG_0204_8836/ /SOUNDING DEVICES, EXPLOSIVE",null,null,"F-B S-X"]
["IMDG_0207_8837/ /TETRANITROANILINE",null,null,"F-B S-Y"]
["IMDG_0208_12030/ /TRINITROPHENYLMETHYL- NITRAMINE (TETRYL)",null,null,"F-B S-Y"]
["IMDG_0209_8839/ /TRINITROTOLUENE (TNT) dry or wetted with less than 30% water, by mass",null,null,"F-B S-Y"]
["IMDG_0212_8840/ /TRACERS FOR AMMUNITION",null,null,"F-B S-X"]
["IMDG_0213_8841/ /TRINITROANISOLE",null,null,"F-B S-Y"]
["IMDG_0214_8842/ /TRINITROBENZENE dry or wetted with less than 30% water, by mass",null,null,"F-B S-Y"]
["IMDG_0215_8843/ /TRINITROBENZOIC ACID dry or wetted with less than 30% water, by mass",null,null,"F-B S-Y"]
["IMDG_0216_8844/ /TRINITRO-m-CRESOL",null,null,"F-B S-Y"]
["IMDG_0217_8845/ /TRINITRONAPHTHALENE",null,null,"F-B S-Y"]
["IMDG_0218_8846/ /TRINITROPHENETOLE",null,null,"F-B S-Y"]
["IMDG_0219_8847/ /TRINITRORESORCINOL (STYPHNIC ACID) dry or wetted with less than 20% water, or mixture of alcohol and water, by mass",null,null,"F-B S-Y"]
["IMDG_0220_8848/ /UREA NITRATE dry or wetted with less than 20% water, by mass",null,null,"F-B S-Y"]
["IMDG_0221_8849/ /WARHEADS, TORPEDO with bursting charge",null,null,"F-B S-X"]
["IMDG_0222_8850/ /AMMONIUM NITRATE",null,null,"F-B S-Y"]
["IMDG_0224_8851/ /BARIUM AZIDE, dry or wetted with less than 50% water, by mass",null,null,"F-B S-Z"]
["IMDG_0225_8852/ /BOOSTERS WITH DETONATOR",null,null,"F-B S-X"]
["IMDG_0226_12031/ /CYCLOTETRAMETHYLENE- TETRANITRAMINE (HMX; OCTOGEN), WETTED with not less than 15% water, by mass",null,null,"F-B S-Y"]
["IMDG_0234_8854/ /SODIUM DINITRO-o-CRESOLATE dry or wetted with less than 15% water, by mass",null,"P","F-B S-Z"]
["IMDG_0235_8855/ /SODIUM PICRAMATE dry or wetted with less than 20% water, by mass",null,null,"F-B S-Y"]
["IMDG_0236_8856/ /ZIRCONIUM PICRAMATE dry or wetted with less than 20% water, by mass",null,null,"F-B S-Y"]
["IMDG_0237_8857/ /CHARGES, SHAPED, FLEXIBLE, LINEAR",null,null,"F-B S-X"]
["IMDG_0238_8858/ /ROCKETS, LINE-THROWING",null,null,"F-B S-X"]
["IMDG_0240_8859/ /ROCKETS, LINE-THROWING",null,null,"F-B S-X"]
["IMDG_0241_8860/ /EXPLOSIVE, BLASTING, TYPE E",null,null,"F-B S-X"]
["IMDG_0242_8861/ /CHARGES, PROPELLING, FOR CANNON",null,null,"F-B S-X"]
["IMDG_0243_8862/ /AMMUNITION, INCENDIARY, WHITE PHOSPHORUS with burster, expelling charge or propelling charge",null,null,"F-B S-X"]
["IMDG_0244_8863/ /AMMUNITION, INCENDIARY, WHITE PHOSPHORUS with burster, expelling charge or propelling charge",null,null,"F-B S-X"]
["IMDG_0245_8864/ /AMMUNITION, SMOKE, WHITE PHOSPHORUS with burster, expelling charge or propelling charge",null,null,"F-B S-X"]
["IMDG_0246_8865/ /AMMUNITION, SMOKE, WHITE PHOSPHORUS with burster, expelling charge or propelling charge",null,null,"F-B S-X"]
["IMDG_0247_8866/ /AMMUNITION, INCENDIARY liquid or gel, with burster, expelling charge or propelling charge",null,null,"F-B S-X"]
["IMDG_0248_8867/ /CONTRIVANCES, WATER- ACTIVATED with burster, expelling charge or propelling charge",null,null,"F-B S-Y"]
["IMDG_0249_12032/ /CONTRIVANCES, WATER- ACTIVATED with burster, expelling charge or propelling charge",null,null,"F-B S-Y"]
["IMDG_0250_8869/ /ROCKET MOTORS WITH HYPERGOLIC LIQUIDS with or without expelling charge",null,null,"F-B S-X"]
["IMDG_0254_8870/ /AMMUNITION, ILLUMINATING with or without burster, expelling charge or propelling charge",null,null,"F-B S-X"]
["IMDG_0255_8871/ /DETONATORS, ELECTRIC for blasting",null,null,"F-B S-X"]
["IMDG_0257_8872/ /FUZES, DETONATING",null,null,"F-B S-X"]
["IMDG_0266_8873/ /OCTOLITE (OCTOL) dry or wetted with less than 15% water, by mass",null,null,"F-B S-Y"]
["IMDG_0267_8874/ /DETONATORS, NON-ELECTRIC for blasting",null,null,"F-B S-X"]
["IMDG_0268_8875/ /BOOSTERS WITH DETONATOR",null,null,"F-B S-X"]
["IMDG_0271_8876/ /CHARGES, PROPELLING",null,null,"F-B S-X"]
["IMDG_0272_8877/ /CHARGES, PROPELLING",null,null,"F-B S-X"]
["IMDG_0275_8878/ /CARTRIDGES, POWER DEVICE",null,null,"F-B S-X"]
["IMDG_0276_8879/ /CARTRIDGES, POWER DEVICE",null,null,"F-B S-X"]
["IMDG_0277_8880/ /CARTRIDGES, OIL WELL",null,null,"F-B S-X"]
["IMDG_0278_8881/ /CARTRIDGES, OIL WELL",null,null,"F-B S-X"]
["IMDG_0279_8882/ /CHARGES, PROPELLING, FOR CANNON",null,null,"F-B S-X"]
["IMDG_0280_8883/ /ROCKET MOTORS",null,null,"F-B S-X"]
["IMDG_0281_8884/ /ROCKET MOTORS",null,null,"F-B S-X"]
["IMDG_0282_8885/ /NITROGUANIDINE (PICRITE) dry or wetted with less than 20% water, by mass",null,null,"F-B S-Y"]
["IMDG_0283_8886/ /BOOSTERS without detonator",null,null,"F-B S-X"]
["IMDG_0284_8887/ /GRENADES hand or rifle, with bursting charge",null,null,"F-B S-X"]
["IMDG_0285_8888/ /GRENADES hand or rifle, with bursting charge",null,null,"F-B S-X"]
["IMDG_0286_8889/ /WARHEADS, ROCKET with bursting charge",null,null,"F-B S-X"]
["IMDG_0287_8890/ /WARHEADS, ROCKET with bursting charge",null,null,"F-B S-X"]
["IMDG_0288_8891/ /CHARGES, SHAPED, FLEXIBLE, LINEAR",null,null,"F-B S-X"]
["IMDG_0289_8892/ /CORD, DETONATING flexible",null,null,"F-B S-X"]
["IMDG_0290_12033/ /CORD (FUSE), DETONATING metal-clad",null,null,"F-B S-X"]
["IMDG_0291_8894/ /BOMBS with bursting charge",null,null,"F-B S-X"]
["IMDG_0292_8895/ /GRENADES hand or rifle, with bursting charge",null,null,"F-B S-X"]
["IMDG_0293_8896/ /GRENADES hand or rifle, with bursting charge",null,null,"F-B S-X"]
["IMDG_0294_8897/ /MINES with bursting charge",null,null,"F-B S-X"]
["IMDG_0295_8898/ /ROCKETS with bursting charge",null,null,"F-B S-X"]
["IMDG_0296_8899/ /SOUNDING DEVICES, EXPLOSIVE",null,null,"F-B S-X"]
["IMDG_0297_8900/ /AMMUNITION, ILLUMINATING with or without burster, expelling charge or propelling charge",null,null,"F-B S-X"]
["IMDG_0299_8921/ /BOMBS, PHOTO-FLASH",null,null,"F-B S-X"]
["IMDG_0300_8922/ /AMMUNITION, INCENDIARY with or without burster, expelling charge or propelling charge",null,null,"F-B S-X"]
["IMDG_0301_12034/ /AMMUNITION, TEAR- PRODUCING with burster, expelling charge or propelling charge",null,null,"F-B S-Z"]
["IMDG_0303_8924/ /AMMUNITION, SMOKE with or without burster, expelling charge or propelling charge",null,null,"F-B S-X"]
["IMDG_0305_8925/ /FLASH POWDER",null,null,"F-B S-Y"]
["IMDG_0306_8926/ /TRACERS FOR AMMUNITION",null,null,"F-B S-X"]
["IMDG_0312_8927/ /CARTRIDGES, SIGNAL",null,null,"F-B S-X"]
["IMDG_0313_8928/ /SIGNALS, SMOKE",null,null,"F-B S-X"]
["IMDG_0314_8929/ /IGNITERS",null,null,"F-B S-X"]
["IMDG_0315_8930/ /IGNITERS",null,null,"F-B S-X"]
["IMDG_0316_8931/ /FUZES, IGNITING",null,null,"F-B S-X"]
["IMDG_0317_8932/ /FUZES, IGNITING",null,null,"F-B S-X"]
["IMDG_0318_8933/ /GRENADES, PRACTICE hand or rifle",null,null,"F-B S-X"]
["IMDG_0319_8934/ /PRIMERS, TUBULAR",null,null,"F-B S-X"]
["IMDG_0320_8935/ /PRIMERS, TUBULAR",null,null,"F-B S-X"]
["IMDG_0321_8936/ /CARTRIDGES FOR WEAPONS with bursting charge",null,null,"F-B S-X"]
["IMDG_0322_8937/ /ROCKET MOTORS WITH HYPERGOLIC LIQUIDS with or without expelling charge",null,null,"F-B S-X"]
["IMDG_0323_8938/ /CARTRIDGES, POWER DEVICE",null,null,"F-B S-X"]
["IMDG_0324_8939/ /PROJECTILES with bursting charge",null,null,"F-B S-X"]
["IMDG_0325_8940/ /IGNITERS",null,null,"F-B S-X"]
["IMDG_0326_8941/ /CARTRIDGES FOR WEAPONS, BLANK",null,null,"F-B S-X"]
["IMDG_0327_8942/ /CARTRIDGES FOR WEAPONS, BLANK or CARTRIDGES, SMALL ARMS, BLANK",null,null,"F-B S-X"]
["IMDG_0328_8943/ /CARTRIDGES FOR WEAPONS, INERT PROJECTILE",null,null,"F-B S-X"]
["IMDG_0329_8944/ /TORPEDOES with bursting charge",null,null,"F-B S-X"]
["IMDG_0330_8945/ /TORPEDOES with bursting charge",null,null,"F-B S-X"]
["IMDG_0331_8946/ /EXPLOSIVE, BLASTING, TYPE B (AGENT, BLASTING, TYPE B)",null,null,"F-B S-Y"]
["IMDG_0332_8947/ /EXPLOSIVE, BLASTING, TYPE E (AGENT, BLASTING, TYPE E)",null,null,"F-B S-Y"]
["IMDG_0333_8948/ /FIREWORKS",null,null,"F-B S-X"]
["IMDG_0334_8949/ /FIREWORKS",null,null,"F-B S-X"]
["IMDG_0335_8950/ /FIREWORKS",null,null,"F-B S-X"]
["IMDG_0336_8951/ /FIREWORKS",null,null,"F-B S-X"]
["IMDG_0337_8952/ /FIREWORKS",null,null,"F-B S-X"]
["IMDG_0338_8953/ /CARTRIDGES FOR WEAPONS, BLANK or CARTRIDGES, SMALL ARMS, BLANK",null,null,"F-B S-X"]
["IMDG_0339_8954/ /CARTRIDGES FOR WEAPONS, INERT PROJECTILE or CARTRIDGES, SMALL ARMS",null,null,"F-B S-X"]
["IMDG_0340_8955/ /NITROCELLULOSE dry or wetted with less than 25% water (or alcohol), by mass",null,null,"F-B S-Y"]
["IMDG_0341_8956/ /NITROCELLULOSE unmodified or plasticized with less than 18% plasticizing substance, by mass",null,null,"F-B S-Y"]
["IMDG_0342_8957/ /NITROCELLULOSE, WETTED with not less than 25% alcohol, by mass",null,null,"F-B S-Y"]
["IMDG_0343_8958/ /NITROCELLULOSE, PLASTICIZED with not less than 18% plasticizing substance, by mass",null,null,"F-B S-Y"]
["IMDG_0344_8959/ /PROJECTILES with bursting charge",null,null,"F-B S-X"]
["IMDG_0345_8960/ /PROJECTILES inert, with tracer",null,null,"F-B S-X"]
["IMDG_0346_8961/ /PROJECTILES with burster or expelling charge",null,null,"F-B S-X"]
["IMDG_0347_8962/ /PROJECTILES with burster or expelling charge",null,null,"F-B S-X"]
["IMDG_0348_8963/ /CARTRIDGES FOR WEAPONS with bursting charge",null,null,"F-B S-X"]
["IMDG_0349_8964/ /ARTICLES, EXPLOSIVE, N.O.S.",null,null,"F-B S-X"]
["IMDG_0350_8965/ /ARTICLES, EXPLOSIVE, N.O.S.",null,null,"F-B S-X"]
["IMDG_0351_8966/ /ARTICLES, EXPLOSIVE, N.O.S.",null,null,"F-B S-X"]
["IMDG_0352_8967/ /ARTICLES, EXPLOSIVE, N.O.S.",null,null,"F-B S-X"]
["IMDG_0353_8968/ /ARTICLES, EXPLOSIVE, N.O.S.",null,null,"F-B S-X"]
["IMDG_0354_8969/ /ARTICLES, EXPLOSIVE, N.O.S.",null,null,"F-B S-X"]
["IMDG_0355_8970/ /ARTICLES, EXPLOSIVE, N.O.S.",null,null,"F-B S-X"]
["IMDG_0356_8971/ /ARTICLES, EXPLOSIVE, N.O.S.",null,null,"F-B S-X"]
["IMDG_0357_8972/ /SUBSTANCES, EXPLOSIVE, N.O.S.",null,null,"F-B S-Y"]
["IMDG_0358_8973/ /SUBSTANCES, EXPLOSIVE, N.O.S.",null,null,"F-B S-Y"]
["IMDG_0359_8974/ /SUBSTANCES, EXPLOSIVE, N.O.S.",null,null,"F-B S-Y"]
["IMDG_0360_8975/ /DETONATOR ASSEMBLIES, NON-ELECTRIC for blasting",null,null,"F-B S-X"]
["IMDG_0361_8976/ /DETONATOR ASSEMBLIES, NON-ELECTRIC for blasting",null,null,"F-B S-X"]
["IMDG_0362_8977/ /AMMUNITION, PRACTICE",null,null,"F-B S-X"]
["IMDG_0363_8978/ /AMMUNITION, PROOF",null,null,"F-B S-X"]
["IMDG_0364_8979/ /DETONATORS FOR AMMUNITION",null,null,"F-B S-X"]
["IMDG_0365_8980/ /DETONATORS FOR AMMUNITION",null,null,"F-B S-X"]
["IMDG_0366_9001/ /DETONATORS FOR AMMUNITION",null,null,"F-B S-X"]
["IMDG_0367_9002/ /FUZES, DETONATING",null,null,"F-B S-X"]
["IMDG_0368_9003/ /FUZES, IGNITING",null,null,"F-B S-X"]
["IMDG_0369_9004/ /WARHEADS, ROCKET with bursting charge",null,null,"F-B S-X"]
["IMDG_0370_9005/ /WARHEADS, ROCKET with burster or expelling charge",null,null,"F-B S-X"]
["IMDG_0371_9006/ /WARHEADS, ROCKET with burster or expelling charge",null,null,"F-B S-X"]
["IMDG_0372_9007/ /GRENADES, PRACTICE hand or rifle",null,null,"F-B S-X"]
["IMDG_0373_9008/ /SIGNAL DEVICES, HAND",null,null,"F-B S-X"]
["IMDG_0374_9009/ /SOUNDING DEVICES, EXPLOSIVE",null,null,"F-B S-X"]
["IMDG_0375_9010/ /SOUNDING DEVICES, EXPLOSIVE",null,null,"F-B S-X"]
["IMDG_0376_9011/ /PRIMERS, TUBULAR",null,null,"F-B S-X"]
["IMDG_0377_9012/ /PRIMERS, CAP TYPE",null,null,"F-B S-X"]
["IMDG_0378_9013/ /PRIMERS, CAP TYPE",null,null,"F-B S-X"]
["IMDG_0379_9014/ /CASES, CARTRIDGE, EMPTY, WITH PRIMER",null,null,"F-B S-X"]
["IMDG_0380_9015/ /ARTICLES, PYROPHORIC",null,null,"F-B S-X"]
["IMDG_0381_9016/ /CARTRIDGES, POWER DEVICE",null,null,"F-B S-X"]
["IMDG_0382_9017/ /COMPONENTS, EXPLOSIVE TRAIN, N.O.S.",null,null,"F-B S-X"]
["IMDG_0383_9018/ /COMPONENTS, EXPLOSIVE TRAIN, N.O.S.",null,null,"F-B S-X"]
["IMDG_0384_9019/ /COMPONENTS, EXPLOSIVE TRAIN, N.O.S.",null,null,"F-B S-X"]
["IMDG_0385_9020/ /5-NITROBENZOTRIAZOL",null,null,"F-B S-Y"]
["IMDG_0386_12035/ /TRINITROBENZENE-SULPHONIC ACID",null,null,"F-B S-Y"]
["IMDG_0387_9022/ /TRINITROFLUORENONE",null,null,"F-B S-Y"]
["IMDG_0388_9023/ /TRINITROTOLUENE (TNT) AND TRINITROBENZENE MIXTURE or TRINITROTOLUENE (TNT) AND HEXANITROSTILBENE MIXTURE",null,null,"F-B S-Y"]
["IMDG_0389_12036/ /TRINITROTOLUENE (TNT) MIXTURE CONTAINING TRINITROBENZENE AND HEXANITROSTILBENE",null,null,"F-B S-Y"]
["IMDG_0390_9025/ /TRITONAL",null,null,"F-B S-Y"]
["IMDG_0391_12037/ /CYCLOTRIMETHYLENE- TRINITRAMINE (CYCLONITE; HEXOGEN; RDX) AND CYCLOTETRAMETHYLENE- TETRANITRAMINE (HMX; OCTOGEN) MIXTURE, WETTED with not less than 15% water, by mass or CYCLOTRIMETHYLENE- TRINITRAMINE (CYCLONITE; HEXOGEN; RDX) AND CYCLOTETRAMETHYLENE- TETRANITRAMINE (HMX; OCTOGEN) MIXTURE, DESENSITIZED with not less than 10% phlegmatizer, by mass",null,null,"F-B S-Y"]
["IMDG_0392_9027/ /HEXANITROSTILBENE",null,null,"F-B S-Y"]
["IMDG_0393_9028/ /HEXOTONAL",null,null,"F-B S-Y"]
["IMDG_0394_9029/ /TRINITRORESORCINOL (STYPHNIC ACID), WETTED with not less than 20% water, or mixture of alcohol and water, by mass",null,null,"F-B S-Y"]
["IMDG_0395_9030/ /ROCKET MOTORS, LIQUID FUELLED",null,null,"F-B S-X"]
["IMDG_0396_9031/ /ROCKET MOTORS, LIQUID FUELLED",null,null,"F-B S-X"]
["IMDG_0397_9032/ /ROCKETS, LIQUID FUELLED with bursting charge",null,null,"F-B S-X"]
["IMDG_0398_9033/ /ROCKETS, LIQUID FUELLED with bursting charge",null,null,"F-B S-X"]
["IMDG_0399_9034/ /BOMBS WITH FLAMMABLE LIQUID with bursting charge",null,null,"F-B S-X"]
["IMDG_0400_9035/ /BOMBS WITH FLAMMABLE LIQUID with bursting charge",null,null,"F-B S-X"]
["IMDG_0401_9036/ /DIPICRYL SULPHIDE dry or wetted with less than 10% water, by mass",null,null,"F-B S-Y"]
["IMDG_0402_9037/ /AMMONIUM PERCHLORATE",null,null,"F-B S-Y"]
["IMDG_0403_9038/ /FLARES, AERIAL",null,null,"F-B S-X"]
["IMDG_0404_9039/ /FLARES, AERIAL",null,null,"F-B S-X"]
["IMDG_0405_9040/ /CARTRIDGES, SIGNAL",null,null,"F-B S-X"]
["IMDG_0406_9061/ /DINITROSOBENZENE",null,null,"F-B S-Y"]
["IMDG_0407_9062/ /TETRAZOL-1-ACETIC ACID",null,null,"F-B S-Y"]
["IMDG_0408_9063/ /FUZES, DETONATING with protective features",null,null,"F-B S-X"]
["IMDG_0409_9064/ /FUZES, DETONATING with protective features",null,null,"F-B S-X"]
["IMDG_0410_9065/ /FUZES, DETONATING with protective features",null,null,"F-B S-X"]
["IMDG_0411_9066/ /PENTAERYTHRITE TETRANITRATE (PENTAERYTHRITOL TETRANITRATE; PETN) with not less than 7% wax, by mass",null,null,"F-B S-Y"]
["IMDG_0412_9067/ /CARTRIDGES FOR WEAPONS with bursting charge",null,null,"F-B S-X"]
["IMDG_0413_9068/ /CARTRIDGES FOR WEAPONS, BLANK",null,null,"F-B S-X"]
["IMDG_0414_9069/ /CHARGES, PROPELLING, FOR CANNON",null,null,"F-B S-X"]
["IMDG_0415_9070/ /CHARGES, PROPELLING",null,null,"F-B S-X"]
["IMDG_0417_9071/ /CARTRIDGES FOR WEAPONS, INERT PROJECTILE or CARTRIDGES, SMALL ARMS",null,null,"F-B S-X"]
["IMDG_0418_9072/ /FLARES, SURFACE",null,null,"F-B S-X"]
["IMDG_0419_9073/ /FLARES, SURFACE",null,null,"F-B S-X"]
["IMDG_0420_9074/ /FLARES, AERIAL",null,null,"F-B S-X"]
["IMDG_0421_9075/ /FLARES, AERIAL",null,null,"F-B S-X"]
["IMDG_0424_9076/ /PROJECTILES inert, with tracer",null,null,"F-B S-X"]
["IMDG_0425_9077/ /PROJECTILES inert, with tracer",null,null,"F-B S-X"]
["IMDG_0426_9078/ /PROJECTILES with burster or expelling charge",null,null,"F-B S-X"]
["IMDG_0427_9079/ /PROJECTILES with burster or expelling charge",null,null,"F-B S-X"]
["IMDG_0428_9080/ /ARTICLES, PYROTECHNIC for technical purposes",null,null,"F-B S-X"]
["IMDG_0429_9081/ /ARTICLES, PYROTECHNIC for technical purposes",null,null,"F-B S-X"]
["IMDG_0430_9082/ /ARTICLES, PYROTECHNIC for technical purposes",null,null,"F-B S-X"]
["IMDG_0431_9083/ /ARTICLES, PYROTECHNIC for technical purposes",null,null,"F-B S-X"]
["IMDG_0432_9084/ /ARTICLES, PYROTECHNIC for technical purposes",null,null,"F-B S-X"]
["IMDG_0433_9085/ /POWDER CAKE (POWDER PASTE), WETTED with not less than 17% alcohol, by mass",null,null,"F-B S-Y"]
["IMDG_0434_9086/ /PROJECTILES with burster or expelling charge",null,null,"F-B S-X"]
["IMDG_0435_9087/ /PROJECTILES with burster or expelling charge",null,null,"F-B S-X"]
["IMDG_0436_9088/ /ROCKETS with expelling charge",null,null,"F-B S-X"]
["IMDG_0437_9089/ /ROCKETS with expelling charge",null,null,"F-B S-X"]
["IMDG_0438_9090/ /ROCKETS with expelling charge",null,null,"F-B S-X"]
["IMDG_0439_9091/ /CHARGES, SHAPED without detonator",null,null,"F-B S-X"]
["IMDG_0440_9092/ /CHARGES, SHAPED without detonator",null,null,"F-B S-X"]
["IMDG_0441_9093/ /CHARGES, SHAPED without detonator",null,null,"F-B S-X"]
["IMDG_0442_9094/ /CHARGES, EXPLOSIVE, COMMERCIAL without detonator",null,null,"F-B S-X"]
["IMDG_0443_9095/ /CHARGES, EXPLOSIVE, COMMERCIAL without detonator",null,null,"F-B S-X"]
["IMDG_0444_9096/ /CHARGES, EXPLOSIVE, COMMERCIAL without detonator",null,null,"F-B S-X"]
["IMDG_0445_9097/ /CHARGES, EXPLOSIVE, COMMERCIAL without detonator",null,null,"F-B S-X"]
["IMDG_0446_9098/ /CASES, COMBUSTIBLE, EMPTY, WITHOUT PRIMER",null,null,"F-B S-X"]
["IMDG_0447_9099/ /CASES, COMBUSTIBLE, EMPTY, WITHOUT PRIMER",null,null,"F-B S-X"]
["IMDG_0448_12038/ /5-MERCAPTOTETRAZOL-1- ACETIC ACID",null,null,"F-B S-Y"]
["IMDG_0449_9101/ /TORPEDOES, LIQUID FUELLED with or without bursting charge",null,null,"F-B S-X"]
["IMDG_0450_9102/ /TORPEDOES, LIQUID FUELLED with inert head",null,null,"F-B S-X"]
["IMDG_0451_9103/ /TORPEDOES with bursting charge",null,null,"F-B S-X"]
["IMDG_0452_9104/ /GRENADES, PRACTICE hand or rifle",null,null,"F-B S-X"]
["IMDG_0453_9105/ /ROCKETS, LINE-THROWING",null,null,"F-B S-X"]
["IMDG_0454_9106/ /IGNITERS",null,null,"F-B S-X"]
["IMDG_0455_9107/ /DETONATORS, NON-ELECTRIC for blasting",null,null,"F-B S-X"]
["IMDG_0456_9108/ /DETONATORS, ELECTRIC for blasting",null,null,"F-B S-X"]
["IMDG_0457_9109/ /CHARGES, BURSTING, PLASTICS BONDED",null,null,"F-B S-X"]
["IMDG_0458_9110/ /CHARGES, BURSTING, PLASTICS BONDED",null,null,"F-B S-X"]
["IMDG_0459_9111/ /CHARGES, BURSTING, PLASTICS BONDED",null,null,"F-B S-X"]
["IMDG_0460_9112/ /CHARGES, BURSTING, PLASTICS BONDED",null,null,"F-B S-X"]
["IMDG_0461_9113/ /COMPONENTS, EXPLOSIVE TRAIN, N.O.S.",null,null,"F-B S-X"]
["IMDG_0462_9114/ /ARTICLES, EXPLOSIVE, N.O.S.",null,null,"F-B S-X"]
["IMDG_0463_9115/ /ARTICLES, EXPLOSIVE, N.O.S.",null,null,"F-B S-X"]
["IMDG_0464_9116/ /ARTICLES, EXPLOSIVE, N.O.S.",null,null,"F-B S-X"]
["IMDG_0465_9117/ /ARTICLES, EXPLOSIVE, N.O.S.",null,null,"F-B S-X"]
["IMDG_0466_9118/ /ARTICLES, EXPLOSIVE, N.O.S.",null,null,"F-B S-X"]
["IMDG_0467_9119/ /ARTICLES, EXPLOSIVE, N.O.S.",null,null,"F-B S-X"]
["IMDG_0468_9120/ /ARTICLES, EXPLOSIVE, N.O.S.",null,null,"F-B S-X"]
["IMDG_0469_9141/ /ARTICLES, EXPLOSIVE, N.O.S.",null,null,"F-B S-X"]
["IMDG_0470_9142/ /ARTICLES, EXPLOSIVE, N.O.S.",null,null,"F-B S-X"]
["IMDG_0471_9143/ /ARTICLES, EXPLOSIVE, N.O.S.",null,null,"F-B S-X"]
["IMDG_0472_9144/ /ARTICLES, EXPLOSIVE, N.O.S.",null,null,"F-B S-X"]
["IMDG_0473_9145/ /SUBSTANCES, EXPLOSIVE, N.O.S.",null,null,"F-B S-Y"]
["IMDG_0474_9146/ /SUBSTANCES, EXPLOSIVE, N.O.S.",null,null,"F-B S-Y"]
["IMDG_0475_9147/ /SUBSTANCES, EXPLOSIVE, N.O.S.",null,null,"F-B S-Y"]
["IMDG_0476_9148/ /SUBSTANCES, EXPLOSIVE, N.O.S.",null,null,"F-B S-Y"]
["IMDG_0477_9149/ /SUBSTANCES, EXPLOSIVE, N.O.S.",null,null,"F-B S-Y"]
["IMDG_0478_9150/ /SUBSTANCES, EXPLOSIVE, N.O.S.",null,null,"F-B S-Y"]
["IMDG_0479_9151/ /SUBSTANCES, EXPLOSIVE, N.O.S.",null,null,"F-B S-Y"]
["IMDG_0480_9152/ /SUBSTANCES, EXPLOSIVE, N.O.S.",null,null,"F-B S-Y"]
["IMDG_0481_9153/ /SUBSTANCES, EXPLOSIVE, N.O.S.",null,null,"F-B S-Y"]
["IMDG_0482_9154/ /SUBSTANCES, EXPLOSIVE, VERY INSENSITIVE (SUBSTANCES, EVI), N.O.S.",null,null,"F-B S-Y"]
["IMDG_0483_12039/ /CYCLOTRIMETHYLENE- TRINITRAMINE (CYCLONITE; HEXOGEN; RDX), DESENSITIZED",null,null,"F-B S-Y"]
["IMDG_0484_12040/ /CYCLOTETRAMETHYLENE- TETRANITRAMINE (OCTOGEN; HMX), DESENSITIZED",null,null,"F-B S-Y"]
["IMDG_0485_9157/ /SUBSTANCES, EXPLOSIVE, N.O.S.",null,null,"F-B S-Y"]
["IMDG_0486_9158/ /ARTICLES, EXPLOSIVE, EXTREMELY INSENSITIVE (ARTICLES, EEI)",null,null,"F-B S-X"]
["IMDG_0487_9159/ /SIGNALS, SMOKE",null,null,"F-B S-X"]
["IMDG_0488_9160/ /AMMUNITION, PRACTICE",null,null,"F-B S-X"]
["IMDG_0489_9161/ /DINITROGLYCOLURIL (DINGU)",null,null,"F-B S-Y"]
["IMDG_0490_9162/ /NITROTRIAZOLONE (NTO)",null,null,"F-B S-Y"]
["IMDG_0491_9163/ /CHARGES, PROPELLING",null,null,"F-B S-X"]
["IMDG_0492_9164/ /SIGNALS, RAILWAY TRACK, EXPLOSIVE",null,null,"F-B S-X"]
["IMDG_0493_9165/ /SIGNALS, RAILWAY TRACK, EXPLOSIVE",null,null,"F-B S-X"]
["IMDG_0494_9166/ /JET PERFORATING GUNS, CHARGED oil well, without detonator",null,null,"F-B S-X"]
["IMDG_0495_9167/ /PROPELLANT, LIQUID",null,null,"F-B S-Y"]
["IMDG_0496_9168/ /OCTONAL",null,null,"F-B S-Y"]
["IMDG_0497_9169/ /PROPELLANT, LIQUID",null,null,"F-B S-Y"]
["IMDG_0498_9170/ /PROPELLANT, SOLID",null,null,"F-B S-Y"]
["IMDG_0499_9171/ /PROPELLANT, SOLID",null,null,"F-B S-Y"]
["IMDG_0500_9172/ /DETONATOR ASSEMBLIES, NON-ELECTRIC for blasting",null,null,"F-B S-Y"]
["IMDG_0501_9173/ /PROPELLANT, SOLID",null,null,"F-B S-X"]
["IMDG_0502_9174/ /ROCKETS with inert head",null,null,"F-B S-X"]
["IMDG_0503_9175/ /SAFETY DEVICES, PYROTECHNIC",null,null,"F-B S-X"]
["IMDG_0504_9176/ /1H-TETRAZOLE",null,null,"F-B S-Y"]
["IMDG_0505_9177/ /SIGNALS, DISTRESS, ship",null,null,"F-B S-X"]
["IMDG_0506_9178/ /SIGNALS, DISTRESS, ship",null,null,"F-B S-X"]
["IMDG_0507_9179/ /SIGNALS, SMOKE",null,null,"F-B S-X"]
["IMDG_0508_9180/ /1-HYDROXYBENZOTRIAZOLE, ANHYDROUS, dry or wetted with less than 20% water, by mass",null,null,"F-B S-Y"]
["IMDG_0509_9201/ /POWDER, SMOKELESS",null,null,"F-B S-Y"]
["IMDG_0510_12041/ /ROCKET MOTORS",null,null,"F-B S-X"]
["IMDG_1001_9202/ /ACETYLENE, DISSOLVED",null,null,"F-D S-U"]
["IMDG_1002_9203/ /AIR, COMPRESSED",null,null,"F-C S-V"]
["IMDG_1003_9204/ /AIR, REFRIGERATED LIQUID",null,null,"F-C S-W"]
["IMDG_1005_9205/ /AMMONIA, ANHYDROUS",null,"P","F-C S-U"]
["IMDG_1006_9206/ /ARGON, COMPRESSED",null,null,"F-C S-V"]
["IMDG_1008_9207/ /BORON TRIFLUORIDE",null,null,"F-C S-U"]
["IMDG_1009_9208/ /BROMOTRIFLUOROMETHANE (REFRIGERANT GAS R 13B1)",null,null,"F-C S-V"]
["IMDG_1010_9209/ /BUTADIENES, STABILIZED or BUTADIENES AND HYDROCARBON MIXTURE, STABILIZED, containing more than 40% butadienes",null,null,"F-D S-U"]
["IMDG_1011_9210/ /BUTANE",null,null,"F-D S-U"]
["IMDG_1012_9211/ /BUTYLENE",null,null,"F-D S-U"]
["IMDG_1013_9212/ /CARBON DIOXIDE",null,null,"F-C S-V"]
["IMDG_1016_9213/ /CARBON MONOXIDE, COMPRESSED",null,null,"F-D S-U"]
["IMDG_1017_9214/ /CHLORINE",null,"P","F-C S-U"]
["IMDG_1018_9215/ /CHLORODIFLUOROMETHANE (REFRIGERANT GAS R 22)",null,null,"F-C S-V"]
["IMDG_1020_12042/ /CHLOROPENTAFLUORO- ETHANE (REFRIGERANT GAS R 115)",null,null,"F-C S-V"]
["IMDG_1021_12043/ /1-CHLORO-1,2,2,2-TETRA- FLUOROETHANE (REFRIGERANT GAS R 124)",null,null,"F-C S-V"]
["IMDG_1022_9218/ /CHLOROTRIFLUOROMETHANE (REFRIGERANT GAS R 13)",null,null,"F-C S-V"]
["IMDG_1023_9219/ /COAL GAS, COMPRESSED",null,null,"F-D S-U"]
["IMDG_1026_9220/ /CYANOGEN",null,null,"F-D S-U"]
["IMDG_1027_9221/ /CYCLOPROPANE",null,null,"F-D S-U"]
["IMDG_1028_9222/ /DICHLORODIFLUOROMETHANE (REFRIGERANT GAS R 12)",null,null,"F-C S-V"]
["IMDG_1029_9223/ /DICHLOROFLUOROMETHANE (REFRIGERANT GAS R 21)",null,null,"F-C S-V"]
["IMDG_1030_9224/ /1,1-DIFLUOROETHANE (REFRIGERANT GAS R 152a)",null,null,"F-D S-U"]
["IMDG_1032_9225/ /DIMETHYLAMINE, ANHYDROUS",null,null,"F-D S-U"]
["IMDG_1033_9226/ /DIMETHYL ETHER",null,null,"F-D S-U"]
["IMDG_1035_9227/ /ETHANE",null,null,"F-D S-U"]
["IMDG_1036_9228/ /ETHYLAMINE",null,null,"F-D S-U"]
["IMDG_1037_9229/ /ETHYL CHLORIDE",null,null,"F-D S-U"]
["IMDG_1038_9230/ /ETHYLENE, REFRIGERATED LIQUID",null,null,"F-D S-U"]
["IMDG_1039_9231/ /ETHYL METHYL ETHER",null,null,"F-D S-U"]
["IMDG_1040_12044/ /ETHYLENE OXIDE or ETHYLENE OXIDE WITH NITROGEN up to a total pressure of 1 MPa (10 bar) at 50°C",null,null,"F-D S-U"]
["IMDG_1041_9233/ /ETHYLENE OXIDE AND CARBON DIOXIDE MIXTURE with more than 9% but not more than 87% ethylene oxide",null,null,"F-D S-U"]
["IMDG_1043_9234/ /FERTILIZER AMMONIATING SOLUTION with free ammonia",null,null,"F-C S-V"]
["IMDG_1044_9235/ /FIRE EXTINGUISHERS with compressed or liquefied gas",null,null,"F-C S-V"]
["IMDG_1045_9236/ /FLUORINE, COMPRESSED",null,null,"F-C S-W"]
["IMDG_1046_9237/ /HELIUM, COMPRESSED",null,null,"F-C S-V"]
["IMDG_1048_9238/ /HYDROGEN BROMIDE, ANHYDROUS",null,null,"F-C S-U"]
["IMDG_1049_9239/ /HYDROGEN, COMPRESSED",null,null,"F-D S-U"]
["IMDG_1050_9240/ /HYDROGEN CHLORIDE, ANHYDROUS",null,null,"F-C S-U"]
["IMDG_1051_9261/I/HYDROGEN CYANIDE, STABILIZED containing less than 3% water","I","P","F-E S-D"]
["IMDG_1052_9262/I/HYDROGEN FLUORIDE, ANHYDROUS","I",null,"F-C S-U"]
["IMDG_1053_9263/ /HYDROGEN SULPHIDE",null,null,"F-D S-U"]
["IMDG_1055_9264/ /ISOBUTYLENE",null,null,"F-D S-U"]
["IMDG_1056_9265/ /KRYPTON, COMPRESSED",null,null,"F-C S-V"]
["IMDG_1057_9266/ /LIGHTERS or LIGHTER REFILLS containing flammable gas",null,null,"F-D S-U"]
["IMDG_1058_9267/ /LIQUEFIED GASES non-flammable, charged with nitrogen, carbon dioxide or air",null,null,"F-C S-V"]
["IMDG_1060_9268/ /METHYLACETYLENE AND PROPADIENE MIXTURE, STABILIZED",null,null,"F-D S-U"]
["IMDG_1061_9269/ /METHYLAMINE, ANHYDROUS",null,null,"F-D S-U"]
["IMDG_1062_9270/ /METHYL BROMIDE with not more than 2.0% chloropicrin",null,null,"F-C S-U"]
["IMDG_1063_9271/ /METHYL CHLORIDE (REFRIGERANT GAS R 40)",null,null,"F-D S-U"]
["IMDG_1064_9272/ /METHYL MERCAPTAN",null,"P","F-D S-U"]
["IMDG_1065_9273/ /NEON, COMPRESSED",null,null,"F-C S-V"]
["IMDG_1066_9274/ /NITROGEN, COMPRESSED",null,null,"F-C S-V"]
["IMDG_1067_9275/ /DINITROGEN TETROXIDE (NITROGEN DIOXIDE)",null,null,"F-C S-W"]
["IMDG_1069_9276/ /NITROSYL CHLORIDE",null,null,"F-C S-U"]
["IMDG_1070_9277/ /NITROUS OXIDE",null,null,"F-C S-W"]
["IMDG_1071_9278/ /OIL GAS, COMPRESSED",null,null,"F-D S-U"]
["IMDG_1072_9279/ /OXYGEN, COMPRESSED",null,null,"F-C S-W"]
["IMDG_1073_9280/ /OXYGEN, REFRIGERATED LIQUID",null,null,"F-C S-W"]
["IMDG_1075_9281/ /PETROLEUM GASES, LIQUEFIED",null,null,"F-D S-U"]
["IMDG_1076_9282/ /PHOSGENE",null,null,"F-C S-U"]
["IMDG_1077_9283/ /PROPYLENE",null,null,"F-D S-U"]
["IMDG_1078_9284/ /REFRIGERANT GAS, N.O.S.",null,null,"F-C S-V"]
["IMDG_1079_9285/ /SULPHUR DIOXIDE",null,null,"F-C S-U"]
["IMDG_1080_9286/ /SULPHUR HEXAFLUORIDE",null,null,"F-C S-V"]
["IMDG_1081_9287/ /TETRAFLUOROETHYLENE, STABILIZED",null,null,"F-D S-U"]
["IMDG_1082_12045/ /TRIFLUOROCHLORO- ETHYLENE, STABILIZED (REFRIGERANT GAS R 1113)",null,null,"F-D S-U"]
["IMDG_1083_9289/ /TRIMETHYLAMINE, ANHYDROUS",null,null,"F-D S-U"]
["IMDG_1085_9290/ /VINYL BROMIDE, STABILIZED",null,null,"F-D S-U"]
["IMDG_1086_9291/ /VINYL CHLORIDE, STABILIZED",null,null,"F-D S-U"]
["IMDG_1087_9292/ /VINYL METHYL ETHER, STABILIZED",null,null,"F-D S-U"]
["IMDG_1088_9293/II/ACETAL","II",null,"F-E S-D"]
["IMDG_1089_9294/I/ACETALDEHYDE","I",null,"F-E S-D"]
["IMDG_1090_9295/II/ACETONE","II",null,"F-E S-D"]
["IMDG_1091_9296/II/ACETONE OILS","II",null,"F-E S-D"]
["IMDG_1092_9297/I/ACROLEIN, STABILIZED","I","P","F-E S-D"]
["IMDG_1093_9298/I/ACRYLONITRILE, STABILIZED","I",null,"F-E S-D"]
["IMDG_1098_9299/I/ALLYL ALCOHOL","I","P","F-E S-D"]
["IMDG_1099_9300/I/ALLYL BROMIDE","I","P","F-E S-D"]
["IMDG_1100_9321/I/ALLYL CHLORIDE","I",null,"F-E S-D"]
["IMDG_1104_9322/III/AMYL ACETATES","III",null,"F-E S-D"]
["IMDG_1105_9323/II/PENTANOLS","II",null,"F-E S-D"]
["IMDG_1105_9324/III/PENTANOLS","III",null,"F-E S-D"]
["IMDG_1106_9325/II/AMYLAMINE","II",null,"F-E S-C"]
["IMDG_1106_9326/III/AMYLAMINE","III",null,"F-E S-C"]
["IMDG_1107_9327/II/AMYL CHLORIDE","II",null,"F-E S-D"]
["IMDG_1108_9328/I/1-PENTENE (n-AMYLENE)","I",null,"F-E S-D"]
["IMDG_1109_9329/III/AMYL FORMATES","III",null,"F-E S-D"]
["IMDG_1110_9330/III/n-AMYL METHYL KETONE","III",null,"F-E S-D"]
["IMDG_1111_9331/II/AMYL MERCAPTAN","II",null,"F-E S-D"]
["IMDG_1112_9332/III/AMYL NITRATE","III",null,"F-E S-D"]
["IMDG_1113_9333/II/AMYL NITRITE","II",null,"F-E S-D"]
["IMDG_1114_9334/II/BENZENE","II",null,"F-E S-D"]
["IMDG_1120_9335/II/BUTANOLS","II",null,"F-E S-D"]
["IMDG_1120_9336/III/BUTANOLS","III",null,"F-E S-D"]
["IMDG_1123_9337/II/BUTYL ACETATES","II",null,"F-E S-D"]
["IMDG_1123_9338/III/BUTYL ACETATES","III",null,"F-E S-D"]
["IMDG_1125_9339/II/n-BUTYLAMINE","II",null,"F-E S-C"]
["IMDG_1126_9340/II/1-BROMOBUTANE","II",null,"F-E S-D"]
["IMDG_1127_9361/II/CHLOROBUTANES","II",null,"F-E S-D"]
["IMDG_1128_9362/II/n-BUTYL FORMATE","II",null,"F-E S-D"]
["IMDG_1129_9363/II/BUTYRALDEHYDE","II",null,"F-E S-D"]
["IMDG_1130_9364/III/CAMPHOR OIL","III",null,"F-E S-E"]
["IMDG_1131_9365/I/CARBON DISULPHIDE","I",null,"F-E S-D"]
["IMDG_1133_9366/I/ADHESIVES containing flammable liquid","I",null,"F-E S-D"]
["IMDG_1133_9367/II/ADHESIVES containing flammable liquid","II",null,"F-E S-D"]
["IMDG_1133_9368/III/ADHESIVES containing flammable liquid","III",null,"F-E S-D"]
["IMDG_1134_9369/III/CHLOROBENZENE","III",null,"F-E S-D"]
["IMDG_1135_9370/I/ETHYLENE CHLOROHYDRIN","I",null,"F-E S-D"]
["IMDG_1136_9371/II/COAL TAR DISTILLATES, FLAMMABLE","II",null,"F-E S-E"]
["IMDG_1136_9372/III/COAL TAR DISTILLATES, FLAMMABLE","III",null,"F-E S-E"]
["IMDG_1139_12046/I/COATING SOLUTION (includes surface treatments or coatings used for industrial or other purposes such as vehicle under- coating, drum or barrel lining)","I",null,"F-E S-E"]
["IMDG_1139_12047/II/COATING SOLUTION (includes surface treatments or coatings used for industrial or other purposes such as vehicle under- coating, drum or barrel lining)","II",null,"F-E S-E"]
["IMDG_1139_12048/III/COATING SOLUTION (includes surface treatments or coatings used for industrial or other purposes such as vehicle under- coating, drum or barrel lining)","III",null,"F-E S-E"]
["IMDG_1143_9376/I/CROTONALDEHYDE or CROTONALDEHYDE, STABILIZED","I","P","F-E S-D"]
["IMDG_1144_9377/I/CROTONYLENE","I",null,"F-E S-D"]
["IMDG_1145_9378/II/CYCLOHEXANE","II",null,"F-E S-D"]
["IMDG_1146_9379/II/CYCLOPENTANE","II",null,"F-E S-D"]
["IMDG_1147_9380/III/DECAHYDRONAPHTHALENE","III",null,"F-E S-D"]
["IMDG_1148_9381/II/DIACETONE ALCOHOL","II",null,"F-E S-D"]
["IMDG_1148_9382/III/DIACETONE ALCOHOL","III",null,"F-E S-D"]
["IMDG_1149_9383/III/DIBUTYL ETHERS","III",null,"F-E S-D"]
["IMDG_1150_9384/II/1,2-DICHLOROETHYLENE","II",null,"F-E S-D"]
["IMDG_1152_9385/III/DICHLOROPENTANES","III",null,"F-E S-D"]
["IMDG_1153_9386/II/ETHYLENE GLYCOL DIETHYL ETHER","II",null,"F-E S-D"]
["IMDG_1153_9387/III/ETHYLENE GLYCOL DIETHYL ETHER","III",null,"F-E S-D"]
["IMDG_1154_9388/II/DIETHYLAMINE","II",null,"F-E S-C"]
["IMDG_1155_9389/I/DIETHYL ETHER (ETHYL ETHER)","I",null,"F-E S-D"]
["IMDG_1156_9390/II/DIETHYL KETONE","II",null,"F-E S-D"]
["IMDG_1157_9391/III/DIISOBUTYL KETONE","III",null,"F-E S-D"]
["IMDG_1158_9392/II/DIISOPROPYLAMINE","II",null,"F-E S-C"]
["IMDG_1159_9393/II/DIISOPROPYL ETHER","II",null,"F-E S-D"]
["IMDG_1160_9394/II/DIMETHYLAMINE, AQUEOUS SOLUTION","II",null,"F-E S-C"]
["IMDG_1161_9395/II/DIMETHYL CARBONATE","II",null,"F-E S-D"]
["IMDG_1162_9396/II/DIMETHYLDICHLOROSILANE","II",null,"F-E S-C"]
["IMDG_1163_9397/I/DIMETHYLHYDRAZINE, UNSYMMETRICAL","I","P","F-E S-C"]
["IMDG_1164_9398/II/DIMETHYL SULPHIDE","II",null,"F-E S-D"]
["IMDG_1165_9399/II/DIOXANE","II",null,"F-E S-D"]
["IMDG_1166_9400/II/DIOXOLANE","II",null,"F-E S-D"]
["IMDG_1167_9421/I/DIVINYL ETHER, STABILIZED","I",null,"F-E S-D"]
["IMDG_1169_9422/II/EXTRACTS, AROMATIC, LIQUID","II",null,"F-E S-D"]
["IMDG_1169_9423/III/EXTRACTS, AROMATIC, LIQUID","III",null,"F-E S-D"]
["IMDG_1170_9424/II/ETHANOL (ETHYL ALCOHOL) or ETHANOL SOLUTION (ETHYL ALCOHOL SOLUTION)","II",null,"F-E S-D"]
["IMDG_1170_9425/III/ETHANOL (ETHYL ALCOHOL) or ETHANOL SOLUTION (ETHYL ALCOHOL SOLUTION)","III",null,"F-E S-D"]
["IMDG_1171_9426/III/ETHYLENE GLYCOL MONOETHYL ETHER","III",null,"F-E S-D"]
["IMDG_1172_9427/III/ETHYLENE GLYCOL MONOETHYL ETHER ACETATE","III",null,"F-E S-D"]
["IMDG_1173_9428/II/ETHYL ACETATE","II",null,"F-E S-D"]
["IMDG_1175_9429/II/ETHYLBENZENE","II",null,"F-E S-D"]
["IMDG_1176_9430/II/ETHYL BORATE","II",null,"F-E S-D"]
["IMDG_1177_9431/III/2-ETHYLBUTYL ACETATE","III",null,"F-E S-D"]
["IMDG_1178_9432/II/2-ETHYLBUTYRALDEHYDE","II",null,"F-E S-D"]
["IMDG_1179_9433/II/ETHYL BUTYL ETHER","II",null,"F-E S-D"]
["IMDG_1180_9434/III/ETHYL BUTYRATE","III",null,"F-E S-D"]
["IMDG_1181_9435/II/ETHYL CHLOROACETATE","II",null,"F-E S-D"]
["IMDG_1182_9436/I/ETHYL CHLOROFORMATE","I",null,"F-E S-C"]
["IMDG_1183_9437/I/ETHYLDICHLOROSILANE","I",null,"F-G S-O"]
["IMDG_1184_9438/II/ETHYLENE DICHLORIDE","II",null,"F-E S-D"]
["IMDG_1185_9439/I/ETHYLENEIMINE, STABILIZED","I",null,"F-E S-D"]
["IMDG_1188_9440/III/ETHYLENE GLYCOL MONOMETHYL ETHER","III",null,"F-E S-D"]
["IMDG_1189_9441/III/ETHYLENE GLYCOL MONOMETHYL ETHER ACETATE","III",null,"F-E S-D"]
["IMDG_1190_9442/II/ETHYL FORMATE","II",null,"F-E S-D"]
["IMDG_1191_9443/III/OCTYL ALDEHYDES","III",null,"F-E S-D"]
["IMDG_1192_9444/III/ETHYL LACTATE","III",null,"F-E S-D"]
["IMDG_1193_9445/II/ETHYL METHYL KETONE (METHYL ETHYL KETONE)","II",null,"F-E S-D"]
["IMDG_1194_9446/I/ETHYL NITRITE SOLUTION","I",null,"F-E S-D"]
["IMDG_1195_9447/II/ETHYL PROPIONATE","II",null,"F-E S-D"]
["IMDG_1196_9448/II/ETHYLTRICHLOROSILANE","II",null,"F-E S-C"]
["IMDG_1197_9449/II/EXTRACTS, FLAVOURING, LIQUID","II",null,"F-E S-D"]
["IMDG_1197_9450/III/EXTRACTS, FLAVOURING, LIQUID","III",null,"F-E S-D"]
["IMDG_1198_9451/III/FORMALDEHYDE SOLUTION, FLAMMABLE","III",null,"F-E S-C"]
["IMDG_1199_9452/II/FURALDEHYDES","II",null,"F-E S-D"]
["IMDG_1201_9453/II/FUSEL OIL","II",null,"F-E S-D"]
["IMDG_1201_9454/III/FUSEL OIL","III",null,"F-E S-D"]
["IMDG_1202_9455/III/GAS OIL or DIESEL FUEL or HEATING OIL, LIGHT","III",null,"F-E S-E"]
["IMDG_1203_9456/II/MOTOR SPIRIT or GASOLINE or PETROL","II",null,"F-E S-E"]
["IMDG_1204_9457/II/NITROGLYCERIN SOLUTION IN ALCOHOL with not more than 1% nitroglycerin","II",null,"F-E S-D"]
["IMDG_1206_9458/II/HEPTANES","II","P","F-E S-D"]
["IMDG_1207_9459/III/HEXALDEHYDE","III",null,"F-E S-D"]
["IMDG_1208_9460/II/HEXANES","II","P","F-E S-D"]
["IMDG_1210_9481/I/PRINTING INK flammable or PRINTING INK RELATED MATERIAL (including printing ink thinning or reducing compound), flammable","I",null,"F-E S-D"]
["IMDG_1210_9482/II/PRINTING INK flammable or PRINTING INK RELATED MATERIAL (including printing ink thinning or reducing compound), flammable","II",null,"F-E S-D"]
["IMDG_1210_9483/III/PRINTING INK flammable or PRINTING INK RELATED MATERIAL (including printing ink thinning or reducing compound), flammable","III",null,"F-E S-D"]
["IMDG_1212_9484/III/ISOBUTANOL (ISOBUTYL ALCOHOL)","III",null,"F-E S-D"]
["IMDG_1213_9485/II/ISOBUTYL ACETATE","II",null,"F-E S-D"]
["IMDG_1214_9486/II/ISOBUTYLAMINE","II",null,"F-E S-C"]
["IMDG_1216_9487/II/ISOOCTENES","II",null,"F-E S-D"]
["IMDG_1218_9488/I/ISOPRENE, STABILIZED","I","P","F-E S-D"]
["IMDG_1219_9489/II/ISOPROPANOL (ISOPROPYL ALCOHOL)","II",null,"F-E S-D"]
["IMDG_1220_9490/II/ISOPROPYL ACETATE","II",null,"F-E S-D"]
["IMDG_1221_9491/I/ISOPROPYLAMINE","I",null,"F-E S-C"]
["IMDG_1222_9492/II/ISOPROPYL NITRATE","II",null,"F-E S-D"]
["IMDG_1223_9493/III/KEROSENE","III",null,"F-E S-E"]
["IMDG_1224_9494/II/KETONES, LIQUID, N.O.S.","II",null,"F-E S-D"]
["IMDG_1224_9495/III/KETONES, LIQUID, N.O.S.","III",null,"F-E S-D"]
["IMDG_1228_12049/II/MERCAPTANS, LIQUID, FLAMMABLE, TOXIC, N.O.S. or MERCAPTAN MIXTURE, LIQUID, FLAMMABLE, TOXIC, N.O.S.","II",null,"F-E S-D"]
["IMDG_1228_12050/III/MERCAPTANS, LIQUID, FLAMMABLE, TOXIC, N.O.S. or MERCAPTAN MIXTURE, LIQUID, FLAMMABLE, TOXIC, N.O.S.","III",null,"F-E S-D"]
["IMDG_1229_9498/III/MESITYL OXIDE","III",null,"F-E S-D"]
["IMDG_1230_9499/II/METHANOL","II",null,"F-E S-D"]
["IMDG_1231_9500/II/METHYL ACETATE","II",null,"F-E S-D"]
["IMDG_1233_9501/III/METHYLAMYL ACETATE","III",null,"F-E S-D"]
["IMDG_1234_9502/II/METHYLAL","II",null,"F-E S-D"]
["IMDG_1235_12051/II/METHYLAMINE, AQUEOUS SOLUTION","II",null,"F-E S-C"]
["IMDG_1237_9504/II/METHYL BUTYRATE","II",null,"F-E S-D"]
["IMDG_1238_9505/I/METHYL CHLOROFORMATE","I",null,"F-E S-C"]
["IMDG_1239_9506/I/METHYL CHLOROMETHYL ETHER","I",null,"F-E S-D"]
["IMDG_1242_9507/I/METHYLDICHLOROSILANE","I",null,"F-G S-O"]
["IMDG_1243_9508/I/METHYL FORMATE","I",null,"F-E S-D"]
["IMDG_1244_9509/I/METHYLHYDRAZINE","I",null,"F-E S-C"]
["IMDG_1245_9510/II/METHYL ISOBUTYL KETONE","II",null,"F-E S-D"]
["IMDG_1246_9511/II/METHYL ISOPROPENYL KETONE, STABILIZED","II",null,"F-E S-D"]
["IMDG_1247_9512/II/METHYL METHACRYLATE MONOMER, STABILIZED","II",null,"F-E S-D"]
["IMDG_1248_9513/II/METHYL PROPIONATE","II",null,"F-E S-D"]
["IMDG_1249_9514/II/METHYL PROPYL KETONE","II",null,"F-E S-D"]
["IMDG_1250_9515/II/METHYLTRICHLOROSILANE","II",null,"F-E S-C"]
["IMDG_1251_9516/I/METHYL VINYL KETONE, STABILIZED","I",null,"F-E S-C"]
["IMDG_1259_9517/I/NICKEL CARBONYL","I","P","F-E S-D"]
["IMDG_1261_9518/II/NITROMETHANE","II",null,"F-E S-D"]
["IMDG_1262_9519/II/OCTANES","II","P","F-E S-E"]
["IMDG_1263_9520/I/PAINT (including paint, lacquer, enamel, stain, shellac, varnish, polish, liquid filler and liquid lacquer base) or PAINT RELATED MATERIAL (including paint thinning or reducing compound)","I",null,"F-E S-E"]
["IMDG_1263_9541/II/PAINT (including paint, lacquer, enamel, stain, shellac, varnish, polish, liquid filler and liquid lacquer base) or PAINT RELATED MATERIAL (including paint thinning or reducing compound)","II",null,"F-E S-E"]
["IMDG_1263_9542/III/PAINT (including paint, lacquer, enamel, stain, shellac, varnish, polish, liquid filler and liquid lacquer base) or PAINT RELATED MATERIAL (including paint thinning or reducing compound)","III",null,"F-E S-E"]
["IMDG_1264_9543/III/PARALDEHYDE","III",null,"F-E S-D"]
["IMDG_1265_9544/I/PENTANES, liquid","I",null,"F-E S-D"]
["IMDG_1265_9545/II/PENTANES, liquid","II",null,"F-E S-D"]
["IMDG_1266_9546/II/PERFUMERY PRODUCTS with flammable solvents","II",null,"F-E S-D"]
["IMDG_1266_9547/III/PERFUMERY PRODUCTS with flammable solvents","III",null,"F-E S-D"]
["IMDG_1267_9548/I/PETROLEUM CRUDE OIL","I",null,"F-E S-E"]
["IMDG_1267_9549/II/PETROLEUM CRUDE OIL","II",null,"F-E S-E"]
["IMDG_1267_9550/III/PETROLEUM CRUDE OIL","III",null,"F-E S-E"]
["IMDG_1268_9551/I/PETROLEUM DISTILLATES, N.O.S. or PETROLEUM PRODUCTS, N.O.S.","I",null,"F-E S-E"]
["IMDG_1268_9552/II/PETROLEUM DISTILLATES, N.O.S. or PETROLEUM PRODUCTS, N.O.S.","II",null,"F-E S-E"]
["IMDG_1268_9553/III/PETROLEUM DISTILLATES, N.O.S. or PETROLEUM PRODUCTS, N.O.S.","III",null,"F-E S-E"]
["IMDG_1272_9554/III/PINE OIL","III","P","F-E S-E"]
["IMDG_1274_9555/II/n-PROPANOL (PROPYL ALCOHOL, NORMAL)","II",null,"F-E S-D"]
["IMDG_1274_9556/III/n-PROPANOL (PROPYL ALCOHOL, NORMAL)","III",null,"F-E S-D"]
["IMDG_1275_9557/II/PROPIONALDEHYDE","II",null,"F-E S-D"]
["IMDG_1276_9558/II/n-PROPYL ACETATE","II",null,"F-E S-D"]
["IMDG_1277_9559/II/PROPYLAMINE","II",null,"F-E S-C"]
["IMDG_1278_9560/II/1-CHLOROPROPANE","II",null,"F-E S-D"]
["IMDG_1279_9561/II/1,2-DICHLOROPROPANE","II",null,"F-E S-D"]
["IMDG_1280_9562/I/PROPYLENE OXIDE","I",null,"F-E S-D"]
["IMDG_1281_9563/II/PROPYL FORMATES","II",null,"F-E S-D"]
["IMDG_1282_9564/II/PYRIDINE","II",null,"F-E S-D"]
["IMDG_1286_9565/II/ROSIN OIL","II",null,"F-E S-E"]
["IMDG_1286_9566/III/ROSIN OIL","III",null,"F-E S-E"]
["IMDG_1287_9567/II/RUBBER SOLUTION","II",null,"F-E S-D"]
["IMDG_1287_9568/III/RUBBER SOLUTION","III",null,"F-E S-D"]
["IMDG_1288_9569/II/SHALE OIL","II",null,"F-E S-E"]
["IMDG_1288_9570/III/SHALE OIL","III",null,"F-E S-E"]
["IMDG_1289_9571/II/SODIUM METHYLATE SOLUTION in alcohol","II",null,"F-E S-C"]
["IMDG_1289_9572/III/SODIUM METHYLATE SOLUTION in alcohol","III",null,"F-E S-C"]
["IMDG_1292_9573/III/TETRAETHYL SILICATE","III",null,"F-E S-D"]
["IMDG_1293_9574/II/TINCTURES, MEDICINAL","II",null,"F-E S-D"]
["IMDG_1293_9575/III/TINCTURES, MEDICINAL","III",null,"F-E S-D"]
["IMDG_1294_9576/II/TOLUENE","II",null,"F-E S-D"]
["IMDG_1295_9577/I/TRICHLOROSILANE","I",null,"F-G S-O"]
["IMDG_1296_9578/II/TRIETHYLAMINE","II",null,"F-E S-C"]
["IMDG_1297_9579/I/TRIMETHYLAMINE, AQUEOUS SOLUTION not more than 50% trimethylamine, by mass","I",null,"F-E S-C"]
["IMDG_1297_9580/II/TRIMETHYLAMINE, AQUEOUS SOLUTION not more than 50% trimethylamine, by mass","II",null,"F-E S-C"]
["IMDG_1297_9601/III/TRIMETHYLAMINE, AQUEOUS SOLUTION not more than 50% trimethylamine, by mass","III",null,"F-E S-C"]
["IMDG_1298_9602/II/TRIMETHYLCHLOROSILANE","II",null,"F-E S-C"]
["IMDG_1299_9603/III/TURPENTINE","III","P","F-E S-E"]
["IMDG_1300_9604/II/TURPENTINE SUBSTITUTE","II",null,"F-E S-E"]
["IMDG_1300_9605/III/TURPENTINE SUBSTITUTE","III",null,"F-E S-E"]
["IMDG_1301_9606/II/VINYL ACETATE, STABILIZED","II",null,"F-E S-D"]
["IMDG_1302_9607/I/VINYL ETHYL ETHER, STABILIZED","I",null,"F-E S-D"]
["IMDG_1303_9608/I/VINYLIDENE CHLORIDE, STABILIZED","I","P","F-E S-D"]
["IMDG_1304_9609/II/VINYL ISOBUTYL ETHER, STABILIZED","II",null,"F-E S-D"]
["IMDG_1305_9610/II/VINYLTRICHLOROSILANE","II",null,"F-E S-C"]
["IMDG_1306_9611/II/WOOD PRESERVATIVES, LIQUID","II",null,"F-E S-D"]
["IMDG_1306_9612/III/WOOD PRESERVATIVES, LIQUID","III",null,"F-E S-D"]
["IMDG_1307_9613/II/XYLENES","II",null,"F-E S-D"]
["IMDG_1307_9614/III/XYLENES","III",null,"F-E S-D"]
["IMDG_1308_9615/I/ZIRCONIUM, SUSPENDED IN A FLAMMABLE LIQUID","I",null,"F-E S-D"]
["IMDG_1308_9616/II/ZIRCONIUM, SUSPENDED IN A FLAMMABLE LIQUID","II",null,"F-E S-D"]
["IMDG_1308_9617/III/ZIRCONIUM, SUSPENDED IN A FLAMMABLE LIQUID","III",null,"F-E S-D"]
["IMDG_1309_9618/II/ALUMINIUM POWDER, COATED","II",null,"F-G S-G"]
["IMDG_1309_9619/III/ALUMINIUM POWDER, COATED","III",null,"F-G S-G"]
["IMDG_1310_9620/I/AMMONIUM PICRATE, WETTED with not less than 10% water, by mass","I",null,"F-B S-J"]
["IMDG_1312_9641/III/BORNEOL","III",null,"F-A S-I"]
["IMDG_1313_9642/III/CALCIUM RESINATE","III",null,"F-A S-I"]
["IMDG_1314_9643/III/CALCIUM RESINATE, FUSED","III",null,"F-A S-I"]
["IMDG_1318_9644/III/COBALT RESINATE, PRECIPITATED","III",null,"F-A S-I"]
["IMDG_1320_9645/I/DINITROPHENOL, WETTED with not less than 15% water, by mass","I","P","F-B S-J"]
["IMDG_1321_9646/I/DINITROPHENOLATES, WETTED with not less than 15% water, by mass","I","P","F-B S-J"]
["IMDG_1322_9647/I/DINITRORESORCINOL, WETTED with not less than 15% water, by mass","I",null,"F-B S-J"]
["IMDG_1323_9648/II/FERROCERIUM","II",null,"F-G S-G"]
["IMDG_1324_9649/III/FILMS, NITROCELLULOSE BASE gelatin coated, except scrap","III",null,"F-G S-I"]
["IMDG_1325_9650/II/FLAMMABLE SOLID, ORGANIC, N.O.S.","II",null,"F-A S-G"]
["IMDG_1325_9651/III/FLAMMABLE SOLID, ORGANIC, N.O.S.","III",null,"F-A S-G"]
["IMDG_1326_9652/II/HAFNIUM POWDER, WETTED with not less than 25% water (a visible excess of water must be present) (a) mechanically produced, particle size less than 53 microns; (b) chemically produced, particle size less than 840 microns","II",null,"F-A S-J"]
["IMDG_1327_9653/ /HAY, STRAW or BHUSA",null,null,"F-A S-I"]
["IMDG_1328_9654/III/HEXAMETHYLENETETRAMINE","III",null,"F-A S-G"]
["IMDG_1330_9655/III/MANGANESE RESINATE","III",null,"F-A S-I"]
["IMDG_1331_12052/III/MATCHES, “STRIKE ANYWHERE”","III",null,"F-A S-I"]
["IMDG_1332_9657/III/METALDEHYDE","III",null,"F-A S-G"]
["IMDG_1333_12441/II/CERIUM slabs, ingots or rods","II",null,"F-G S-P"]
["IMDG_1334_9659/III/NAPHTHALENE, CRUDE or NAPHTHALENE, REFINED","III","P","F-A S-G"]
["IMDG_1336_9660/I/NITROGUANIDINE (PICRITE), WETTED with not less than 20% water, by mass","I",null,"F-B S-J"]
["IMDG_1337_9661/I/NITROSTARCH, WETTED with not less than 20% water, by mass","I",null,"F-B S-J"]
["IMDG_1338_9662/III/PHOSPHORUS, AMORPHOUS","III",null,"F-A S-G"]
["IMDG_1339_9663/II/PHOSPHORUS HEPTASULPHIDE free from yellow or white phosphorus","II",null,"F-G S-G"]
["IMDG_1340_9664/II/PHOSPHORUS PENTASULPHIDE free from yellow or white phosphorus","II",null,"F-G S-N"]
["IMDG_1341_9665/II/PHOSPHORUS SESQUISULPHIDE free from yellow or white phosphorus","II",null,"F-A S-G"]
["IMDG_1343_9666/II/PHOSPHORUS TRISULPHIDE free from yellow or white phosphorus","II",null,"F-G S-G"]
["IMDG_1344_9667/I/TRINITROPHENOL (PICRIC ACID), WETTED with not less than 30% water, by mass","I",null,"F-B S-J"]
["IMDG_1345_9668/II/RUBBER SCRAP powdered or granulated, not exceeding 840 microns and rubber content exceeding 45% or RUBBER SHODDY powdered or granulated, not exceeding 840 microns and rubber content exceeding 45%","II",null,"F-A S-I"]
["IMDG_1346_9669/III/SILICON POWDER, AMORPHOUS","III",null,"F-A S-G"]
["IMDG_1347_9670/I/SILVER PICRATE, WETTED with not less than 30% water, by mass","I",null,"F-B S-J"]
["IMDG_1348_12054/I/SODIUM DINITRO-o- CRESOLATE, WETTED with not less than 15% water, by mass","I","P","F-B S-J"]
["IMDG_1349_9672/I/SODIUM PICRAMATE, WETTED with not less than 20% water, by mass","I",null,"F-B S-J"]
["IMDG_1350_9673/III/SULPHUR","III",null,"F-A S-G"]
["IMDG_1352_9674/II/TITANIUM POWDER, WETTED with not less than 25% water (a visible excess of water must be present) (a) mechanically produced, particle size less than 53 microns; (b) chemically produced, particle size less than 840 microns","II",null,"F-A S-J"]
["IMDG_1353_9675/III/FIBRES or FABRICS IMPREGNATED WITH WEAKLY NITRATED NITROCELLULOSE, N.O.S.","III",null,"F-A S-I"]
["IMDG_1354_9676/I/TRINITROBENZENE, WETTED with not less than 30% water, by mass","I",null,"F-B S-J"]
["IMDG_1355_9677/I/TRINITROBENZOIC ACID, WETTED with not less than 30% water, by mass","I",null,"F-B S-J"]
["IMDG_1356_9678/I/TRINITROTOLUENE (TNT), WETTED with not less than 30% water, by mass","I",null,"F-B S-J"]
["IMDG_1357_9679/I/UREA NITRATE, WETTED with not less than 20% water, by mass","I",null,"F-B S-J"]
["IMDG_1358_9680/II/ZIRCONIUM POWDER, WETTED with not less than 25% water (a visible excess of water must be present) (a) mechanically produced, particle size less than 53 microns; (b) chemically produced, particle size less than 840 microns","II",null,"F-G S-J"]
["IMDG_1360_9701/I/CALCIUM PHOSPHIDE","I",null,"F-G S-N"]
["IMDG_1361_9702/II/CARBON animal or vegetable origin","II",null,"F-A S-J"]
["IMDG_1361_9703/III/CARBON animal or vegetable origin","III",null,"F-A S-J"]
["IMDG_1362_9704/III/CARBON, ACTIVATED","III",null,"F-A S-J"]
["IMDG_1363_9705/III/COPRA","III",null,"F-A S-J"]
["IMDG_1364_9706/III/COTTON WASTE, OILY","III",null,"F-A S-J"]
["IMDG_1365_9707/III/COTTON, WET","III",null,"F-A S-J"]
["IMDG_1369_9708/II/p-NITROSODIMETHYLANILINE","II",null,"F-A S-J"]
["IMDG_1372_9709/III/FIBRES ANIMAL or FIBRES VEGETABLE burnt, wet or damp","III",null,"F-A S-J"]
["IMDG_1373_9710/III/FIBRES or FABRICS, ANIMAL or VEGETABLE or SYNTHETIC, N.O.S. with oil","III",null,"F-A S-J"]
["IMDG_1374_12442/II/FISHMEAL, UNSTABILIZED or FISHSCRAP, UNSTABILIZED High hazard. Unrestricted moisture content. Unrestricted fat content in excess of 12%, by mass; unrestricted fat content in excess of 15%, by mass, in the case of anti-oxidant treated fishmeal or fishscrap","II",null,"F-A S-J"]
["IMDG_1374_12443/III/FISHMEAL, UNSTABILIZED or FISHSCRAP, UNSTABILIZED Not anti-oxidant treated. Moisture content: more than 5% but not more than 12%, by mass. Fat content: not more than 12%, by mass","III",null,"F-A S-J"]
["IMDG_1376_9713/III/IRON OXIDE, SPENT or IRON SPONGE, SPENT obtained from coal gas purification","III",null,"F-G S-P"]
["IMDG_1378_9714/II/METAL CATALYST, WETTED with a visible excess of liquid","II",null,"F-H S-M"]
["IMDG_1379_9715/III/PAPER, UNSATURATED OIL TREATED incompletely dried (including carbon paper)","III",null,"F-A S-J"]
["IMDG_1380_9716/I/PENTABORANE","I",null,"F-G S-L"]
["IMDG_1381_9717/I/PHOSPHORUS, WHITE or YELLOW, DRY or UNDER WATER or IN SOLUTION","I","P","F-A S-J"]
["IMDG_1382_9718/II/POTASSIUM SULPHIDE, ANHYDROUS or POTASSIUM SULPHIDE with less than 30% water of crystallization","II",null,"F-A S-J"]
["IMDG_1383_9719/I/PYROPHORIC METAL, N.O.S. or PYROPHORIC ALLOY, N.O.S.","I",null,"F-G S-M"]
["IMDG_1384_9720/II/SODIUM DITHIONITE (SODIUM HYDROSULPHITE)","II",null,"F-A S-J"]
["IMDG_1385_9741/II/SODIUM SULPHIDE, ANHYDROUS or SODIUM SULPHIDE with less than 30% water of crystallization","II",null,"F-A S-J"]
["IMDG_1386_9742/III/SEED CAKE, containing vegetable oil (a) mechanically expelled seeds, containing more than 10% oil or more than 20% oil and moisture combined","III",null,"F-A S-J"]
["IMDG_1386_9743/III/SEED CAKE, containing vegetable oil (b) solvent extractions and expelled seeds, containing not more than 10% of oil and when the amount of moisture is higher than 10%, not more than 20% of oil and moisture combined","III",null,"F-A S-J"]
["IMDG_1387_9744/III/WOOL WASTE, WET","III",null,"F-A S-J"]
["IMDG_1389_9745/I/ALKALI METAL AMALGAM, LIQUID","I",null,"F-G S-N"]
["IMDG_1390_9746/II/ALKALI METAL AMIDE","II",null,"F-G S-O"]
["IMDG_1391_9747/I/ALKALI METAL DISPERSION or ALKALINE EARTH METAL DISPERSION","I",null,"F-G S-N"]
["IMDG_1392_9748/I/ALKALINE EARTH METAL AMALGAM, LIQUID","I",null,"F-G S-N"]
["IMDG_1393_9749/II/ALKALINE EARTH METAL ALLOY, N.O.S.","II",null,"F-G S-N"]
["IMDG_1394_9750/II/ALUMINIUM CARBIDE","II",null,"F-G S-N"]
["IMDG_1395_9751/II/ALUMINIUM FERROSILICON POWDER","II",null,"F-G S-N"]
["IMDG_1396_9752/II/ALUMINIUM POWDER, UNCOATED","II",null,"F-G S-O"]
["IMDG_1396_9753/III/ALUMINIUM POWDER, UNCOATED","III",null,"F-G S-O"]
["IMDG_1397_9754/I/ALUMINIUM PHOSPHIDE","I",null,"F-G S-N"]
["IMDG_1398_9755/III/ALUMINIUM SILICON POWDER, UNCOATED","III",null,"F-G S-N"]
["IMDG_1400_9756/II/BARIUM","II",null,"F-G S-O"]
["IMDG_1401_9757/II/CALCIUM","II",null,"F-G S-O"]
["IMDG_1402_9758/I/CALCIUM CARBIDE","I",null,"F-G S-N"]
["IMDG_1402_9759/II/CALCIUM CARBIDE","II",null,"F-G S-N"]
["IMDG_1403_9760/III/CALCIUM CYANAMIDE with more than 0.1% calcium carbide","III",null,"F-G S-N"]
["IMDG_1404_9761/I/CALCIUM HYDRIDE","I",null,"F-G S-O"]
["IMDG_1405_9762/II/CALCIUM SILICIDE","II",null,"F-G S-N"]
["IMDG_1405_9763/III/CALCIUM SILICIDE","III",null,"F-G S-N"]
["IMDG_1407_9764/I/CAESIUM","I",null,"F-G S-N"]
["IMDG_1408_9765/III/FERROSILICON with 30% or more but less than 90% silicon","III",null,"F-G S-N"]
["IMDG_1409_9766/I/METAL HYDRIDES, WATER-REACTIVE, N.O.S.","I",null,"F-G S-L"]
["IMDG_1409_9767/II/METAL HYDRIDES, WATER-REACTIVE, N.O.S.","II",null,"F-G S-L"]
["IMDG_1410_9768/I/LITHIUM ALUMINIUM HYDRIDE","I",null,"F-G S-M"]
["IMDG_1411_9769/I/LITHIUM ALUMINIUM HYDRIDE, ETHEREAL","I",null,"F-G S-M"]
["IMDG_1413_9770/I/LITHIUM BOROHYDRIDE","I",null,"F-G S-O"]
["IMDG_1414_9771/I/LITHIUM HYDRIDE","I",null,"F-G S-N"]
["IMDG_1415_9772/I/LITHIUM","I",null,"F-G S-N"]
["IMDG_1417_9773/II/LITHIUM SILICON","II",null,"F-G S-N"]
["IMDG_1418_9774/I/MAGNESIUM POWDER or MAGNESIUM ALLOYS POWDER","I",null,"F-G S-O"]
["IMDG_1418_9775/II/MAGNESIUM POWDER or MAGNESIUM ALLOYS POWDER","II",null,"F-G S-O"]
["IMDG_1418_9776/III/MAGNESIUM POWDER or MAGNESIUM ALLOYS POWDER","III",null,"F-G S-O"]
["IMDG_1419_9777/I/MAGNESIUM ALUMINIUM PHOSPHIDE","I",null,"F-G S-N"]
["IMDG_1420_9778/I/POTASSIUM METAL ALLOYS, LIQUID","I",null,"F-G S-L"]
["IMDG_1421_9779/I/ALKALI METAL ALLOY, LIQUID, N.O.S.","I",null,"F-G S-L"]
["IMDG_1422_9780/I/POTASSIUM SODIUM ALLOYS, LIQUID","I",null,"F-G S-L"]
["IMDG_1423_9801/I/RUBIDIUM","I",null,"F-G S-N"]
["IMDG_1426_9802/I/SODIUM BOROHYDRIDE","I",null,"F-G S-O"]
["IMDG_1427_9803/I/SODIUM HYDRIDE","I",null,"F-G S-O"]
["IMDG_1428_9804/I/SODIUM","I",null,"F-G S-N"]
["IMDG_1431_9805/II/SODIUM METHYLATE","II",null,"F-A S-L"]
["IMDG_1432_9806/I/SODIUM PHOSPHIDE","I",null,"F-G S-N"]
["IMDG_1433_9807/I/STANNIC PHOSPHIDE","I",null,"F-G S-N"]
["IMDG_1435_9808/III/ZINC ASHES","III",null,"F-G S-O"]
["IMDG_1436_9809/I/ZINC POWDER or ZINC DUST","I",null,"F-G S-O"]
["IMDG_1436_9810/II/ZINC POWDER or ZINC DUST","II",null,"F-G S-O"]
["IMDG_1436_9811/III/ZINC POWDER or ZINC DUST","III",null,"F-G S-O"]
["IMDG_1437_9812/II/ZIRCONIUM HYDRIDE","II",null,"F-A S-G"]
["IMDG_1438_9813/III/ALUMINIUM NITRATE","III",null,"F-A S-Q"]
["IMDG_1439_9814/II/AMMONIUM DICHROMATE","II",null,"F-H S-Q"]
["IMDG_1442_9815/II/AMMONIUM PERCHLORATE","II",null,"F-H S-Q"]
["IMDG_1444_9816/III/AMMONIUM PERSULPHATE","III",null,"F-A S-Q"]
["IMDG_1445_9817/II/BARIUM CHLORATE, SOLID","II",null,"F-H S-Q"]
["IMDG_1446_9818/II/BARIUM NITRATE","II",null,"F-A S-Q"]
["IMDG_1447_9819/II/BARIUM PERCHLORATE, SOLID","II",null,"F-H S-Q"]
["IMDG_1448_9820/II/BARIUM PERMANGANATE","II",null,"F-H S-Q"]
["IMDG_1449_9841/II/BARIUM PEROXIDE","II",null,"F-G S-Q"]
["IMDG_1450_9842/II/BROMATES, INORGANIC, N.O.S.","II",null,"F-H S-Q"]
["IMDG_1451_9843/III/CAESIUM NITRATE","III",null,"F-A S-Q"]
["IMDG_1452_9844/II/CALCIUM CHLORATE","II",null,"F-H S-Q"]
["IMDG_1453_9845/II/CALCIUM CHLORITE","II",null,"F-H S-Q"]
["IMDG_1454_9846/III/CALCIUM NITRATE","III",null,"F-A S-Q"]
["IMDG_1455_9847/II/CALCIUM PERCHLORATE","II",null,"F-H S-Q"]
["IMDG_1456_9848/II/CALCIUM PERMANGANATE","II",null,"F-H S-Q"]
["IMDG_1457_9849/II/CALCIUM PEROXIDE","II",null,"F-G S-Q"]
["IMDG_1458_9850/II/CHLORATE AND BORATE MIXTURE","II",null,"F-H S-Q"]
["IMDG_1458_9851/III/CHLORATE AND BORATE MIXTURE","III",null,"F-H S-Q"]
["IMDG_1459_9852/II/CHLORATE AND MAGNESIUM CHLORIDE MIXTURE, SOLID","II",null,"F-H S-Q"]
["IMDG_1459_9853/III/CHLORATE AND MAGNESIUM CHLORIDE MIXTURE, SOLID","III",null,"F-H S-Q"]
["IMDG_1461_9854/II/CHLORATES, INORGANIC, N.O.S.","II",null,"F-H S-Q"]
["IMDG_1462_9855/II/CHLORITES, INORGANIC, N.O.S.","II",null,"F-H S-Q"]
["IMDG_1463_9856/II/CHROMIUM TRIOXIDE, ANHYDROUS","II",null,"F-A S-Q"]
["IMDG_1465_9857/III/DIDYMIUM NITRATE","III",null,"F-A S-Q"]
["IMDG_1466_9858/III/FERRIC NITRATE","III",null,"F-A S-Q"]
["IMDG_1467_9859/III/GUANIDINE NITRATE","III",null,"F-A S-Q"]
["IMDG_1469_9860/II/LEAD NITRATE","II","P","F-A S-Q"]
["IMDG_1470_9861/II/LEAD PERCHLORATE, SOLID","II","P","F-H S-Q"]
["IMDG_1471_9862/II/LITHIUM HYPOCHLORITE, DRY or LITHIUM HYPOCHLORITE MIXTURE","II",null,"F-H S-Q"]
["IMDG_1471_9863/III/LITHIUM HYPOCHLORITE, DRY or LITHIUM HYPOCHLORITE MIXTURE","III",null,"F-H S-Q"]
["IMDG_1472_9864/II/LITHIUM PEROXIDE","II",null,"F-G S-Q"]
["IMDG_1473_9865/II/MAGNESIUM BROMATE","II",null,"F-H S-Q"]
["IMDG_1474_9866/III/MAGNESIUM NITRATE","III",null,"F-A S-Q"]
["IMDG_1475_9867/II/MAGNESIUM PERCHLORATE","II",null,"F-H S-Q"]
["IMDG_1476_9868/II/MAGNESIUM PEROXIDE","II",null,"F-G S-Q"]
["IMDG_1477_9869/II/NITRATES, INORGANIC, N.O.S.","II",null,"F-A S-Q"]
["IMDG_1477_9870/III/NITRATES, INORGANIC, N.O.S.","III",null,"F-A S-Q"]
["IMDG_1479_9871/I/OXIDIZING SOLID, N.O.S.","I",null,"F-A S-Q"]
["IMDG_1479_9872/II/OXIDIZING SOLID, N.O.S.","II",null,"F-A S-Q"]
["IMDG_1479_9873/III/OXIDIZING SOLID, N.O.S.","III",null,"F-A S-Q"]
["IMDG_1481_9874/II/PERCHLORATES, INORGANIC, N.O.S.","II",null,"F-H S-Q"]
["IMDG_1481_9875/III/PERCHLORATES, INORGANIC, N.O.S.","III",null,"F-H S-Q"]
["IMDG_1482_9876/II/PERMANGANATES, INORGANIC, N.O.S.","II",null,"F-H S-Q"]
["IMDG_1482_9877/III/PERMANGANATES, INORGANIC, N.O.S.","III",null,"F-H S-Q"]
["IMDG_1483_9878/II/PEROXIDES, INORGANIC, N.O.S.","II",null,"F-G S-Q"]
["IMDG_1483_9879/III/PEROXIDES, INORGANIC, N.O.S.","III",null,"F-G S-Q"]
["IMDG_1484_9880/II/POTASSIUM BROMATE","II",null,"F-H S-Q"]
["IMDG_1485_9901/II/POTASSIUM CHLORATE","II",null,"F-H S-Q"]
["IMDG_1486_9902/III/POTASSIUM NITRATE","III",null,"F-A S-Q"]
["IMDG_1487_9903/II/POTASSIUM NITRATE AND SODIUM NITRITE MIXTURE","II",null,"F-A S-Q"]
["IMDG_1488_9904/II/POTASSIUM NITRITE","II",null,"F-A S-Q"]
["IMDG_1489_9905/II/POTASSIUM PERCHLORATE","II",null,"F-H S-Q"]
["IMDG_1490_9906/II/POTASSIUM PERMANGANATE","II",null,"F-H S-Q"]
["IMDG_1491_9907/I/POTASSIUM PEROXIDE","I",null,"F-G S-Q"]
["IMDG_1492_9908/III/POTASSIUM PERSULPHATE","III",null,"F-A S-Q"]
["IMDG_1493_9909/II/SILVER NITRATE","II",null,"F-A S-Q"]
["IMDG_1494_9910/II/SODIUM BROMATE","II",null,"F-H S-Q"]
["IMDG_1495_9911/II/SODIUM CHLORATE","II",null,"F-H S-Q"]
["IMDG_1496_9912/II/SODIUM CHLORITE","II",null,"F-H S-Q"]
["IMDG_1498_9913/III/SODIUM NITRATE","III",null,"F-A S-Q"]
["IMDG_1499_9914/III/SODIUM NITRATE AND POTASSIUM NITRATE MIXTURE","III",null,"F-A S-Q"]
["IMDG_1500_9915/III/SODIUM NITRITE","III",null,"F-A S-Q"]
["IMDG_1502_9916/II/SODIUM PERCHLORATE","II",null,"F-H S-Q"]
["IMDG_1503_9917/II/SODIUM PERMANGANATE","II",null,"F-H S-Q"]
["IMDG_1504_9918/I/SODIUM PEROXIDE","I",null,"F-G S-Q"]
["IMDG_1505_9919/III/SODIUM PERSULPHATE","III",null,"F-A S-Q"]
["IMDG_1506_9920/II/STRONTIUM CHLORATE","II",null,"F-H S-Q"]
["IMDG_1507_9921/III/STRONTIUM NITRATE","III",null,"F-A S-Q"]
["IMDG_1508_9922/II/STRONTIUM PERCHLORATE","II",null,"F-H S-Q"]
["IMDG_1509_9923/II/STRONTIUM PEROXIDE","II",null,"F-G S-Q"]
["IMDG_1510_9924/I/TETRANITROMETHANE","I",null,"F-H S-Q"]
["IMDG_1511_9925/III/UREA HYDROGEN PEROXIDE","III",null,"F-A S-Q"]
["IMDG_1512_9926/ /ZINC AMMONIUM NITRITE"]
["IMDG_1513_9927/II/ZINC CHLORATE","II",null,"F-H S-Q"]
["IMDG_1514_9928/II/ZINC NITRATE","II",null,"F-H S-Q"]
["IMDG_1515_9929/II/ZINC PERMANGANATE","II",null,"F-H S-Q"]
["IMDG_1516_9930/II/ZINC PEROXIDE","II",null,"F-G S-Q"]
["IMDG_1517_9931/I/ZIRCONIUM PICRAMATE, WETTED with not less than 20% water, by mass","I",null,"F-B S-J"]
["IMDG_1541_9932/I/ACETONE CYANOHYDRIN, STABILIZED","I","P","F-A S-A"]
["IMDG_1544_9933/I/ALKALOIDS, SOLID, N.O.S. or ALKALOIDS SALTS, SOLID, N.O.S.","I",null,"F-A S-A"]
["IMDG_1544_9934/II/ALKALOIDS, SOLID, N.O.S. or ALKALOIDS SALTS, SOLID, N.O.S.","II",null,"F-A S-A"]
["IMDG_1544_9935/III/ALKALOIDS, SOLID, N.O.S. or ALKALOIDS SALTS, SOLID, N.O.S.","III",null,"F-A S-A"]
["IMDG_1545_9936/II/ALLYL ISOTHIOCYANATE, STABILIZED","II",null,"F-E S-D"]
["IMDG_1546_9937/II/AMMONIUM ARSENATE","II",null,"F-A S-A"]
["IMDG_1547_9938/II/ANILINE","II","P","F-A S-A"]
["IMDG_1548_9939/III/ANILINE HYDROCHLORIDE","III",null,"F-A S-A"]
["IMDG_1549_9940/III/ANTIMONY COMPOUND, INORGANIC, SOLID, N.O.S.","III",null,"F-A S-A"]
["IMDG_1550_9961/III/ANTIMONY LACTATE","III",null,"F-A S-A"]
["IMDG_1551_9962/III/ANTIMONY POTASSIUM TARTRATE","III",null,"F-A S-A"]
["IMDG_1553_9963/I/ARSENIC ACID, LIQUID","I",null,"F-A S-A"]
["IMDG_1554_9964/II/ARSENIC ACID, SOLID","II",null,"F-A S-A"]
["IMDG_1555_9965/II/ARSENIC BROMIDE","II",null,"F-A S-A"]
["IMDG_1556_9966/I/ARSENIC COMPOUND, LIQUID, N.O.S. inorganic, including: Arsenates, n.o.s., Arsenites, n.o.s., and Arsenic sulphides, n.o.s.","I",null,"F-A S-A"]
["IMDG_1556_9967/II/ARSENIC COMPOUND, LIQUID, N.O.S. inorganic, including: Arsenates, n.o.s., Arsenites, n.o.s., and Arsenic sulphides, n.o.s.","II",null,"F-A S-A"]
["IMDG_1556_9968/III/ARSENIC COMPOUND, LIQUID, N.O.S. inorganic, including: Arsenates, n.o.s., Arsenites, n.o.s., and Arsenic sulphides, n.o.s.","III",null,"F-A S-A"]
["IMDG_1557_12057/I/ARSENIC COMPOUND, SOLID, N.O.S. inorganic, including: Arsenates, n.o.s.; Arsenites, n.o.s.; and Arsenic sulphides, n.o.s.","I",null,"F-A S-A"]
["IMDG_1557_12058/II/ARSENIC COMPOUND, SOLID, N.O.S. inorganic, including: Arsenates, n.o.s.; Arsenites, n.o.s.; and Arsenic sulphides, n.o.s.","II",null,"F-A S-A"]
["IMDG_1557_12059/III/ARSENIC COMPOUND, SOLID, N.O.S. inorganic, including: Arsenates, n.o.s.; Arsenites, n.o.s.; and Arsenic sulphides, n.o.s.","III",null,"F-A S-A"]
["IMDG_1558_9972/II/ARSENIC","II",null,"F-A S-A"]
["IMDG_1559_9973/II/ARSENIC PENTOXIDE","II",null,"F-A S-A"]
["IMDG_1560_9974/I/ARSENIC TRICHLORIDE","I",null,"F-A S-A"]
["IMDG_1561_9975/II/ARSENIC TRIOXIDE","II",null,"F-A S-A"]
["IMDG_1562_9976/II/ARSENICAL DUST","II",null,"F-A S-A"]
["IMDG_1564_9977/II/BARIUM COMPOUND, N.O.S.","II",null,"F-A S-A"]
["IMDG_1564_9978/III/BARIUM COMPOUND, N.O.S.","III",null,"F-A S-A"]
["IMDG_1565_9979/I/BARIUM CYANIDE","I","P","F-A S-A"]
["IMDG_1566_10001/III/BERYLLIUM COMPOUND, N.O.S.","III",null,"F-A S-A"]
["IMDG_1566_9980/II/BERYLLIUM COMPOUND, N.O.S.","II",null,"F-A S-A"]
["IMDG_1567_10002/II/BERYLLIUM POWDER","II",null,"F-G S-G"]
["IMDG_1569_10003/II/BROMOACETONE","II","P","F-E S-D"]
["IMDG_1570_10004/I/BRUCINE","I",null,"F-A S-A"]
["IMDG_1571_10005/I/BARIUM AZIDE, WETTED with not less than 50% water, by mass","I",null,"F-B S-J"]
["IMDG_1572_10006/II/CACODYLIC ACID","II",null,"F-A S-A"]
["IMDG_1573_10007/II/CALCIUM ARSENATE","II","P","F-A S-A"]
["IMDG_1574_10008/II/CALCIUM ARSENATE AND CALCIUM ARSENITE MIXTURE, SOLID","II","P","F-A S-A"]
["IMDG_1575_10009/I/CALCIUM CYANIDE","I","P","F-A S-A"]
["IMDG_1577_10010/II/CHLORODINITROBENZENES, LIQUID","II","P","F-A S-A"]
["IMDG_1578_10011/II/CHLORONITROBENZENES, SOLID","II",null,"F-A S-A"]
["IMDG_1579_10012/III/4-CHLORO-o-TOLUIDINE HYDROCHLORIDE, SOLID","III",null,"F-A S-A"]
["IMDG_1580_10013/I/CHLOROPICRIN","I","P","F-A S-A"]
["IMDG_1581_10014/ /CHLOROPICRIN AND METHYL BROMIDE MIXTURE with more than 2% chloropicrin",null,null,"F-C S-U"]
["IMDG_1582_10015/ /CHLOROPICRIN AND METHYL CHLORIDE MIXTURE",null,null,"F-C S-U"]
["IMDG_1583_10016/I/CHLOROPICRIN MIXTURE, N.O.S.","I",null,"F-A S-A"]
["IMDG_1583_10017/II/CHLOROPICRIN MIXTURE, N.O.S.","II",null,"F-A S-A"]
["IMDG_1583_10018/III/CHLOROPICRIN MIXTURE, N.O.S.","III",null,"F-A S-A"]
["IMDG_1585_10019/II/COPPER ACETOARSENITE","II","P","F-A S-A"]
["IMDG_1586_10020/II/COPPER ARSENITE","II","P","F-A S-A"]
["IMDG_1587_10021/II/COPPER CYANIDE","II","P","F-A S-A"]
["IMDG_1588_10022/I/CYANIDES, INORGANIC, SOLID, N.O.S.","I","P","F-A S-A"]
["IMDG_1588_10023/II/CYANIDES, INORGANIC, SOLID, N.O.S.","II","P","F-A S-A"]
["IMDG_1588_10024/III/CYANIDES, INORGANIC, SOLID, N.O.S.","III","P","F-A S-A"]
["IMDG_1589_10025/ /CYANOGEN CHLORIDE, STABILIZED",null,"P","F-C S-U"]
["IMDG_1590_10026/II/DICHLOROANILINES, LIQUID","II","P","F-A S-A"]
["IMDG_1591_10027/III/o-DICHLOROBENZENE","III",null,"F-A S-A"]
["IMDG_1593_10028/III/DICHLOROMETHANE","III",null,"F-A S-A"]
["IMDG_1594_10029/II/DIETHYL SULPHATE","II",null,"F-A S-A"]
["IMDG_1595_10030/I/DIMETHYL SULPHATE","I",null,"F-A S-B"]
["IMDG_1596_10031/II/DINITROANILINES","II",null,"F-A S-A"]
["IMDG_1597_10032/II/DINITROBENZENES, LIQUID","II",null,"F-A S-A"]
["IMDG_1597_10033/III/DINITROBENZENES, LIQUID","III",null,"F-A S-A"]
["IMDG_1598_10034/II/DINITRO-o-CRESOL","II","P","F-A S-A"]
["IMDG_1599_10035/II/DINITROPHENOL SOLUTION","II","P","F-A S-A"]
["IMDG_1599_10036/III/DINITROPHENOL SOLUTION","III","P","F-A S-A"]
["IMDG_1600_10037/II/DINITROTOLUENES, MOLTEN","II","P","F-A S-A"]
["IMDG_1601_10038/I/DISINFECTANT, SOLID, TOXIC, N.O.S.","I",null,"F-A S-A"]
["IMDG_1601_10039/II/DISINFECTANT, SOLID, TOXIC, N.O.S.","II",null,"F-A S-A"]
["IMDG_1601_10040/III/DISINFECTANT, SOLID, TOXIC, N.O.S.","III",null,"F-A S-A"]
["IMDG_1602_10061/I/DYE, LIQUID, TOXIC, N.O.S. or DYE INTERMEDIATE, LIQUID, TOXIC, N.O.S.","I",null,"F-A S-A"]
["IMDG_1602_10062/II/DYE, LIQUID, TOXIC, N.O.S. or DYE INTERMEDIATE, LIQUID, TOXIC, N.O.S.","II",null,"F-A S-A"]
["IMDG_1602_10063/III/DYE, LIQUID, TOXIC, N.O.S. or DYE INTERMEDIATE, LIQUID, TOXIC, N.O.S.","III",null,"F-A S-A"]
["IMDG_1603_10064/II/ETHYL BROMOACETATE","II",null,"F-E S-D"]
["IMDG_1604_10065/II/ETHYLENEDIAMINE","II",null,"F-E S-C"]
["IMDG_1605_10066/I/ETHYLENE DIBROMIDE","I",null,"F-A S-A"]
["IMDG_1606_10067/II/FERRIC ARSENATE","II","P","F-A S-A"]
["IMDG_1607_10068/II/FERRIC ARSENITE","II","P","F-A S-A"]
["IMDG_1608_10069/II/FERROUS ARSENATE","II","P","F-A S-A"]
["IMDG_1611_10070/II/HEXAETHYL TETRAPHOSPHATE","II","P","F-A S-A"]
["IMDG_1612_10071/ /HEXAETHYL TETRAPHOSPHATE AND COMPRESSED GAS MIXTURE",null,null,"F-C S-U"]
["IMDG_1613_10072/I/HYDROCYANIC ACID, AQUEOUS SOLUTION (HYDROGEN CYANIDE, AQUEOUS SOLUTION) with not more than 20% hydrogen cyanide","I","P","F-A S-A"]
["IMDG_1614_10073/I/HYDROGEN CYANIDE, STABILIZED containing less than 3% water and absorbed in a porous inert material","I","P","F-A S-U"]
["IMDG_1616_10074/III/LEAD ACETATE","III","P","F-A S-A"]
["IMDG_1617_10075/II/LEAD ARSENATES","II","P","F-A S-A"]
["IMDG_1618_10076/II/LEAD ARSENITES","II","P","F-A S-A"]
["IMDG_1620_10077/II/LEAD CYANIDE","II","P","F-A S-A"]
["IMDG_1621_10078/II/LONDON PURPLE","II","P","F-A S-A"]
["IMDG_1622_10079/II/MAGNESIUM ARSENATE","II","P","F-A S-A"]
["IMDG_1623_10080/II/MERCURIC ARSENATE","II","P","F-A S-A"]
["IMDG_1624_10101/II/MERCURIC CHLORIDE","II","P","F-A S-A"]
["IMDG_1625_10102/II/MERCURIC NITRATE","II","P","F-A S-A"]
["IMDG_1626_10103/I/MERCURIC POTASSIUM CYANIDE","I","P","F-A S-A"]
["IMDG_1627_10104/II/MERCUROUS NITRATE","II","P","F-A S-A"]
["IMDG_1629_10105/II/MERCURY ACETATE","II","P","F-A S-A"]
["IMDG_1630_10106/II/MERCURY AMMONIUM CHLORIDE","II","P","F-A S-A"]
["IMDG_1631_10107/II/MERCURY BENZOATE","II","P","F-A S-A"]
["IMDG_1634_10108/II/MERCURY BROMIDES","II","P","F-A S-A"]
["IMDG_1636_10109/II/MERCURY CYANIDE","II","P","F-A S-A"]
["IMDG_1637_10110/II/MERCURY GLUCONATE","II","P","F-A S-A"]
["IMDG_1638_10111/II/MERCURY IODIDE","II","P","F-A S-A"]
["IMDG_1639_10112/II/MERCURY NUCLEATE","II","P","F-A S-A"]
["IMDG_1640_10113/II/MERCURY OLEATE","II","P","F-A S-A"]
["IMDG_1641_10114/II/MERCURY OXIDE","II","P","F-A S-A"]
["IMDG_1642_10115/II/MERCURY OXYCYANIDE, DESENSITIZED","II","P","F-A S-A"]
["IMDG_1643_10116/II/MERCURY POTASSIUM IODIDE","II","P","F-A S-A"]
["IMDG_1644_10117/II/MERCURY SALICYLATE","II","P","F-A S-A"]
["IMDG_1645_10118/II/MERCURY SULPHATE","II","P","F-A S-A"]
["IMDG_1646_10119/II/MERCURY THIOCYANATE","II","P","F-A S-A"]
["IMDG_1647_10120/I/METHYL BROMIDE AND ETHYLENE DIBROMIDE MIXTURE, LIQUID","I","P","F-A S-A"]
["IMDG_1648_10121/II/ACETONITRILE","II",null,"F-E S-D"]
["IMDG_1649_10122/I/MOTOR FUEL ANTI-KNOCK MIXTURE","I","P","F-A S-A"]
["IMDG_1650_10123/II/beta-NAPHTHYLAMINE, SOLID","II",null,"F-A S-A"]
["IMDG_1651_10124/II/NAPHTHYLTHIOUREA","II",null,"F-A S-A"]
["IMDG_1652_10125/II/NAPHTHYLUREA","II",null,"F-A S-A"]
["IMDG_1653_10126/II/NICKEL CYANIDE","II","P","F-A S-A"]
["IMDG_1654_10127/II/NICOTINE","II",null,"F-A S-A"]
["IMDG_1655_10128/I/NICOTINE COMPOUND, SOLID, N.O.S. or NICOTINE PREPARATION, SOLID, N.O.S.","I",null,"F-A S-A"]
["IMDG_1655_10129/II/NICOTINE COMPOUND, SOLID, N.O.S. or NICOTINE PREPARATION, SOLID, N.O.S.","II",null,"F-A S-A"]
["IMDG_1655_10130/III/NICOTINE COMPOUND, SOLID, N.O.S. or NICOTINE PREPARATION, SOLID, N.O.S.","III",null,"F-A S-A"]
["IMDG_1656_10131/II/NICOTINE HYDROCHLORIDE, LIQUID or SOLUTION","II",null,"F-A S-A"]
["IMDG_1656_10132/III/NICOTINE HYDROCHLORIDE, LIQUID or SOLUTION","III",null,"F-A S-A"]
["IMDG_1657_10133/II/NICOTINE SALICYLATE","II",null,"F-A S-A"]
["IMDG_1658_10134/II/NICOTINE SULPHATE SOLUTION","II",null,"F-A S-A"]
["IMDG_1658_10135/III/NICOTINE SULPHATE SOLUTION","III",null,"F-A S-A"]
["IMDG_1659_10136/II/NICOTINE TARTRATE","II",null,"F-A S-A"]
["IMDG_1660_10137/ /NITRIC OXIDE, COMPRESSED",null,null,"F-C S-W"]
["IMDG_1661_10138/II/NITROANILINES (o-, m-, p-)","II",null,"F-A S-A"]
["IMDG_1662_10139/II/NITROBENZENE","II",null,"F-A S-A"]
["IMDG_1663_10140/III/NITROPHENOLS (o-, m-, p-)","III",null,"F-A S-A"]
["IMDG_1664_10141/II/NITROTOLUENES, LIQUID","II",null,"F-A S-A"]
["IMDG_1665_10142/II/NITROXYLENES, LIQUID","II",null,"F-A S-A"]
["IMDG_1669_10143/II/PENTACHLOROETHANE","II","P","F-A S-A"]
["IMDG_1670_10144/I/PERCHLOROMETHYL MERCAPTAN","I","P","F-A S-A"]
["IMDG_1671_10145/II/PHENOL, SOLID","II",null,"F-A S-A"]
["IMDG_1672_10146/I/PHENYLCARBYLAMINE CHLORIDE","I",null,"F-A S-A"]
["IMDG_1673_10147/III/PHENYLENEDIAMINES (o-, m-, p-)","III",null,"F-A S-A"]
["IMDG_1674_10148/II/PHENYLMERCURIC ACETATE","II","P","F-A S-A"]
["IMDG_1677_10149/II/POTASSIUM ARSENATE","II",null,"F-A S-A"]
["IMDG_1678_10150/II/POTASSIUM ARSENITE","II",null,"F-A S-A"]
["IMDG_1679_10151/II/POTASSIUM CUPROCYANIDE","II","P","F-A S-A"]
["IMDG_1680_10152/I/POTASSIUM CYANIDE, SOLID","I","P","F-A S-A"]
["IMDG_1683_10153/II/SILVER ARSENITE","II","P","F-A S-A"]
["IMDG_1684_10154/II/SILVER CYANIDE","II","P","F-A S-A"]
["IMDG_1685_10155/II/SODIUM ARSENATE","II",null,"F-A S-A"]
["IMDG_1686_10156/II/SODIUM ARSENITE, AQUEOUS SOLUTION","II",null,"F-A S-A"]
["IMDG_1686_10157/III/SODIUM ARSENITE, AQUEOUS SOLUTION","III",null,"F-A S-A"]
["IMDG_1687_10158/II/SODIUM AZIDE","II",null,"F-A S-A"]
["IMDG_1688_10159/II/SODIUM CACODYLATE","II",null,"F-A S-A"]
["IMDG_1689_10160/I/SODIUM CYANIDE, SOLID","I","P","F-A S-A"]
["IMDG_1690_10161/III/SODIUM FLUORIDE, SOLID","III",null,"F-A S-A"]
["IMDG_1691_10162/II/STRONTIUM ARSENITE","II",null,"F-A S-A"]
["IMDG_1692_10163/I/STRYCHNINE or STRYCHNINE SALTS","I","P","F-A S-A"]
["IMDG_1693_10164/I/TEAR GAS SUBSTANCE, LIQUID, N.O.S.","I",null,"F-A S-A"]
["IMDG_1693_10165/II/TEAR GAS SUBSTANCE, LIQUID, N.O.S.","II",null,"F-A S-A"]
["IMDG_1694_10166/I/BROMOBENZYL CYANIDES, LIQUID","I",null,"F-A S-A"]
["IMDG_1695_10167/I/CHLOROACETONE, STABILIZED","I","P","F-E S-C"]
["IMDG_1697_10168/II/CHLOROACETOPHENONE, SOLID","II",null,"F-A S-A"]
["IMDG_1698_10169/I/DIPHENYLAMINE CHLOROARSINE","I","P","F-A S-A"]
["IMDG_1699_10170/I/DIPHENYLCHLOROARSINE, LIQUID","I","P","F-A S-A"]
["IMDG_1700_10171/ /TEAR GAS CANDLES",null,null,"F-A S-G"]
["IMDG_1701_10172/II/XYLYL BROMIDE, LIQUID","II",null,"F-A S-A"]
["IMDG_1702_10173/II/1,1,2,2-TETRACHLOROETHANE","II","P","F-A S-A"]
["IMDG_1704_10174/II/TETRAETHYL DITHIOPYROPHOSPHATE","II","P","F-A S-A"]
["IMDG_1707_10175/II/THALLIUM COMPOUND, N.O.S.","II","P","F-A S-A"]
["IMDG_1708_10176/II/TOLUIDINES, LIQUID","II","P","F-A S-A"]
["IMDG_1709_10177/III/2,4-TOLUYLENEDIAMINE, SOLID","III",null,"F-A S-A"]
["IMDG_1710_10178/III/TRICHLOROETHYLENE","III",null,"F-A S-A"]
["IMDG_1711_10179/II/XYLIDINES, LIQUID","II",null,"F-A S-A"]
["IMDG_1712_12444/II/ZINC ARSENATE or ZINC ARSENITE or ZINC ARSENATE, ZINC ARSENITE MIXTURE","II",null,"F-A S-A"]
["IMDG_1713_10181/I/ZINC CYANIDE","I","P","F-A S-A"]
["IMDG_1714_10182/I/ZINC PHOSPHIDE","I",null,"F-G S-N"]
["IMDG_1715_10183/II/ACETIC ANHYDRIDE","II",null,"F-E S-C"]
["IMDG_1716_10184/II/ACETYL BROMIDE","II",null,"F-A S-B"]
["IMDG_1717_10185/II/ACETYL CHLORIDE","II",null,"F-E S-C"]
["IMDG_1718_10186/III/BUTYL ACID PHOSPHATE","III",null,"F-A S-B"]
["IMDG_1719_10187/II/CAUSTIC ALKALI LIQUID, N.O.S.","II",null,"F-A S-B"]
["IMDG_1719_10188/III/CAUSTIC ALKALI LIQUID, N.O.S.","III",null,"F-A S-B"]
["IMDG_1722_10189/I/ALLYL CHLOROFORMATE","I",null,"F-E S-C"]
["IMDG_1723_10190/II/ALLYL IODIDE","II",null,"F-E S-C"]
["IMDG_1724_10191/II/ALLYLTRICHLOROSILANE, STABILIZED","II",null,"F-E S-C"]
["IMDG_1725_10192/II/ALUMINIUM BROMIDE, ANHYDROUS","II",null,"F-A S-B"]
["IMDG_1726_10193/II/ALUMINIUM CHLORIDE, ANHYDROUS","II",null,"F-A S-B"]
["IMDG_1727_10194/II/AMMONIUM HYDROGENDIFLUORIDE, SOLID","II",null,"F-A S-B"]
["IMDG_1728_10195/II/AMYLTRICHLOROSILANE","II",null,"F-A S-B"]
["IMDG_1729_10196/II/ANISOYL CHLORIDE","II",null,"F-A S-B"]
["IMDG_1730_10197/II/ANTIMONY PENTACHLORIDE, LIQUID","II",null,"F-A S-B"]
["IMDG_1731_10198/II/ANTIMONY PENTACHLORIDE SOLUTION","II",null,"F-A S-B"]
["IMDG_1731_10199/III/ANTIMONY PENTACHLORIDE SOLUTION","III",null,"F-A S-B"]
["IMDG_1732_10200/II/ANTIMONY PENTAFLUORIDE","II",null,"F-A S-B"]
["IMDG_1733_10201/II/ANTIMONY TRICHLORIDE","II",null,"F-A S-B"]
["IMDG_1736_10202/II/BENZOYL CHLORIDE","II",null,"F-A S-B"]
["IMDG_1737_10203/II/BENZYL BROMIDE","II",null,"F-A S-B"]
["IMDG_1738_10204/II/BENZYL CHLORIDE","II",null,"F-A S-B"]
["IMDG_1739_10205/I/BENZYL CHLOROFORMATE","I","P","F-A S-B"]
["IMDG_1740_10206/II/HYDROGENDIFLUORIDES, SOLID, N.O.S.","II",null,"F-A S-B"]
["IMDG_1740_10207/III/HYDROGENDIFLUORIDES, SOLID, N.O.S.","III",null,"F-A S-B"]
["IMDG_1741_10208/ /BORON TRICHLORIDE",null,null,"F-C S-U"]
["IMDG_1742_10209/II/BORON TRIFLUORIDE ACETIC ACID COMPLEX, LIQUID","II",null,"F-A S-B"]
["IMDG_1743_10210/II/BORON TRIFLUORIDE PROPIONIC ACID COMPLEX, LIQUID","II",null,"F-A S-B"]
["IMDG_1744_10211/I/BROMINE or BROMINE SOLUTION","I",null,"F-A S-B"]
["IMDG_1745_10212/I/BROMINE PENTAFLUORIDE","I",null,"F-A S-B"]
["IMDG_1746_10213/I/BROMINE TRIFLUORIDE","I",null,"F-A S-B"]
["IMDG_1747_10214/II/BUTYLTRICHLOROSILANE","II",null,"F-E S-C"]
["IMDG_1748_10215/II/CALCIUM HYPOCHLORITE, DRY or CALCIUM HYPOCHLORITE MIXTURE, DRY with more than 39% available chlorine (8.8% available oxygen)","II","P","F-H S-Q"]
["IMDG_1748_10216/III/CALCIUM HYPOCHLORITE, DRY or CALCIUM HYPOCHLORITE MIXTURE, DRY with more than 39% available chlorine (8.8% available oxygen)","III","P","F-H S-Q"]
["IMDG_1749_10217/ /CHLORINE TRIFLUORIDE",null,null,"F-C S-W"]
["IMDG_1750_10218/II/CHLOROACETIC ACID SOLUTION","II",null,"F-A S-B"]
["IMDG_1751_10219/II/CHLOROACETIC ACID, SOLID","II",null,"F-A S-B"]
["IMDG_1752_10220/I/CHLOROACETYL CHLORIDE","I",null,"F-A S-B"]
["IMDG_1753_12061/II/CHLOROPHENYL- TRICHLOROSILANE","II","P","F-A S-B"]
["IMDG_1754_10222/I/CHLOROSULPHONIC ACID (with or without sulphur trioxide)","I",null,"F-A S-B"]
["IMDG_1755_10223/II/CHROMIC ACID SOLUTION","II",null,"F-A S-B"]
["IMDG_1755_10224/III/CHROMIC ACID SOLUTION","III",null,"F-A S-B"]
["IMDG_1756_10225/II/CHROMIC FLUORIDE, SOLID","II",null,"F-A S-B"]
["IMDG_1757_10226/II/CHROMIC FLUORIDE SOLUTION","II",null,"F-A S-B"]
["IMDG_1757_10227/III/CHROMIC FLUORIDE SOLUTION","III",null,"F-A S-B"]
["IMDG_1758_10228/I/CHROMIUM OXYCHLORIDE","I",null,"F-A S-B"]
["IMDG_1759_10229/I/CORROSIVE SOLID, N.O.S.","I",null,"F-A S-B"]
["IMDG_1759_10230/II/CORROSIVE SOLID, N.O.S.","II",null,"F-A S-B"]
["IMDG_1759_10231/III/CORROSIVE SOLID, N.O.S.","III",null,"F-A S-B"]
["IMDG_1760_10232/I/CORROSIVE LIQUID, N.O.S.","I",null,"F-A S-B"]
["IMDG_1760_10233/II/CORROSIVE LIQUID, N.O.S.","II",null,"F-A S-B"]
["IMDG_1760_10234/III/CORROSIVE LIQUID, N.O.S.","III",null,"F-A S-B"]
["IMDG_1761_10235/II/CUPRIETHYLENEDIAMINE SOLUTION","II","P","F-A S-B"]
["IMDG_1761_10236/III/CUPRIETHYLENEDIAMINE SOLUTION","III","P","F-A S-B"]
["IMDG_1762_12062/II/CYCLOHEXENYLTRICHLORO- SILANE","II",null,"F-A S-B"]
["IMDG_1763_12063/II/CYCLOHEXYLTRICHLORO- SILANE","II",null,"F-A S-B"]
["IMDG_1764_10239/II/DICHLOROACETIC ACID","II",null,"F-A S-B"]
["IMDG_1765_10240/II/DICHLOROACETYL CHLORIDE","II",null,"F-A S-B"]
["IMDG_1766_12064/II/DICHLOROPHENYL- TRICHLOROSILANE","II","P","F-A S-B"]
["IMDG_1767_10242/II/DIETHYLDICHLOROSILANE","II",null,"F-E S-C"]
["IMDG_1768_10243/II/DIFLUOROPHOSPHORIC ACID, ANHYDROUS","II",null,"F-A S-B"]
["IMDG_1769_10244/II/DIPHENYLDICHLOROSILANE","II",null,"F-A S-B"]
["IMDG_1770_10245/II/DIPHENYLMETHYL BROMIDE","II",null,"F-A S-B"]
["IMDG_1771_10246/II/DODECYLTRICHLOROSILANE","II",null,"F-A S-B"]
["IMDG_1773_10247/III/FERRIC CHLORIDE, ANHYDROUS","III",null,"F-A S-B"]
["IMDG_1774_10248/II/FIRE EXTINGUISHER CHARGES corrosive liquid","II",null,"F-A S-B"]
["IMDG_1775_10249/II/FLUOROBORIC ACID","II",null,"F-A S-B"]
["IMDG_1776_10250/II/FLUOROPHOSPHORIC ACID, ANHYDROUS","II",null,"F-A S-B"]
["IMDG_1777_10251/I/FLUOROSULPHONIC ACID","I",null,"F-A S-B"]
["IMDG_1778_10252/II/FLUOROSILICIC ACID","II",null,"F-A S-B"]
["IMDG_1779_10253/II/FORMIC ACID with more than 85% acid, by mass","II",null,"F-E S-C"]
["IMDG_1780_10254/II/FUMARYL CHLORIDE","II",null,"F-A S-B"]
["IMDG_1781_12065/II/HEXADECYLTRICHLORO-SILANE","II",null,"F-A S-B"]
["IMDG_1782_10256/II/HEXAFLUOROPHOSPHORIC ACID","II",null,"F-A S-B"]
["IMDG_1783_10257/II/HEXAMETHYLENEDIAMINE SOLUTION","II",null,"F-A S-B"]
["IMDG_1783_10258/III/HEXAMETHYLENEDIAMINE SOLUTION","III",null,"F-A S-B"]
["IMDG_1784_10259/II/HEXYLTRICHLOROSILANE","II",null,"F-A S-B"]
["IMDG_1786_10260/I/HYDROFLUORIC ACID AND SULPHURIC ACID MIXTURE","I",null,"F-A S-B"]
["IMDG_1787_10261/II/HYDRIODIC ACID","II",null,"F-A S-B"]
["IMDG_1787_10262/III/HYDRIODIC ACID","III",null,"F-A S-B"]
["IMDG_1788_10263/II/HYDROBROMIC ACID","II",null,"F-A S-B"]
["IMDG_1788_10264/III/HYDROBROMIC ACID","III",null,"F-A S-B"]
["IMDG_1789_10265/II/HYDROCHLORIC ACID","II",null,"F-A S-B"]
["IMDG_1789_10266/III/HYDROCHLORIC ACID","III",null,"F-A S-B"]
["IMDG_1790_10267/I/HYDROFLUORIC ACID solution, with more than 60% hydrogen fluoride","I",null,"F-A S-B"]
["IMDG_1790_10268/II/HYDROFLUORIC ACID solution, with not more than 60% hydrogen fluoride","II",null,"F-A S-B"]
["IMDG_1791_10269/II/HYPOCHLORITE SOLUTION","II","P","F-A S-B"]
["IMDG_1791_10270/III/HYPOCHLORITE SOLUTION","III","P","F-A S-B"]
["IMDG_1792_10271/II/IODINE MONOCHLORIDE, SOLID","II",null,"F-A S-B"]
["IMDG_1793_10272/III/ISOPROPYL ACID PHOSPHATE","III",null,"F-A S-B"]
["IMDG_1794_10273/II/LEAD SULPHATE with more than 3% free acid","II",null,"F-A S-B"]
["IMDG_1796_10274/I/NITRATING ACID MIXTURE with more than 50% nitric acid","I",null,"F-A S-Q"]
["IMDG_1796_10275/II/NITRATING ACID MIXTURE with not more than 50% nitric acid","II",null,"F-A S-B"]
["IMDG_1798_10276/I/NITROHYDROCHLORIC ACID","I",null,"F-A S-B"]
["IMDG_1799_10277/II/NONYLTRICHLOROSILANE","II",null,"F-A S-B"]
["IMDG_1800_12066/II/OCTADECYLTRICHLORO- SILANE","II",null,"F-A S-B"]
["IMDG_1801_10279/II/OCTYLTRICHLOROSILANE","II",null,"F-A S-B"]
["IMDG_1802_10280/II/PERCHLORIC ACID with not more than 50% acid, by mass","II",null,"F-H S-Q"]
["IMDG_1803_10281/II/PHENOLSULPHONIC ACID, LIQUID","II",null,"F-A S-B"]
["IMDG_1804_10282/II/PHENYLTRICHLOROSILANE","II",null,"F-A S-B"]
["IMDG_1805_10283/III/PHOSPHORIC ACID SOLUTION","III",null,"F-A S-B"]
["IMDG_1806_10284/II/PHOSPHORUS PENTACHLORIDE","II",null,"F-A S-B"]
["IMDG_1807_10285/II/PHOSPHORUS PENTOXIDE","II",null,"F-A S-B"]
["IMDG_1808_10286/II/PHOSPHORUS TRIBROMIDE","II",null,"F-A S-B"]
["IMDG_1809_10287/I/PHOSPHORUS TRICHLORIDE","I",null,"F-A S-B"]
["IMDG_1810_10288/I/PHOSPHORUS OXYCHLORIDE","I",null,"F-A S-B"]
["IMDG_1811_10289/II/POTASSIUM HYDROGEN DIFLUORIDE, SOLID","II",null,"F-A S-B"]
["IMDG_1812_10290/III/POTASSIUM FLUORIDE, SOLID","III",null,"F-A S-A"]
["IMDG_1813_10291/II/POTASSIUM HYDROXIDE, SOLID","II",null,"F-A S-B"]
["IMDG_1814_10292/II/POTASSIUM HYDROXIDE SOLUTION","II",null,"F-A S-B"]
["IMDG_1814_10293/III/POTASSIUM HYDROXIDE SOLUTION","III",null,"F-A S-B"]
["IMDG_1815_10294/II/PROPIONYL CHLORIDE","II",null,"F-E S-C"]
["IMDG_1816_10295/II/PROPYLTRICHLOROSILANE","II",null,"F-E S-C"]
["IMDG_1817_10296/II/PYROSULPHURYL CHLORIDE","II",null,"F-A S-B"]
["IMDG_1818_10297/II/SILICON TETRACHLORIDE","II",null,"F-A S-B"]
["IMDG_1819_10298/II/SODIUM ALUMINATE SOLUTION","II",null,"F-A S-B"]
["IMDG_1819_10299/III/SODIUM ALUMINATE SOLUTION","III",null,"F-A S-B"]
["IMDG_1823_10300/II/SODIUM HYDROXIDE, SOLID","II",null,"F-A S-B"]
["IMDG_1824_10301/II/SODIUM HYDROXIDE SOLUTION","II",null,"F-A S-B"]
["IMDG_1824_10302/III/SODIUM HYDROXIDE SOLUTION","III",null,"F-A S-B"]
["IMDG_1825_10303/II/SODIUM MONOXIDE","II",null,"F-A S-B"]
["IMDG_1826_10304/I/NITRATING ACID MIXTURE, SPENT with more than 50% nitric acid","I",null,"F-A S-Q"]
["IMDG_1826_10305/II/NITRATING ACID MIXTURE, SPENT with not more than 50% nitric acid","II",null,"F-A S-B"]
["IMDG_1827_10306/II/STANNIC CHLORIDE, ANHYDROUS","II",null,"F-A S-B"]
["IMDG_1828_10307/I/SULPHUR CHLORIDES","I",null,"F-A S-B"]
["IMDG_1829_10308/I/SULPHUR TRIOXIDE, STABILIZED","I",null,"F-A S-B"]
["IMDG_1830_10309/II/SULPHURIC ACID with more than 51% acid","II",null,"F-A S-B"]
["IMDG_1831_10310/I/SULPHURIC ACID, FUMING","I",null,"F-A S-B"]
["IMDG_1832_10311/II/SULPHURIC ACID, SPENT","II",null,"F-A S-B"]
["IMDG_1833_10312/II/SULPHUROUS ACID","II",null,"F-A S-B"]
["IMDG_1834_10313/I/SULPHURYL CHLORIDE","I",null,"F-A S-B"]
["IMDG_1835_10314/II/TETRAMETHYLAMMONIUM HYDROXIDE SOLUTION","II",null,"F-A S-B"]
["IMDG_1835_10315/III/TETRAMETHYLAMMONIUM HYDROXIDE SOLUTION","III",null,"F-A S-B"]
["IMDG_1836_10316/I/THIONYL CHLORIDE","I",null,"F-A S-B"]
["IMDG_1837_10317/II/THIOPHOSPHORYL CHLORIDE","II",null,"F-A S-B"]
["IMDG_1838_10318/I/TITANIUM TETRACHLORIDE","I",null,"F-A S-B"]
["IMDG_1839_10319/II/TRICHLOROACETIC ACID, SOLID","II",null,"F-A S-B"]
["IMDG_1840_10320/III/ZINC CHLORIDE SOLUTION","III","P","F-A S-B"]
["IMDG_1841_10321/III/ACETALDEHYDE AMMONIA","III",null,"F-A S-B"]
["IMDG_1843_12067/II/AMMONIUM DINITRO-o- CRESOLATE, SOLID","II","P","F-A S-A"]
["IMDG_1845_10323/ /CARBON DIOXIDE, SOLID (DRY ICE)",null,null,"F-C S-V"]
["IMDG_1846_10324/II/CARBON TETRACHLORIDE","II","P","F-A S-A"]
["IMDG_1847_10325/II/POTASSIUM SULPHIDE, HYDRATED with not less than 30% water of crystallization","II",null,"F-A S-B"]
["IMDG_1848_10326/III/PROPIONIC ACID with not less than 10% and less than 90% acid, by mass","III",null,"F-A S-B"]
["IMDG_1849_10327/II/SODIUM SULPHIDE, HYDRATED with not less than 30% water","II",null,"F-A S-B"]
["IMDG_1851_10328/II/MEDICINE, LIQUID, TOXIC, N.O.S.","II",null,"F-A S-A"]
["IMDG_1851_10329/III/MEDICINE, LIQUID, TOXIC, N.O.S.","III",null,"F-A S-A"]
["IMDG_1854_10330/I/BARIUM ALLOYS, PYROPHORIC","I",null,"F-G S-M"]
["IMDG_1855_10331/I/CALCIUM, PYROPHORIC or CALCIUM ALLOYS, PYROPHORIC","I",null,"F-G S-M"]
["IMDG_1856_10332/ /RAGS, OILY",null,null,"F-A S-J"]
["IMDG_1857_10333/III/TEXTILE WASTE, WET","III",null,"F-A S-J"]
["IMDG_1858_10334/ /HEXAFLUOROPROPYLENE (REFRIGERANT GAS R 1216)",null,null,"F-C S-V"]
["IMDG_1859_10335/ /SILICON TETRAFLUORIDE",null,null,"F-C S-U"]
["IMDG_1860_10336/ /VINYL FLUORIDE, STABILIZED",null,null,"F-D S-U"]
["IMDG_1862_10337/II/ETHYL CROTONATE","II",null,"F-E S-D"]
["IMDG_1863_10338/I/FUEL, AVIATION, TURBINE ENGINE","I",null,"F-E S-E"]
["IMDG_1863_10339/II/FUEL, AVIATION, TURBINE ENGINE","II",null,"F-E S-E"]
["IMDG_1863_10340/III/FUEL, AVIATION, TURBINE ENGINE","III",null,"F-E S-E"]
["IMDG_1865_10341/II/n-PROPYL NITRATE","II",null,"F-E S-D"]
["IMDG_1866_10342/I/RESIN SOLUTION flammable","I",null,"F-E S-E"]
["IMDG_1866_10343/II/RESIN SOLUTION flammable","II",null,"F-E S-E"]
["IMDG_1866_10344/III/RESIN SOLUTION flammable","III",null,"F-E S-E"]
["IMDG_1868_10345/II/DECABORANE","II",null,"F-A S-G"]
["IMDG_1869_10346/III/MAGNESIUM or MAGNESIUM ALLOYS with more than 50% magnesium in pellets, turnings or ribbons","III",null,"F-G S-G"]
["IMDG_1870_10347/I/POTASSIUM BOROHYDRIDE","I",null,"F-G S-O"]
["IMDG_1871_10348/II/TITANIUM HYDRIDE","II",null,"F-A S-G"]
["IMDG_1872_10349/III/LEAD DIOXIDE","III",null,"F-A S-Q"]
["IMDG_1873_10350/I/PERCHLORIC ACID with more than 50% but not more than 72% acid, by mass","I",null,"F-A S-Q"]
["IMDG_1884_10351/III/BARIUM OXIDE","III",null,"F-A S-A"]
["IMDG_1885_10352/II/BENZIDINE","II",null,"F-A S-A"]
["IMDG_1886_10353/II/BENZYLIDENE CHLORIDE","II",null,"F-A S-A"]
["IMDG_1887_10354/III/BROMOCHLOROMETHANE","III",null,"F-A S-A"]
["IMDG_1888_10355/III/CHLOROFORM","III",null,"F-A S-A"]
["IMDG_1889_10356/I/CYANOGEN BROMIDE","I","P","F-A S-B"]
["IMDG_1891_10357/II/ETHYL BROMIDE","II",null,"F-A S-A"]
["IMDG_1892_10358/I/ETHYLDICHLOROARSINE","I","P","F-A S-A"]
["IMDG_1894_10359/II/PHENYLMERCURIC HYDROXIDE","II","P","F-A S-A"]
["IMDG_1895_10360/II/PHENYLMERCURIC NITRATE","II","P","F-A S-A"]
["IMDG_1897_10361/III/TETRACHLOROETHYLENE","III","P","F-A S-A"]
["IMDG_1898_10362/II/ACETYL IODIDE","II",null,"F-A S-B"]
["IMDG_1902_10363/III/DIISOOCTYL ACID PHOSPHATE","III",null,"F-A S-B"]
["IMDG_1903_10364/I/DISINFECTANT, LIQUID, CORROSIVE, N.O.S.","I",null,"F-A S-B"]
["IMDG_1903_10365/II/DISINFECTANT, LIQUID, CORROSIVE, N.O.S.","II",null,"F-A S-B"]
["IMDG_1903_10366/III/DISINFECTANT, LIQUID, CORROSIVE, N.O.S.","III",null,"F-A S-B"]
["IMDG_1905_10367/I/SELENIC ACID","I",null,"F-A S-B"]
["IMDG_1906_10368/II/SLUDGE ACID","II",null,"F-A S-B"]
["IMDG_1907_10369/III/SODA LIME with more than 4% sodium hydroxide","III",null,"F-A S-B"]
["IMDG_1908_10370/II/CHLORITE SOLUTION","II",null,"F-A S-B"]
["IMDG_1908_10371/III/CHLORITE SOLUTION","III",null,"F-A S-B"]
["IMDG_1910_10372/ /CALCIUM OXIDE"]
["IMDG_1911_10373/ /DIBORANE",null,null,"F-D S-U"]
["IMDG_1912_10374/ /METHYL CHLORIDE AND METHYLENE CHLORIDE MIXTURE",null,null,"F-D S-U"]
["IMDG_1913_10375/ /NEON, REFRIGERATED LIQUID",null,null,"F-C S-V"]
["IMDG_1914_10376/III/BUTYL PROPIONATES","III",null,"F-E S-D"]
["IMDG_1915_10377/III/CYCLOHEXANONE","III",null,"F-E S-D"]
["IMDG_1916_12068/II/2,2’-DICHLORODIETHYL ETHER","II",null,"F-E S-D"]
["IMDG_1917_10379/II/ETHYL ACRYLATE, STABILIZED","II",null,"F-E S-D"]
["IMDG_1918_10380/III/ISOPROPYLBENZENE","III",null,"F-E S-E"]
["IMDG_1919_10381/II/METHYL ACRYLATE, STABILIZED","II",null,"F-E S-D"]
["IMDG_1920_10382/III/NONANES","III","P","F-E S-E"]
["IMDG_1921_10383/I/PROPYLENEIMINE, STABILIZED","I",null,"F-E S-D"]
["IMDG_1922_10384/II/PYRROLIDINE","II",null,"F-E S-C"]
["IMDG_1923_10385/II/CALCIUM DITHIONITE (CALCIUM HYDROSULPHITE)","II",null,"F-A S-J"]
["IMDG_1928_10386/I/METHYLMAGNESIUM BROMIDE IN ETHYL ETHER","I",null,"F-G S-L"]
["IMDG_1929_10387/II/POTASSIUM DITHIONITE (POTASSIUM HYDROSULPHITE)","II",null,"F-A S-J"]
["IMDG_1931_10388/III/ZINC DITHIONITE (ZINC HYDROSULPHITE)","III",null,"F-A S-J"]
["IMDG_1932_10389/III/ZIRCONIUM, SCRAP","III",null,"F-G S-L"]
["IMDG_1935_10390/I/CYANIDE SOLUTION, N.O.S.","I","P","F-A S-A"]
["IMDG_1935_10391/II/CYANIDE SOLUTION, N.O.S.","II","P","F-A S-A"]
["IMDG_1935_10392/III/CYANIDE SOLUTION, N.O.S.","III","P","F-A S-A"]
["IMDG_1938_10393/II/BROMOACETIC ACID SOLUTION","II",null,"F-A S-B"]
["IMDG_1938_10394/III/BROMOACETIC ACID SOLUTION","III",null,"F-A S-B"]
["IMDG_1939_10395/II/PHOSPHORUS OXYBROMIDE","II",null,"F-A S-B"]
["IMDG_1940_10396/II/THIOGLYCOLIC ACID","II",null,"F-A S-B"]
["IMDG_1941_10397/III/DIBROMODIFLUOROMETHANE","III",null,"F-A S-A"]
["IMDG_1942_10398/III/AMMONIUM NITRATE with not more than 0.2% combustible substances, including any organic substance calculated as carbon, to the exclusion of any other added substance","III",null,"F-H S-Q"]
["IMDG_1944_10399/III/MATCHES, SAFETY (book, card or strike on box)","III",null,"F-A S-I"]
["IMDG_1945_12069/III/MATCHES, WAX ‘VESTA’","III",null,"F-A S-I"]
["IMDG_1950_10401/ /AEROSOLS",null,null,"F-D S-U"]
["IMDG_1951_10402/ /ARGON, REFRIGERATED LIQUID",null,null,"F-C S-V"]
["IMDG_1952_10403/ /ETHYLENE OXIDE AND CARBON DIOXIDE MIXTURE with not more than 9% ethylene oxide",null,null,"F-C S-V"]
["IMDG_1953_10404/ /COMPRESSED GAS, TOXIC, FLAMMABLE, N.O.S.",null,null,"F-D S-U"]
["IMDG_1954_10405/ /COMPRESSED GAS, FLAMMABLE, N.O.S.",null,null,"F-D S-U"]
["IMDG_1955_10406/ /COMPRESSED GAS, TOXIC, N.O.S.",null,null,"F-C S-U"]
["IMDG_1956_10407/ /COMPRESSED GAS, N.O.S.",null,null,"F-C S-V"]
["IMDG_1957_10408/ /DEUTERIUM, COMPRESSED",null,null,"F-D S-U"]
["IMDG_1958_12070/ /1,2-DICHLORO-1,1,2,2- TETRAFLUOROETHANE (REFRIGERANT GAS R 114)",null,null,"F-C S-V"]
["IMDG_1959_10410/ /1,1-DIFLUOROETHYLENE (REFRIGERANT GAS R 1132a)",null,null,"F-D S-U"]
["IMDG_1961_10411/ /ETHANE, REFRIGERATED LIQUID",null,null,"F-D S-U"]
["IMDG_1962_10412/ /ETHYLENE",null,null,"F-D S-U"]
["IMDG_1963_10413/ /HELIUM, REFRIGERATED LIQUID",null,null,"F-C S-V"]
["IMDG_1964_10414/ /HYDROCARBON GAS MIXTURE, COMPRESSED, N.O.S.",null,null,"F-D S-U"]
["IMDG_1965_10415/ /HYDROCARBON GAS MIXTURE, LIQUEFIED, N.O.S.",null,null,"F-D S-U"]
["IMDG_1966_10416/ /HYDROGEN, REFRIGERATED LIQUID",null,null,"F-D S-U"]
["IMDG_1967_10417/ /INSECTICIDE GAS, TOXIC, N.O.S.",null,null,"F-C S-U"]
["IMDG_1968_10418/ /INSECTICIDE GAS, N.O.S.",null,null,"F-C S-V"]
["IMDG_1969_10419/ /ISOBUTANE",null,null,"F-D S-U"]
["IMDG_1970_10420/ /KRYPTON, REFRIGERATED LIQUID",null,null,"F-C S-V"]
["IMDG_1971_10421/ /METHANE, COMPRESSED or NATURAL GAS, COMPRESSED with high methane content",null,null,"F-D S-U"]
["IMDG_1972_10422/ /METHANE, REFRIGERATED LIQUID or NATURAL GAS, REFRIGERATED LIQUID with high methane content",null,null,"F-D S-U"]
["IMDG_1973_12071/ /CHLORODIFLUOROMETHANE AND CHLOROPENTAFLUORO- ETHANE MIXTURE with a fixed boiling point, with approximately 49% chlorodifluoromethane (REFRIGERANT GAS R 502)",null,null,"F-C S-V"]
["IMDG_1974_12072/ /CHLORODIFLUOROBROMO- METHANE (REFRIGERANT GAS R 12B1)",null,null,"F-C S-V"]
["IMDG_1975_10425/ /NITRIC OXIDE AND DINITROGEN TETROXIDE MIXTURE (NITRIC OXIDE AND NITROGEN DIOXIDE MIXTURE)",null,null,"F-C S-W"]
["IMDG_1976_10426/ /OCTAFLUOROCYCLOBUTANE (REFRIGERANT GAS RC 318)",null,null,"F-C S-V"]
["IMDG_1977_10427/ /NITROGEN, REFRIGERATED LIQUID",null,null,"F-C S-V"]
["IMDG_1978_10428/ /PROPANE",null,null,"F-D S-U"]
["IMDG_1982_10429/ /TETRAFLUOROMETHANE (REFRIGERANT GAS R 14)",null,null,"F-C S-V"]
["IMDG_1983_12073/ /1-CHLORO-2,2,2-TRIFLUORO- ETHANE (REFRIGERANT GAS R 133a)",null,null,"F-C S-V"]
["IMDG_1984_10431/ /TRIFLUOROMETHANE (REFRIGERANT GAS R 23)",null,null,"F-C S-V"]
["IMDG_1986_10432/I/ALCOHOLS, FLAMMABLE, TOXIC, N.O.S.","I",null,"F-E S-D"]
["IMDG_1986_10433/II/ALCOHOLS, FLAMMABLE, TOXIC, N.O.S.","II",null,"F-E S-D"]
["IMDG_1986_10434/III/ALCOHOLS, FLAMMABLE, TOXIC, N.O.S.","III",null,"F-E S-D"]
["IMDG_1987_10435/II/ALCOHOLS, N.O.S.","II",null,"F-E S-D"]
["IMDG_1987_10436/III/ALCOHOLS, N.O.S.","III",null,"F-E S-D"]
["IMDG_1988_10437/I/ALDEHYDES, FLAMMABLE, TOXIC, N.O.S.","I",null,"F-E S-D"]
["IMDG_1988_10438/II/ALDEHYDES, FLAMMABLE, TOXIC, N.O.S.","II",null,"F-E S-D"]
["IMDG_1988_10439/III/ALDEHYDES, FLAMMABLE, TOXIC, N.O.S.","III",null,"F-E S-D"]
["IMDG_1989_10440/I/ALDEHYDES, N.O.S.","I",null,"F-E S-D"]
["IMDG_1989_10441/II/ALDEHYDES, N.O.S.","II",null,"F-E S-D"]
["IMDG_1989_10442/III/ALDEHYDES, N.O.S.","III",null,"F-E S-D"]
["IMDG_1990_10443/III/BENZALDEHYDE","III",null,"F-A S-A"]
["IMDG_1991_10444/I/CHLOROPRENE, STABILIZED","I",null,"F-E S-D"]
["IMDG_1992_10445/I/FLAMMABLE LIQUID, TOXIC, N.O.S.","I",null,"F-E S-D"]
["IMDG_1992_10446/II/FLAMMABLE LIQUID, TOXIC, N.O.S.","II",null,"F-E S-D"]
["IMDG_1992_10447/III/FLAMMABLE LIQUID, TOXIC, N.O.S.","III",null,"F-E S-D"]
["IMDG_1993_10448/I/FLAMMABLE LIQUID, N.O.S.","I",null,"F-E S-E"]
["IMDG_1993_10449/II/FLAMMABLE LIQUID, N.O.S.","II",null,"F-E S-E"]
["IMDG_1993_10450/III/FLAMMABLE LIQUID, N.O.S.","III",null,"F-E S-E"]
["IMDG_1994_10451/I/IRON PENTACARBONYL","I",null,"F-E S-D"]
["IMDG_1999_12074/II/TARS, LIQUID, including road oils, and cutback bitumens","II",null,"F-E S-E"]
["IMDG_1999_12075/III/TARS, LIQUID, including road oils, and cutback bitumens","III",null,"F-E S-E"]
["IMDG_2000_10454/III/CELLULOID in block, rods, rolls, sheets, tubes, etc., except scrap","III",null,"F-A S-I"]
["IMDG_2001_10455/III/COBALT NAPHTHENATES, POWDER","III",null,"F-A S-I"]
["IMDG_2002_10456/III/CELLULOID, SCRAP","III",null,"F-A S-J"]
["IMDG_2004_10457/II/MAGNESIUM DIAMIDE","II",null,"F-G S-M"]
["IMDG_2006_12076/III/PLASTICS, NITROCELLULOSE- BASED, SELF-HEATING, N.O.S.","III",null,"F-A S-G"]
["IMDG_2008_10459/I/ZIRCONIUM POWDER, DRY","I",null,"F-G S-M"]
["IMDG_2008_10460/II/ZIRCONIUM POWDER, DRY","II",null,"F-G S-M"]
["IMDG_2008_10461/III/ZIRCONIUM POWDER, DRY","III",null,"F-G S-M"]
["IMDG_2009_10462/III/ZIRCONIUM, DRY finished sheets, strip or coiled wire","III",null,"F-G S-M"]
["IMDG_2010_10463/I/MAGNESIUM HYDRIDE","I",null,"F-G S-O"]
["IMDG_2011_10464/I/MAGNESIUM PHOSPHIDE","I",null,"F-G S-N"]
["IMDG_2012_10465/I/POTASSIUM PHOSPHIDE","I",null,"F-G S-N"]
["IMDG_2013_10466/I/STRONTIUM PHOSPHIDE","I",null,"F-G S-N"]
["IMDG_2014_10467/II/HYDROGEN PEROXIDE, AQUEOUS SOLUTION with not less than 20% but not more than 60% hydrogen peroxide (stabilized as necessary)","II",null,"F-H S-Q"]
["IMDG_2015_12077/I/HYDROGEN PEROXIDE, STABILIZED or HYDROGEN PEROXIDE, AQUEOUS SOLUTION, STABILIZED with more than 60% hydrogen peroxide","I",null,"F-H S-Q"]
["IMDG_2016_12078/ /AMMUNITION, TOXIC, NON- EXPLOSIVE without burster or expelling charge, non-fuzed",null,null,"F-A S-A"]
["IMDG_2017_10470/ /AMMUNITION, TEAR-PRODUCING, NON-EXPLOSIVE without burster or expelling charge, non-fuzed",null,null,"F-A S-B"]
["IMDG_2018_10471/II/CHLOROANILINES, SOLID","II",null,"F-A S-A"]
["IMDG_2019_10472/II/CHLOROANILINES, LIQUID","II",null,"F-A S-A"]
["IMDG_2020_10473/III/CHLOROPHENOLS, SOLID","III",null,"F-A S-A"]
["IMDG_2021_10474/III/CHLOROPHENOLS, LIQUID","III",null,"F-A S-A"]
["IMDG_2022_10475/II/CRESYLIC ACID","II",null,"F-A S-B"]
["IMDG_2023_10476/II/EPICHLOROHYDRIN","II","P","F-E S-D"]
["IMDG_2024_10477/I/MERCURY COMPOUND, LIQUID, N.O.S.","I","P","F-A S-A"]
["IMDG_2024_10478/II/MERCURY COMPOUND, LIQUID, N.O.S.","II","P","F-A S-A"]
["IMDG_2024_10479/III/MERCURY COMPOUND, LIQUID, N.O.S.","III","P","F-A S-A"]
["IMDG_2025_10480/I/MERCURY COMPOUND, SOLID, N.O.S.","I","P","F-A S-A"]
["IMDG_2025_10481/II/MERCURY COMPOUND, SOLID, N.O.S.","II","P","F-A S-A"]
["IMDG_2025_10482/III/MERCURY COMPOUND, SOLID, N.O.S.","III","P","F-A S-A"]
["IMDG_2026_10483/I/PHENYLMERCURIC COMPOUND, N.O.S.","I","P","F-A S-A"]
["IMDG_2026_10484/II/PHENYLMERCURIC COMPOUND, N.O.S.","II","P","F-A S-A"]
["IMDG_2026_10485/III/PHENYLMERCURIC COMPOUND, N.O.S.","III","P","F-A S-A"]
["IMDG_2027_10486/II/SODIUM ARSENITE, SOLID","II",null,"F-A S-A"]
["IMDG_2028_10487/II/BOMBS, SMOKE, NON-EXPLOSIVE with corrosive liquid, without initiating device","II",null,"F-A S-B"]
["IMDG_2029_10488/I/HYDRAZINE, ANHYDROUS","I",null,"F-E S-C"]
["IMDG_2030_12079/I/HYDRAZINE, AQUEOUS SOLUTION with more than 37% hydrazine, by mass","I",null,"F-A S-B"]
["IMDG_2030_12080/II/HYDRAZINE, AQUEOUS SOLUTION with more than 37% hydrazine, by mass","II",null,"F-A S-B"]
["IMDG_2030_12081/III/HYDRAZINE, AQUEOUS SOLUTION with more than 37% hydrazine, by mass","III",null,"F-A S-B"]
["IMDG_2031_10493/II/NITRIC ACID other than red fuming, with at least 65% but with not more than 70% nitric acid.","II",null,"F-A S-Q"]
["IMDG_2031_10494/II/NITRIC ACID other than red fuming, with less than 65% nitric acid","II",null,"F-A S-B"]
["IMDG_2031_12082/I/NITRIC ACID other than red fuming, with more than 70% nitric acid","I",null,"F-A S-Q"]
["IMDG_2032_10495/I/NITRIC ACID, RED FUMING","I",null,"F-A S-Q"]
["IMDG_2033_10496/II/POTASSIUM MONOXIDE","II",null,"F-A S-B"]
["IMDG_2034_10497/ /HYDROGEN AND METHANE MIXTURE, COMPRESSED",null,null,"F-D S-U"]
["IMDG_2035_10498/ /1,1,1-TRIFLUOROETHANE (REFRIGERANT GAS R 143a)",null,null,"F-D S-U"]
["IMDG_2036_10499/ /XENON",null,null,"F-C S-V"]
["IMDG_2037_12083/ /RECEPTACLES, SMALL, CONTAINING GAS (GAS CARTRIDGES) without a release device, non-refillable",null,null,"F-D S-U"]
["IMDG_2038_10501/II/DINITROTOLUENES, LIQUID","II","P","F-A S-A"]
["IMDG_2044_10502/ /2,2-DIMETHYLPROPANE",null,null,"F-D S-U"]
["IMDG_2045_10503/II/ISOBUTYL ALDEHYDE (ISOBUTYRALDEHYDE)","II",null,"F-E S-D"]
["IMDG_2046_10504/III/CYMENES","III","P","F-E S-D"]
["IMDG_2047_10505/II/DICHLOROPROPENES","II",null,"F-E S-D"]
["IMDG_2047_10506/III/DICHLOROPROPENES","III",null,"F-E S-D"]
["IMDG_2048_10507/III/DICYCLOPENTADIENE","III",null,"F-E S-D"]
["IMDG_2049_10508/III/DIETHYLBENZENE","III",null,"F-E S-D"]
["IMDG_2050_10509/II/DIISOBUTYLENES, ISOMERIC COMPOUNDS","II",null,"F-E S-D"]
["IMDG_2051_10510/II/2-DIMETHYLAMINOETHANOL","II",null,"F-E S-C"]
["IMDG_2052_10511/III/DIPENTENE","III","P","F-E S-E"]
["IMDG_2053_10512/III/METHYL ISOBUTYL CARBINOL","III",null,"F-E S-D"]
["IMDG_2054_10513/I/MORPHOLINE","I",null,"F-E S-C"]
["IMDG_2055_10514/III/STYRENE MONOMER, STABILIZED","III",null,"F-E S-D"]
["IMDG_2056_10515/II/TETRAHYDROFURAN","II",null,"F-E S-D"]
["IMDG_2057_10516/II/TRIPROPYLENE","II","P","F-E S-D"]
["IMDG_2057_10517/III/TRIPROPYLENE","III","P","F-E S-D"]
["IMDG_2058_10518/II/VALERALDEHYDE","II",null,"F-E S-D"]
["IMDG_2059_10519/I/NITROCELLULOSE SOLUTION, FLAMMABLE with not more than 12.6% nitrogen, by dry mass, and not more than 55% nitrocellulose","I",null,"F-E S-D"]
["IMDG_2059_10520/II/NITROCELLULOSE SOLUTION, FLAMMABLE with not more than 12.6% nitrogen, by dry mass, and not more than 55% nitrocellulose","II",null,"F-E S-D"]
["IMDG_2059_10521/III/NITROCELLULOSE SOLUTION, FLAMMABLE with not more than 12.6% nitrogen, by dry mass, and not more than 55% nitrocellulose","III",null,"F-E S-D"]
["IMDG_2067_10522/III/AMMONIUM NITRATE BASED FERTILIZER","III",null,"F-H S-Q"]
["IMDG_2071_10523/III/AMMONIUM NITRATE BASED FERTILIZER","III",null,"F-H S-Q"]
["IMDG_2073_10524/ /AMMONIA SOLUTION relative density less than 0.880 at 15°C in water, with more than 35% but not more than 50% ammonia",null,"P","F-C S-U"]
["IMDG_2074_10525/III/ACRYLAMIDE, SOLID","III",null,"F-A S-A"]
["IMDG_2075_10526/II/CHLORAL, ANHYDROUS, STABILIZED","II",null,"F-A S-A"]
["IMDG_2076_10527/II/CRESOLS, LIQUID","II",null,"F-A S-B"]
["IMDG_2077_10528/III/alpha-NAPHTHYLAMINE","III",null,"F-A S-A"]
["IMDG_2078_10529/II/TOLUENE DIISOCYANATE","II",null,"F-A S-A"]
["IMDG_2079_10530/II/DIETHYLENETRIAMINE","II",null,"F-A S-B"]
["IMDG_2186_10531/ /HYDROGEN CHLORIDE, REFRIGERATED LIQUID"]
["IMDG_2187_10532/ /CARBON DIOXIDE, REFRIGERATED LIQUID",null,null,"F-C S-V"]
["IMDG_2188_10533/ /ARSINE",null,null,"F-D S-U"]
["IMDG_2189_10534/ /DICHLOROSILANE",null,null,"F-D S-U"]
["IMDG_2190_10535/ /OXYGEN DIFLUORIDE, COMPRESSED",null,null,"F-C S-W"]
["IMDG_2191_10536/ /SULPHURYL FLUORIDE",null,null,"F-C S-U"]
["IMDG_2192_10537/ /GERMANE",null,null,"F-D S-U"]
["IMDG_2193_10538/ /HEXAFLUOROETHANE (REFRIGERANT GAS R 116)",null,null,"F-C S-V"]
["IMDG_2194_10539/ /SELENIUM HEXAFLUORIDE",null,null,"F-C S-U"]
["IMDG_2195_10540/ /TELLURIUM HEXAFLUORIDE",null,null,"F-C S-U"]
["IMDG_2196_10541/ /TUNGSTEN HEXAFLUORIDE",null,null,"F-C S-U"]
["IMDG_2197_10542/ /HYDROGEN IODIDE, ANHYDROUS",null,null,"F-C S-U"]
["IMDG_2198_10543/ /PHOSPHORUS PENTAFLUORIDE",null,null,"F-C S-U"]
["IMDG_2199_10544/ /PHOSPHINE",null,null,"F-D S-U"]
["IMDG_2200_10545/ /PROPADIENE, STABILIZED",null,null,"F-D S-U"]
["IMDG_2201_10546/ /NITROUS OXIDE, REFRIGERATED LIQUID",null,null,"F-C S-W"]
["IMDG_2202_10547/ /HYDROGEN SELENIDE, ANHYDROUS",null,null,"F-D S-U"]
["IMDG_2203_10548/ /SILANE",null,null,"F-D S-U"]
["IMDG_2204_10549/ /CARBONYL SULPHIDE",null,null,"F-D S-U"]
["IMDG_2205_10550/III/ADIPONITRILE","III",null,"F-A S-A"]
["IMDG_2206_10551/II/ISOCYANATES, TOXIC, N.O.S. or ISOCYANATE SOLUTION, TOXIC, N.O.S.","II",null,"F-A S-A"]
["IMDG_2206_10552/III/ISOCYANATES, TOXIC, N.O.S. or ISOCYANATE SOLUTION, TOXIC, N.O.S.","III",null,"F-A S-A"]
["IMDG_2208_10553/III/CALCIUM HYPOCHLORITE MIXTURE, DRY with more than 10% but not more than 39% available chlorine","III","P","F-H S-Q"]
["IMDG_2209_10554/III/FORMALDEHYDE SOLUTION with not less than 25% formaldehyde","III",null,"F-A S-B"]
["IMDG_2210_10555/III/MANEB or MANEB PREPARATION with not less than 60% maneb","III","P","F-G S-L"]
["IMDG_2211_10556/III/POLYMERIC BEADS, EXPANDABLE evolving flammable vapour","III",null,"F-A S-I"]
["IMDG_2212_10557/II/ASBESTOS, AMPHIBOLE (amosite, tremolite, actinolite, anthophyllite, crocidolite)","II",null,"F-A S-A"]
["IMDG_2213_10558/III/PARAFORMALDEHYDE","III",null,"F-A S-G"]
["IMDG_2214_10559/III/PHTHALIC ANHYDRIDE with more than 0.05% of maleic anhydride","III",null,"F-A S-B"]
["IMDG_2215_10560/III/MALEIC ANHYDRIDE","III",null,"F-A S-B"]
["IMDG_2215_10561/III/MALEIC ANHYDRIDE, MOLTEN","III",null,"F-A S-B"]
["IMDG_2216_12445/III/FISHMEAL (FISHSCRAP), STABILIZED Anti-oxidant treated. Moisture content greater than 5% but not exceeding 12%, by mass. Fat content not more than 15%","III",null,"F-A S-J"]
["IMDG_2217_10563/III/SEED CAKE with not more than 1.5% oil and not more than 11% moisture","III",null,"F-A S-J"]
["IMDG_2218_10564/II/ACRYLIC ACID, STABILIZED","II","P","F-E S-C"]
["IMDG_2219_10565/III/ALLYL GLYCIDYL ETHER","III",null,"F-E S-D"]
["IMDG_2222_10566/III/ANISOLE","III",null,"F-E S-D"]
["IMDG_2224_10567/II/BENZONITRILE","II",null,"F-A S-A"]
["IMDG_2225_10568/III/BENZENESULPHONYL CHLORIDE","III",null,"F-A S-B"]
["IMDG_2226_10569/II/BENZOTRICHLORIDE","II",null,"F-A S-B"]
["IMDG_2227_10570/III/n-BUTYL METHACRYLATE, STABILIZED","III",null,"F-E S-D"]
["IMDG_2232_10571/I/2-CHLOROETHANAL","I",null,"F-A S-A"]
["IMDG_2233_10572/III/CHLOROANISIDINES","III",null,"F-A S-A"]
["IMDG_2234_10573/III/CHLOROBENZOTRIFLUORIDES","III",null,"F-E S-D"]
["IMDG_2235_10574/III/CHLOROBENZYL CHLORIDES, LIQUID","III","P","F-A S-A"]
["IMDG_2236_12085/II/3-CHLORO-4-METHYLPHENYL ISOCYANATE, LIQUID","II",null,"F-A S-A"]
["IMDG_2237_10576/III/CHLORONITROANILINES","III","P","F-A S-A"]
["IMDG_2238_10577/III/CHLOROTOLUENES","III",null,"F-E S-D"]
["IMDG_2239_10578/III/CHLOROTOLUIDINES, SOLID","III",null,"F-A S-A"]
["IMDG_2240_10579/I/CHROMOSULPHURIC ACID","I",null,"F-A S-B"]
["IMDG_2241_10580/II/CYCLOHEPTANE","II","P","F-E S-D"]
["IMDG_2242_10581/II/CYCLOHEPTENE","II",null,"F-E S-D"]
["IMDG_2243_10582/III/CYCLOHEXYL ACETATE","III",null,"F-E S-D"]
["IMDG_2244_10583/III/CYCLOPENTANOL","III",null,"F-E S-D"]
["IMDG_2245_10584/III/CYCLOPENTANONE","III",null,"F-E S-D"]
["IMDG_2246_10585/II/CYCLOPENTENE","II",null,"F-E S-D"]
["IMDG_2247_10586/III/n-DECANE","III",null,"F-E S-E"]
["IMDG_2248_10587/II/DI-n-BUTYLAMINE","II",null,"F-E S-C"]
["IMDG_2249_10588/I/DICHLORODIMETHYL ETHER, SYMMETRICAL","I",null,"F-E S-D"]
["IMDG_2250_10589/II/DICHLOROPHENYL ISOCYANATES","II",null,"F-A S-A"]
["IMDG_2251_12086/II/BICYCLO[2.2.1]HEPTA-2,5- DIENE, STABILIZED (2,5-NORBORNADIENE, STABILIZED)","II",null,"F-E S-D"]
["IMDG_2252_10591/II/1,2-DIMETHOXYETHANE","II",null,"F-E S-D"]
["IMDG_2253_10592/II/N,N-DIMETHYLANILINE","II",null,"F-A S-A"]
["IMDG_2254_10593/III/MATCHES, FUSEE","III",null,"F-A S-I"]
["IMDG_2256_10594/II/CYCLOHEXENE","II",null,"F-E S-D"]
["IMDG_2257_10595/I/POTASSIUM","I",null,"F-G S-N"]
["IMDG_2258_10596/II/1,2-PROPYLENEDIAMINE","II",null,"F-E S-C"]
["IMDG_2259_10597/II/TRIETHYLENETETRAMINE","II",null,"F-A S-B"]
["IMDG_2260_10598/III/TRIPROPYLAMINE","III",null,"F-E S-C"]
["IMDG_2261_10599/II/XYLENOLS, SOLID","II",null,"F-A S-A"]
["IMDG_2262_10600/II/DIMETHYLCARBAMOYL CHLORIDE","II",null,"F-A S-B"]
["IMDG_2263_10601/II/DIMETHYLCYCLOHEXANES","II",null,"F-E S-D"]
["IMDG_2264_12087/II/N,N-DIMETHYL- CYCLOHEXYLAMINE","II",null,"F-E S-C"]
["IMDG_2265_10603/III/N,N-DIMETHYLFORMAMIDE","III",null,"F-E S-D"]
["IMDG_2266_12088/II/DIMETHYL-N-PROPYLAMINE","II",null,"F-E S-C"]
["IMDG_2267_10605/II/DIMETHYL THIOPHOSPHORYL CHLORIDE","II",null,"F-A S-B"]
["IMDG_2269_12089/III/3,3’-IMINODIPROPYLAMINE","III",null,"F-A S-B"]
["IMDG_2270_10607/II/ETHYLAMINE, AQUEOUS SOLUTION with not less than 50% but not more than 70% ethylamine","II",null,"F-E S-C"]
["IMDG_2271_10608/III/ETHYL AMYL KETONES","III",null,"F-E S-D"]
["IMDG_2272_10609/III/N-ETHYLANILINE","III",null,"F-A S-A"]
["IMDG_2273_10610/III/2-ETHYLANILINE","III",null,"F-A S-A"]
["IMDG_2274_10611/III/N-ETHYL-N-BENZYLANILINE","III",null,"F-A S-A"]
["IMDG_2275_10612/III/2-ETHYLBUTANOL","III",null,"F-E S-D"]
["IMDG_2276_10613/III/2-ETHYLHEXYLAMINE","III",null,"F-E S-C"]
["IMDG_2277_10614/II/ETHYL METHACRYLATE, STABILIZED","II",null,"F-E S-D"]
["IMDG_2278_10615/II/n-HEPTENE","II",null,"F-E S-D"]
["IMDG_2279_10616/III/HEXACHLOROBUTADIENE","III","P","F-A S-A"]
["IMDG_2280_10617/III/HEXAMETHYLENEDIAMINE, MOLTEN","III",null,"F-A S-B"]
["IMDG_2280_10618/III/HEXAMETHYLENEDIAMINE, SOLID","III",null,"F-A S-B"]
["IMDG_2281_10619/II/HEXAMETHYLENE DIISOCYANATE","II",null,"F-A S-A"]
["IMDG_2282_10620/III/HEXANOLS","III",null,"F-E S-D"]
["IMDG_2283_10621/III/ISOBUTYL METHACRYLATE, STABILIZED","III",null,"F-E S-D"]
["IMDG_2284_10622/II/ISOBUTYRONITRILE","II",null,"F-E S-D"]
["IMDG_2285_12090/II/ISOCYANATOBENZO- TRIFLUORIDES","II",null,"F-E S-D"]
["IMDG_2286_10624/III/PENTAMETHYLHEPTANE","III",null,"F-E S-D"]
["IMDG_2287_10625/II/ISOHEPTENES","II",null,"F-E S-D"]
["IMDG_2288_10626/II/ISOHEXENES","II",null,"F-E S-D"]
["IMDG_2289_10627/III/ISOPHORONEDIAMINE","III",null,"F-A S-B"]
["IMDG_2290_10628/III/ISOPHORONE DIISOCYANATE","III",null,"F-A S-A"]
["IMDG_2291_10629/III/LEAD COMPOUND, SOLUBLE, N.O.S.","III","P","F-A S-A"]
["IMDG_2293_12091/III/4-METHOXY-4-METHYL- PENTAN-2-ONE","III",null,"F-E S-D"]
["IMDG_2294_10631/III/N-METHYLANILINE","III","P","F-A S-A"]
["IMDG_2295_10632/I/METHYL CHLOROACETATE","I",null,"F-E S-D"]
["IMDG_2296_10633/II/METHYLCYCLOHEXANE","II","P","F-E S-D"]
["IMDG_2297_10634/III/METHYLCYCLOHEXANONE","III",null,"F-E S-D"]
["IMDG_2298_10635/II/METHYLCYCLOPENTANE","II",null,"F-E S-D"]
["IMDG_2299_10636/III/METHYL DICHLOROACETATE","III",null,"F-A S-A"]
["IMDG_2300_10637/III/2-METHYL-5-ETHYLPYRIDINE","III",null,"F-A S-A"]
["IMDG_2301_10638/II/2-METHYLFURAN","II",null,"F-E S-D"]
["IMDG_2302_10639/III/5-METHYLHEXAN-2-ONE","III",null,"F-E S-D"]
["IMDG_2303_10640/III/ISOPROPENYLBENZENE","III",null,"F-E S-D"]
["IMDG_2304_10641/III/NAPHTHALENE, MOLTEN","III","P","F-A S-H"]
["IMDG_2305_10642/II/NITROBENZENESULPHONIC ACID","II",null,"F-A S-B"]
["IMDG_2306_10643/II/NITROBENZOTRIFLUORIDES, LIQUID","II","P","F-A S-A"]
["IMDG_2307_12092/II/3-NITRO-4-CHLORO- BENZOTRIFLUORIDE","II","P","F-A S-A"]
["IMDG_2308_10645/II/NITROSYLSULPHURIC ACID, LIQUID","II",null,"F-A S-B"]
["IMDG_2309_10646/II/OCTADIENE","II",null,"F-E S-D"]
["IMDG_2310_10647/III/PENTANE-2,4-DIONE","III",null,"F-E S-D"]
["IMDG_2311_10648/III/PHENETIDINES","III",null,"F-A S-A"]
["IMDG_2312_10649/II/PHENOL, MOLTEN","II",null,"F-A S-A"]
["IMDG_2313_10650/III/PICOLINES","III",null,"F-E S-D"]
["IMDG_2315_10651/II/POLYCHLORINATED BIPHENYLS, LIQUID","II","P","F-A S-A"]
["IMDG_2316_10652/I/SODIUM CUPROCYANIDE, SOLID","I","P","F-A S-A"]
["IMDG_2317_10653/I/SODIUM CUPROCYANIDE SOLUTION","I","P","F-A S-A"]
["IMDG_2318_10654/II/SODIUM HYDROSULPHIDE with less than 25% water of crystallization","II",null,"F-A S-J"]
["IMDG_2319_10655/III/TERPENE HYDROCARBONS, N.O.S.","III",null,"F-E S-D"]
["IMDG_2320_10656/III/TETRAETHYLENEPENTAMINE","III",null,"F-A S-B"]
["IMDG_2321_10657/III/TRICHLOROBENZENES, LIQUID","III","P","F-A S-A"]
["IMDG_2322_10658/II/TRICHLOROBUTENE","II","P","F-A S-A"]
["IMDG_2323_10659/III/TRIETHYL PHOSPHITE","III",null,"F-E S-D"]
["IMDG_2324_10660/III/TRIISOBUTYLENE","III",null,"F-E S-D"]
["IMDG_2325_10661/III/1,3,5-TRIMETHYLBENZENE","III","P","F-E S-D"]
["IMDG_2326_12093/III/TRIMETHYLCYCLOHEXYL- AMINE","III",null,"F-A S-B"]
["IMDG_2327_12094/III/TRIMETHYLHEXAMETHYLENE- DIAMINES","III",null,"F-A S-B"]
["IMDG_2328_10664/III/TRIMETHYLHEXAMETHYLENE DIISOCYANATE","III",null,"F-A S-A"]
["IMDG_2329_10665/III/TRIMETHYL PHOSPHITE","III",null,"F-E S-D"]
["IMDG_2330_10666/III/UNDECANE","III",null,"F-E S-E"]
["IMDG_2331_10667/III/ZINC CHLORIDE, ANHYDROUS","III","P","F-A S-B"]
["IMDG_2332_10668/III/ACETALDEHYDE OXIME","III",null,"F-E S-D"]
["IMDG_2333_10669/II/ALLYL ACETATE","II",null,"F-E S-D"]
["IMDG_2334_10670/I/ALLYLAMINE","I",null,"F-E S-D"]
["IMDG_2335_10671/II/ALLYL ETHYL ETHER","II",null,"F-E S-D"]
["IMDG_2336_10672/I/ALLYL FORMATE","I",null,"F-E S-D"]
["IMDG_2337_10673/I/PHENYL MERCAPTAN","I",null,"F-E S-D"]
["IMDG_2338_10674/II/BENZOTRIFLUORIDE","II",null,"F-E S-D"]
["IMDG_2339_10675/II/2-BROMOBUTANE","II",null,"F-E S-D"]
["IMDG_2340_10676/II/2-BROMOETHYL ETHYL ETHER","II",null,"F-E S-D"]
["IMDG_2341_10677/III/1-BROMO-3-METHYLBUTANE","III",null,"F-E S-D"]
["IMDG_2342_10678/II/BROMOMETHYLPROPANES","II",null,"F-E S-D"]
["IMDG_2343_10679/II/2-BROMOPENTANE","II",null,"F-E S-D"]
["IMDG_2344_10680/II/BROMOPROPANES","II",null,"F-E S-D"]
["IMDG_2344_10681/III/BROMOPROPANES","III",null,"F-E S-D"]
["IMDG_2345_10682/II/3-BROMOPROPYNE","II",null,"F-E S-D"]
["IMDG_2346_10683/II/BUTANEDIONE","II",null,"F-E S-D"]
["IMDG_2347_10684/II/BUTYL MERCAPTAN","II",null,"F-E S-D"]
["IMDG_2348_10685/III/BUTYL ACRYLATES, STABILIZED","III",null,"F-E S-D"]
["IMDG_2350_10686/II/BUTYL METHYL ETHER","II",null,"F-E S-D"]
["IMDG_2351_10687/II/BUTYL NITRITES","II",null,"F-E S-D"]
["IMDG_2351_10688/III/BUTYL NITRITES","III",null,"F-E S-D"]
["IMDG_2352_10689/II/BUTYL VINYL ETHER, STABILIZED","II",null,"F-E S-D"]
["IMDG_2353_10690/II/BUTYRYL CHLORIDE","II",null,"F-E S-C"]
["IMDG_2354_10691/II/CHLOROMETHYL ETHYL ETHER","II",null,"F-E S-D"]
["IMDG_2356_10692/I/2-CHLOROPROPANE","I",null,"F-E S-D"]
["IMDG_2357_10693/II/CYCLOHEXYLAMINE","II",null,"F-E S-C"]
["IMDG_2358_10694/II/CYCLOOCTATETRAENE","II",null,"F-E S-D"]
["IMDG_2359_10695/II/DIALLYLAMINE","II",null,"F-E S-C"]
["IMDG_2360_10696/II/DIALLYL ETHER","II",null,"F-E S-D"]
["IMDG_2361_10697/III/DIISOBUTYLAMINE","III",null,"F-E S-C"]
["IMDG_2362_10698/II/1,1-DICHLOROETHANE","II",null,"F-E S-D"]
["IMDG_2363_10699/I/ETHYL MERCAPTAN","I","P","F-E S-D"]
["IMDG_2364_10700/III/n-PROPYLBENZENE","III",null,"F-E S-D"]
["IMDG_2366_10701/III/DIETHYL CARBONATE","III",null,"F-E S-D"]
["IMDG_2367_12095/II/alpha-METHYL-VALERALDEHYDE","II",null,"F-E S-D"]
["IMDG_2368_10703/III/alpha-PINENE","III","P","F-E S-E"]
["IMDG_2370_10704/II/1-HEXENE","II",null,"F-E S-D"]
["IMDG_2371_10705/I/ISOPENTENES","I",null,"F-E S-D"]
["IMDG_2372_12096/II/1,2-DI(DIMETHYLAMINO) ETHANE","II",null,"F-E S-D"]
["IMDG_2373_10707/II/DIETHOXYMETHANE","II",null,"F-E S-D"]
["IMDG_2374_10708/II/3,3-DIETHOXYPROPENE","II",null,"F-E S-D"]
["IMDG_2375_10709/II/DIETHYL SULPHIDE","II",null,"F-E S-D"]
["IMDG_2376_10710/II/2,3-DIHYDROPYRAN","II",null,"F-E S-D"]
["IMDG_2377_10711/II/1,1-DIMETHOXYETHANE","II",null,"F-E S-D"]
["IMDG_2378_12097/II/2-DIMETHYLAMINO- ACETONITRILE","II",null,"F-E S-D"]
["IMDG_2379_10713/II/1,3-DIMETHYLBUTYLAMINE","II",null,"F-E S-C"]
["IMDG_2380_10714/II/DIMETHYLDIETHOXYSILANE","II",null,"F-E S-D"]
["IMDG_2381_10715/II/DIMETHYL DISULPHIDE","II","P","F-E S-D"]
["IMDG_2382_10716/I/DIMETHYLHYDRAZINE, SYMMETRICAL","I","P","F-E S-D"]
["IMDG_2383_10717/II/DIPROPYLAMINE","II",null,"F-E S-C"]
["IMDG_2384_10718/II/DI-n-PROPYL ETHER","II",null,"F-E S-D"]
["IMDG_2385_10719/II/ETHYL ISOBUTYRATE","II",null,"F-E S-D"]
["IMDG_2386_10720/II/1-ETHYLPIPERIDINE","II",null,"F-E S-C"]
["IMDG_2387_10721/II/FLUOROBENZENE","II",null,"F-E S-D"]
["IMDG_2388_10722/II/FLUOROTOLUENES","II",null,"F-E S-D"]
["IMDG_2389_10723/I/FURAN","I",null,"F-E S-D"]
["IMDG_2390_10724/II/2-IODOBUTANE","II",null,"F-E S-D"]
["IMDG_2391_10725/II/IODOMETHYLPROPANES","II",null,"F-E S-D"]
["IMDG_2392_10726/III/IODOPROPANES","III",null,"F-E S-D"]
["IMDG_2393_10727/II/ISOBUTYL FORMATE","II",null,"F-E S-D"]
["IMDG_2394_10728/III/ISOBUTYL PROPIONATE","III",null,"F-E S-D"]
["IMDG_2395_10729/II/ISOBUTYRYL CHLORIDE","II",null,"F-E S-C"]
["IMDG_2396_10730/II/METHACRYLALDEHYDE, STABILIZED","II",null,"F-E S-D"]
["IMDG_2397_10731/II/3-METHYLBUTAN-2-ONE","II",null,"F-E S-D"]
["IMDG_2398_10732/II/METHYL tert-BUTYL ETHER","II",null,"F-E S-D"]
["IMDG_2399_10733/II/1-METHYLPIPERIDINE","II",null,"F-E S-C"]
["IMDG_2400_10734/II/METHYL ISOVALERATE","II",null,"F-E S-D"]
["IMDG_2401_10735/I/PIPERIDINE","I",null,"F-E S-C"]
["IMDG_2402_10736/II/PROPANETHIOLS","II",null,"F-E S-D"]
["IMDG_2403_10737/II/ISOPROPENYL ACETATE","II",null,"F-E S-D"]
["IMDG_2404_10738/II/PROPIONITRILE","II",null,"F-E S-D"]
["IMDG_2405_10739/III/ISOPROPYL BUTYRATE","III",null,"F-E S-D"]
["IMDG_2406_10740/II/ISOPROPYL ISOBUTYRATE","II",null,"F-E S-D"]
["IMDG_2407_10741/I/ISOPROPYL CHLOROFORMATE","I",null,"F-E S-C"]
["IMDG_2409_10742/II/ISOPROPYL PROPIONATE","II",null,"F-E S-D"]
["IMDG_2410_10743/II/1,2,3,6-TETRAHYDROPYRIDINE","II",null,"F-E S-D"]
["IMDG_2411_10744/II/BUTYRONITRILE","II",null,"F-E S-D"]
["IMDG_2412_10745/II/TETRAHYDROTHIOPHENE","II",null,"F-E S-D"]
["IMDG_2413_10746/III/TETRAPROPYL ORTHOTITANATE","III",null,"F-E S-D"]
["IMDG_2414_10747/II/THIOPHENE","II",null,"F-E S-D"]
["IMDG_2416_10748/II/TRIMETHYL BORATE","II",null,"F-E S-D"]
["IMDG_2417_10749/ /CARBONYL FLUORIDE",null,null,"F-C S-U"]
["IMDG_2418_10750/ /SULPHUR TETRAFLUORIDE",null,null,"F-C S-U"]
["IMDG_2419_10751/ /BROMOTRIFLUOROETHYLENE",null,null,"F-D S-U"]
["IMDG_2420_10752/ /HEXAFLUOROACETONE",null,null,"F-C S-U"]
["IMDG_2421_10753/ /NITROGEN TRIOXIDE",null,null,"F-C S-W"]
["IMDG_2422_10754/ /OCTAFLUOROBUT-2-ENE (REFRIGERANT GAS R 1318)",null,null,"F-C S-V"]
["IMDG_2424_10755/ /OCTAFLUOROPROPANE (REFRIGERANT GAS R 218)",null,null,"F-C S-V"]
["IMDG_2426_10756/ /AMMONIUM NITRATE, LIQUID (hot concentrated solution)",null,null,"F-H S-Q"]
["IMDG_2427_10757/II/POTASSIUM CHLORATE, AQUEOUS SOLUTION","II",null,"F-H S-Q"]
["IMDG_2427_10758/III/POTASSIUM CHLORATE, AQUEOUS SOLUTION","III",null,"F-H S-Q"]
["IMDG_2428_10759/II/SODIUM CHLORATE, AQUEOUS SOLUTION","II",null,"F-H S-Q"]
["IMDG_2428_10760/III/SODIUM CHLORATE, AQUEOUS SOLUTION","III",null,"F-H S-Q"]
["IMDG_2429_10761/II/CALCIUM CHLORATE, AQUEOUS SOLUTION","II",null,"F-H S-Q"]
["IMDG_2429_10762/III/CALCIUM CHLORATE, AQUEOUS SOLUTION","III",null,"F-H S-Q"]
["IMDG_2430_12098/I/ALKYLPHENOLS, SOLID, N.O.S. (including C2-C12 homologues)","I",null,"F-A S-B"]
["IMDG_2430_12099/II/ALKYLPHENOLS, SOLID, N.O.S. (including C2-C12 homologues)","II",null,"F-A S-B"]
["IMDG_2430_12100/III/ALKYLPHENOLS, SOLID, N.O.S. (including C2-C12 homologues)","III",null,"F-A S-B"]
["IMDG_2431_12101/III/ANISIDINES","III",null,"F-A S-A"]
["IMDG_2432_10767/III/N,N-DIETHYLANILINE","III",null,"F-A S-A"]
["IMDG_2433_10768/III/CHLORONITROTOLUENES, LIQUID","III","P","F-A S-A"]
["IMDG_2434_10769/II/DIBENZYLDICHLOROSILANE","II",null,"F-A S-B"]
["IMDG_2435_12102/II/ETHYLPHENYL- DICHLOROSILANE","II",null,"F-A S-B"]
["IMDG_2436_10771/II/THIOACETIC ACID","II",null,"F-E S-D"]
["IMDG_2437_12103/II/METHYLPHENYL- DICHLOROSILANE","II",null,"F-A S-B"]
["IMDG_2438_10773/I/TRIMETHYLACETYL CHLORIDE","I",null,"F-E S-C"]
["IMDG_2439_12446/II/SODIUM HYDROGENDIFLUORIDE","II",null,"F-A S-B"]
["IMDG_2440_10775/III/STANNIC CHLORIDE PENTAHYDRATE","III",null,"F-A S-B"]
["IMDG_2441_10776/I/TITANIUM TRICHLORIDE, PYROPHORIC or TITANIUM TRICHLORIDE MIXTURE, PYROPHORIC","I",null,"F-G S-M"]
["IMDG_2442_10777/II/TRICHLOROACETYL CHLORIDE","II",null,"F-A S-B"]
["IMDG_2443_10778/II/VANADIUM OXYTRICHLORIDE","II",null,"F-A S-B"]
["IMDG_2444_10779/I/VANADIUM TETRACHLORIDE","I",null,"F-A S-B"]
["IMDG_2446_10780/III/NITROCRESOLS, SOLID","III",null,"F-A S-A"]
["IMDG_2447_10781/I/PHOSPHORUS, WHITE, MOLTEN","I","P","F-A S-M"]
["IMDG_2448_10782/III/SULPHUR, MOLTEN","III",null,"F-A S-H"]
["IMDG_2451_10783/ /NITROGEN TRIFLUORIDE",null,null,"F-C S-W"]
["IMDG_2452_10784/ /ETHYLACETYLENE, STABILIZED",null,null,"F-D S-U"]
["IMDG_2453_10785/ /ETHYL FLUORIDE (REFRIGERANT GAS R 161)",null,null,"F-D S-U"]
["IMDG_2454_10786/ /METHYL FLUORIDE (REFRIGERANT GAS R 41)",null,null,"F-D S-U"]
["IMDG_2455_10787/ /METHYL NITRITE"]
["IMDG_2456_10788/I/2-CHLOROPROPENE","I",null,"F-E S-D"]
["IMDG_2457_10789/II/2,3-DIMETHYLBUTANE","II",null,"F-E S-D"]
["IMDG_2458_10790/II/HEXADIENES","II",null,"F-E S-D"]
["IMDG_2459_10791/I/2-METHYL-1-BUTENE","I",null,"F-E S-D"]
["IMDG_2460_10792/II/2-METHYL-2-BUTENE","II",null,"F-E S-D"]
["IMDG_2461_10793/II/METHYLPENTADIENES","II",null,"F-E S-D"]
["IMDG_2463_10794/I/ALUMINIUM HYDRIDE","I",null,"F-G S-O"]
["IMDG_2464_10795/II/BERYLLIUM NITRATE","II",null,"F-A S-Q"]
["IMDG_2465_12447/II/DICHLOROISOCYANURIC ACID, DRY or DICHLOROISOCYANURIC ACID, SALTS","II",null,"F-A S-Q"]
["IMDG_2466_10797/I/POTASSIUM SUPEROXIDE","I",null,"F-G S-Q"]
["IMDG_2468_10798/II/TRICHLOROISOCYANURIC ACID, DRY","II",null,"F-A S-Q"]
["IMDG_2469_10799/III/ZINC BROMATE","III",null,"F-H S-Q"]
["IMDG_2470_10800/III/PHENYLACETONITRILE, LIQUID","III",null,"F-A S-A"]
["IMDG_2471_10801/I/OSMIUM TETROXIDE","I","P","F-A S-A"]
["IMDG_2473_10802/III/SODIUM ARSANILATE","III",null,"F-A S-A"]
["IMDG_2474_10803/I/THIOPHOSGENE","I",null,"F-A S-A"]
["IMDG_2475_10804/III/VANADIUM TRICHLORIDE","III",null,"F-A S-B"]
["IMDG_2477_10805/I/METHYL ISOTHIOCYANATE","I",null,"F-E S-D"]
["IMDG_2478_10806/II/ISOCYANATES, FLAMMABLE, TOXIC, N.O.S. or ISOCYANATE SOLUTION, FLAMMABLE, TOXIC, N.O.S.","II",null,"F-E S-D"]
["IMDG_2478_10807/III/ISOCYANATES, FLAMMABLE, TOXIC, N.O.S. or ISOCYANATE SOLUTION, FLAMMABLE, TOXIC, N.O.S.","III",null,"F-E S-D"]
["IMDG_2480_10808/I/METHYL ISOCYANATE","I",null,"F-E S-D"]
["IMDG_2481_10809/I/ETHYL ISOCYANATE","I",null,"F-E S-D"]
["IMDG_2482_10810/I/n-PROPYL ISOCYANATE","I",null,"F-E S-D"]
["IMDG_2483_10811/I/ISOPROPYL ISOCYANATE","I",null,"F-E S-D"]
["IMDG_2484_10812/I/tert-BUTYL ISOCYANATE","I",null,"F-E S-D"]
["IMDG_2485_10813/I/n-BUTYL ISOCYANATE","I",null,"F-E S-D"]
["IMDG_2486_10814/I/ISOBUTYL ISOCYANATE","I",null,"F-E S-D"]
["IMDG_2487_10815/I/PHENYL ISOCYANATE","I",null,"F-E S-D"]
["IMDG_2488_10816/I/CYCLOHEXYL ISOCYANATE","I",null,"F-E S-D"]
["IMDG_2490_10817/II/DICHLOROISOPROPYL ETHER","II",null,"F-A S-A"]
["IMDG_2491_10818/III/ETHANOLAMINE or ETHANOLAMINE SOLUTION","III",null,"F-A S-B"]
["IMDG_2493_10819/II/HEXAMETHYLENEIMINE","II",null,"F-E S-C"]
["IMDG_2495_10820/I/IODINE PENTAFLUORIDE","I",null,"F-A S-Q"]
["IMDG_2496_10821/III/PROPIONIC ANHYDRIDE","III",null,"F-A S-B"]
["IMDG_2498_12106/III/1,2,3,6-TETRAHYDRO- BENZALDEHYDE","III",null,"F-E S-D"]
["IMDG_2501_12107/II/TRIS-(1-AZIRIDINYL)- PHOSPHINE OXIDE SOLUTION","II",null,"F-A S-A"]
["IMDG_2501_12108/III/TRIS-(1-AZIRIDINYL)- PHOSPHINE OXIDE SOLUTION","III",null,"F-A S-A"]
["IMDG_2502_10825/II/VALERYL CHLORIDE","II",null,"F-E S-C"]
["IMDG_2503_10826/III/ZIRCONIUM TETRACHLORIDE","III",null,"F-A S-B"]
["IMDG_2504_10827/III/TETRABROMOETHANE","III","P","F-A S-A"]
["IMDG_2505_10828/III/AMMONIUM FLUORIDE","III",null,"F-A S-A"]
["IMDG_2506_10829/II/AMMONIUM HYDROGEN SULPHATE","II",null,"F-A S-B"]
["IMDG_2507_10830/III/CHLOROPLATINIC ACID, SOLID","III",null,"F-A S-B"]
["IMDG_2508_10831/III/MOLYBDENUM PENTACHLORIDE","III",null,"F-A S-B"]
["IMDG_2509_10832/II/POTASSIUM HYDROGEN SULPHATE","II",null,"F-A S-B"]
["IMDG_2511_10833/III/2-CHLOROPROPIONIC ACID","III",null,"F-A S-B"]
["IMDG_2512_10834/III/AMINOPHENOLS (o-, m-, p-)","III",null,"F-A S-A"]
["IMDG_2513_10835/II/BROMOACETYL BROMIDE","II",null,"F-A S-B"]
["IMDG_2514_10836/III/BROMOBENZENE","III","P","F-E S-D"]
["IMDG_2515_10837/III/BROMOFORM","III","P","F-A S-A"]
["IMDG_2516_10838/III/CARBON TETRABROMIDE","III","P","F-A S-A"]
["IMDG_2517_12109/ /1-CHLORO-1,1-DIFLUORO- ETHANE (REFRIGERANT GAS R 142b)",null,null,"F-D S-U"]
["IMDG_2518_10840/III/1,5,9-CYCLODODECATRIENE","III","P","F-A S-A"]
["IMDG_2520_10841/III/CYCLOOCTADIENES","III",null,"F-E S-D"]
["IMDG_2521_10842/I/DIKETENE, STABILIZED","I",null,"F-E S-D"]
["IMDG_2522_10843/II/2-DIMETHYLAMINOETHYL METHACRYLATE","II",null,"F-A S-A"]
["IMDG_2524_10844/III/ETHYL ORTHOFORMATE","III",null,"F-E S-D"]
["IMDG_2525_10845/III/ETHYL OXALATE","III",null,"F-A S-A"]
["IMDG_2526_10846/III/FURFURYLAMINE","III",null,"F-E S-C"]
["IMDG_2527_10847/III/ISOBUTYL ACRYLATE, STABILIZED","III",null,"F-E S-D"]
["IMDG_2528_10848/III/ISOBUTYL ISOBUTYRATE","III",null,"F-E S-D"]
["IMDG_2529_10849/III/ISOBUTYRIC ACID","III",null,"F-E S-C"]
["IMDG_2531_10850/II/METHACRYLIC ACID, STABILIZED","II",null,"F-A S-B"]
["IMDG_2533_10851/III/METHYL TRICHLOROACETATE","III",null,"F-A S-A"]
["IMDG_2534_10852/ /METHYLCHLOROSILANE",null,null,"F-D S-U"]
["IMDG_2535_10853/II/4-METHYLMORPHOLINE (N-METHYLMORPHOLINE)","II",null,"F-E S-C"]
["IMDG_2536_10854/II/METHYLTETRAHYDROFURAN","II",null,"F-E S-D"]
["IMDG_2538_10855/III/NITRONAPHTHALENE","III",null,"F-A S-G"]
["IMDG_2541_10856/III/TERPINOLENE","III",null,"F-E S-E"]
["IMDG_2542_10857/II/TRIBUTYLAMINE","II",null,"F-A S-A"]
["IMDG_2545_10858/I/HAFNIUM POWDER, DRY","I",null,"F-G S-M"]
["IMDG_2545_10859/II/HAFNIUM POWDER, DRY","II",null,"F-G S-M"]
["IMDG_2545_10860/III/HAFNIUM POWDER, DRY","III",null,"F-G S-M"]
["IMDG_2546_10861/I/TITANIUM POWDER, DRY","I",null,"F-G S-M"]
["IMDG_2546_10862/II/TITANIUM POWDER, DRY","II",null,"F-G S-M"]
["IMDG_2546_10863/III/TITANIUM POWDER, DRY","III",null,"F-G S-M"]
["IMDG_2547_10864/I/SODIUM SUPEROXIDE","I",null,"F-G S-Q"]
["IMDG_2548_10865/ /CHLORINE PENTAFLUORIDE",null,null,"F-C S-W"]
["IMDG_2552_10866/II/HEXAFLUOROACETONE HYDRATE, LIQUID","II",null,"F-A S-A"]
["IMDG_2554_10867/II/METHYLALLYL CHLORIDE","II",null,"F-E S-D"]
["IMDG_2555_10868/II/NITROCELLULOSE WITH WATER (not less than 25% water, by mass)","II",null,"F-B S-J"]
["IMDG_2556_10869/II/NITROCELLULOSE WITH ALCOHOL (not less than 25% alcohol, by mass, and not more than 12.6% nitrogen, by dry mass)","II",null,"F-B S-J"]
["IMDG_2557_10870/II/NITROCELLULOSE with not more than 12.6% nitrogen, by dry mass, MIXTURE WITH or WITHOUT PLASTICIZER, WITH or WITHOUT PIGMENT","II",null,"F-B S-J"]
["IMDG_2558_10871/I/EPIBROMOHYDRIN","I","P","F-E S-D"]
["IMDG_2560_10872/III/2-METHYLPENTAN-2-OL","III",null,"F-E S-D"]
["IMDG_2561_10873/I/3-METHYL-1-BUTENE","I",null,"F-E S-D"]
["IMDG_2564_10874/II/TRICHLOROACETIC ACID SOLUTION","II",null,"F-A S-B"]
["IMDG_2564_10875/III/TRICHLOROACETIC ACID SOLUTION","III",null,"F-A S-B"]
["IMDG_2565_10876/III/DICYCLOHEXYLAMINE","III",null,"F-A S-B"]
["IMDG_2567_10877/II/SODIUM PENTACHLOROPHENATE","II","P","F-A S-A"]
["IMDG_2570_10878/I/CADMIUM COMPOUND","I",null,"F-A S-A"]
["IMDG_2570_10879/II/CADMIUM COMPOUND","II",null,"F-A S-A"]
["IMDG_2570_10880/III/CADMIUM COMPOUND","III",null,"F-A S-A"]
["IMDG_2571_10881/II/ALKYLSULPHURIC ACIDS","II",null,"F-A S-B"]
["IMDG_2572_10882/II/PHENYLHYDRAZINE","II",null,"F-A S-A"]
["IMDG_2573_10883/II/THALLIUM CHLORATE","II","P","F-H S-Q"]
["IMDG_2574_10884/II/TRICRESYL PHOSPHATE with more than 3% ortho-isomer","II","P","F-A S-A"]
["IMDG_2576_10885/II/PHOSPHORUS OXYBROMIDE, MOLTEN","II",null,"F-A S-B"]
["IMDG_2577_10886/II/PHENYLACETYL CHLORIDE","II",null,"F-A S-B"]
["IMDG_2578_10887/III/PHOSPHORUS TRIOXIDE","III",null,"F-A S-B"]
["IMDG_2579_10888/III/PIPERAZINE","III",null,"F-A S-B"]
["IMDG_2580_10889/III/ALUMINIUM BROMIDE SOLUTION","III",null,"F-A S-B"]
["IMDG_2581_10890/III/ALUMINIUM CHLORIDE SOLUTION","III",null,"F-A S-B"]
["IMDG_2582_10891/III/FERRIC CHLORIDE SOLUTION","III",null,"F-A S-B"]
["IMDG_2583_10892/II/ALKYLSULPHONIC ACIDS, SOLID or ARYLSULPHONIC ACIDS, SOLID with more than 5% free sulphuric acid","II",null,"F-A S-B"]
["IMDG_2584_10893/II/ALKYLSULPHONIC ACIDS, LIQUID or ARYLSULPHONIC ACIDS, LIQUID with more than 5% free sulphuric acid","II",null,"F-A S-B"]
["IMDG_2585_10894/III/ALKYLSULPHONIC ACIDS, SOLID or ARYLSULPHONIC ACIDS, SOLID with not more than 5% free sulphuric acid","III",null,"F-A S-B"]
["IMDG_2586_10895/III/ALKYLSULPHONIC ACIDS, LIQUID or ARYLSULPHONIC ACIDS, LIQUID with not more than 5% free sulphuric acid","III",null,"F-A S-B"]
["IMDG_2587_10896/II/BENZOQUINONE","II",null,"F-A S-A"]
["IMDG_2588_10897/I/PESTICIDE, SOLID, TOXIC, N.O.S.","I",null,"F-A S-A"]
["IMDG_2588_10898/II/PESTICIDE, SOLID, TOXIC, N.O.S.","II",null,"F-A S-A"]
["IMDG_2588_10899/III/PESTICIDE, SOLID, TOXIC, N.O.S.","III",null,"F-A S-A"]
["IMDG_2589_10900/II/VINYL CHLOROACETATE","II",null,"F-E S-D"]
["IMDG_2590_10901/III/ASBESTOS, CHRYSOTILE","III",null,"F-A S-A"]
["IMDG_2591_10902/ /XENON, REFRIGERATED LIQUID",null,null,"F-C S-V"]
["IMDG_2599_10903/ /CHLOROTRIFLUOROMETHANE AND TRIFLUOROMETHANE AZEOTROPIC MIXTURE with approximately 60% chlorotrifluoromethane (REFRIGERANT GAS R 503)",null,null,"F-C S-V"]
["IMDG_2601_10904/ /CYCLOBUTANE",null,null,"F-D S-U"]
["IMDG_2602_12110/ /DICHLORODIFLUORO-METHANE AND DIFLUOROETHANE AZEOTROPIC MIXTURE with approximately 74% dichlorodifluoromethane (REFRIGERANT GAS R 500)",null,null,"F-C S-V"]
["IMDG_2603_10906/II/CYCLOHEPTATRIENE","II",null,"F-E S-D"]
["IMDG_2604_10907/I/BORON TRIFLUORIDE DIETHYL ETHERATE","I",null,"F-E S-C"]
["IMDG_2605_10908/I/METHOXYMETHYL ISOCYANATE","I",null,"F-E S-D"]
["IMDG_2606_10909/I/METHYL ORTHOSILICATE","I",null,"F-E S-D"]
["IMDG_2607_10910/III/ACROLEIN DIMER, STABILIZED","III",null,"F-E S-D"]
["IMDG_2608_10911/III/NITROPROPANES","III",null,"F-E S-D"]
["IMDG_2609_10912/III/TRIALLYL BORATE","III",null,"F-A S-A"]
["IMDG_2610_10913/III/TRIALLYLAMINE","III",null,"F-E S-C"]
["IMDG_2611_10914/II/PROPYLENE CHLOROHYDRIN","II",null,"F-E S-D"]
["IMDG_2612_10915/II/METHYL PROPYL ETHER","II",null,"F-E S-D"]
["IMDG_2614_10916/III/METHALLYL ALCOHOL","III",null,"F-E S-D"]
["IMDG_2615_10917/II/ETHYL PROPYL ETHER","II",null,"F-E S-D"]
["IMDG_2616_10918/II/TRIISOPROPYL BORATE","II",null,"F-E S-D"]
["IMDG_2616_10919/III/TRIISOPROPYL BORATE","III",null,"F-E S-D"]
["IMDG_2617_10920/III/METHYLCYCLOHEXANOLS, flammable","III",null,"F-E S-D"]
["IMDG_2618_10921/III/VINYLTOLUENES, STABILIZED","III",null,"F-E S-D"]
["IMDG_2619_10922/II/BENZYLDIMETHYLAMINE","II",null,"F-E S-C"]
["IMDG_2620_10923/III/AMYL BUTYRATES","III",null,"F-E S-D"]
["IMDG_2621_10924/III/ACETYL METHYL CARBINOL","III",null,"F-E S-D"]
["IMDG_2622_10925/II/GLYCIDALDEHYDE","II",null,"F-E S-D"]
["IMDG_2623_10926/III/FIRELIGHTERS, SOLID with flammable liquid","III",null,"F-A S-I"]
["IMDG_2624_10927/II/MAGNESIUM SILICIDE","II",null,"F-G S-O"]
["IMDG_2626_10928/II/CHLORIC ACID, AQUEOUS SOLUTION with not more than 10% chloric acid","II",null,"F-A S-Q"]
["IMDG_2627_10929/II/NITRITES, INORGANIC, N.O.S.","II",null,"F-A S-Q"]
["IMDG_2628_10930/I/POTASSIUM FLUOROACETATE","I",null,"F-A S-A"]
["IMDG_2629_10931/I/SODIUM FLUOROACETATE","I",null,"F-A S-A"]
["IMDG_2630_10932/I/SELENATES or SELENITES","I",null,"F-A S-A"]
["IMDG_2642_10933/I/FLUOROACETIC ACID","I",null,"F-A S-A"]
["IMDG_2643_10934/II/METHYL BROMOACETATE","II",null,"F-A S-A"]
["IMDG_2644_10935/I/METHYL IODIDE","I",null,"F-A S-A"]
["IMDG_2645_10936/II/PHENACYL BROMIDE","II",null,"F-A S-A"]
["IMDG_2646_12111/I/HEXACHLOROCYCLO- PENTADIENE","I",null,"F-A S-A"]
["IMDG_2647_10938/II/MALONONITRILE","II",null,"F-A S-A"]
["IMDG_2648_10939/II/1,2-DIBROMOBUTAN-3-ONE","II",null,"F-A S-A"]
["IMDG_2649_10940/II/1,3-DICHLOROACETONE","II",null,"F-A S-A"]
["IMDG_2650_12112/II/1,1-DICHLORO-1-NITRO-ETHANE","II",null,"F-A S-A"]
["IMDG_2651_12113/III/4,4’-DIAMINODIPHENYL- METHANE","III","P","F-A S-A"]
["IMDG_2653_10943/II/BENZYL IODIDE","II",null,"F-A S-A"]
["IMDG_2655_10944/III/POTASSIUM FLUOROSILICATE","III",null,"F-A S-A"]
["IMDG_2656_10945/III/QUINOLINE","III",null,"F-A S-A"]
["IMDG_2657_10946/II/SELENIUM DISULPHIDE","II",null,"F-A S-A"]
["IMDG_2659_10947/III/SODIUM CHLOROACETATE","III",null,"F-A S-A"]
["IMDG_2660_10948/III/NITROTOLUIDINES (MONO)","III",null,"F-A S-A"]
["IMDG_2661_10949/III/HEXACHLOROACETONE","III",null,"F-A S-A"]
["IMDG_2664_10950/III/DIBROMOMETHANE","III",null,"F-A S-A"]
["IMDG_2667_10951/III/BUTYLTOLUENES","III",null,"F-A S-A"]
["IMDG_2668_10952/I/CHLOROACETONITRILE","I",null,"F-A S-A"]
["IMDG_2669_10953/II/CHLOROCRESOLS SOLUTION","II",null,"F-A S-A"]
["IMDG_2669_10954/III/CHLOROCRESOLS SOLUTION","III",null,"F-A S-A"]
["IMDG_2670_10955/II/CYANURIC CHLORIDE","II",null,"F-A S-B"]
["IMDG_2671_10956/II/AMINOPYRIDINES (o-, m-, p-)","II",null,"F-A S-A"]
["IMDG_2672_12114/III/AMMONIA SOLUTION relative density between 0.880 and 0.957 at 15°C in water, with more than 10% but not more than 35% ammonia","III","P","F-A S-B"]
["IMDG_2673_10958/II/2-AMINO-4-CHLOROPHENOL","II",null,"F-A S-A"]
["IMDG_2674_10959/III/SODIUM FLUOROSILICATE","III",null,"F-A S-A"]
["IMDG_2676_10960/ /STIBINE",null,null,"F-D S-U"]
["IMDG_2677_10961/II/RUBIDIUM HYDROXIDE SOLUTION","II",null,"F-A S-B"]
["IMDG_2677_10962/III/RUBIDIUM HYDROXIDE SOLUTION","III",null,"F-A S-B"]
["IMDG_2678_10963/II/RUBIDIUM HYDROXIDE","II",null,"F-A S-B"]
["IMDG_2679_10964/II/LITHIUM HYDROXIDE SOLUTION","II",null,"F-A S-B"]
["IMDG_2679_10965/III/LITHIUM HYDROXIDE SOLUTION","III",null,"F-A S-B"]
["IMDG_2680_10966/II/LITHIUM HYDROXIDE","II",null,"F-A S-B"]
["IMDG_2681_10967/II/CAESIUM HYDROXIDE SOLUTION","II",null,"F-A S-B"]
["IMDG_2681_10968/III/CAESIUM HYDROXIDE SOLUTION","III",null,"F-A S-B"]
["IMDG_2682_10969/II/CAESIUM HYDROXIDE","II",null,"F-A S-B"]
["IMDG_2683_10970/II/AMMONIUM SULPHIDE SOLUTION","II",null,"F-E S-C"]
["IMDG_2684_12115/III/3-DIETHYLAMINO- PROPYLAMINE","III",null,"F-E S-C"]
["IMDG_2685_12116/II/N,N-DIETHYLETHYLENE- DIAMINE","II",null,"F-E S-C"]
["IMDG_2686_10973/II/2-DIETHYLAMINOETHANOL","II",null,"F-E S-C"]
["IMDG_2687_10974/III/DICYCLOHEXYLAMMONIUM NITRITE","III",null,"F-A S-G"]
["IMDG_2688_10975/III/1-BROMO-3-CHLOROPROPANE","III",null,"F-A S-A"]
["IMDG_2689_12117/III/GLYCEROL-alpha- MONOCHLOROHYDRIN","III",null,"F-A S-A"]
["IMDG_2690_12118/II/N-n-BUTYLIMIDAZOLE","II",null,"F-A S-A"]
["IMDG_2691_10978/II/PHOSPHORUS PENTABROMIDE","II",null,"F-A S-B"]
["IMDG_2692_10979/I/BORON TRIBROMIDE","I",null,"F-A S-B"]
["IMDG_2693_10980/III/BISULPHITES, AQUEOUS SOLUTION, N.O.S.","III",null,"F-A S-B"]
["IMDG_2698_10981/III/TETRAHYDROPHTHALIC ANHYDRIDES with more than 0.05% maleic anhydride","III",null,"F-A S-B"]
["IMDG_2699_10982/I/TRIFLUOROACETIC ACID","I",null,"F-A S-B"]
["IMDG_2705_10983/II/1-PENTOL","II",null,"F-A S-B"]
["IMDG_2707_10984/II/DIMETHYLDIOXANES","II",null,"F-E S-D"]
["IMDG_2707_10985/III/DIMETHYLDIOXANES","III",null,"F-E S-D"]
["IMDG_2709_10986/III/BUTYLBENZENES","III","P","F-E S-D"]
["IMDG_2710_10987/III/DIPROPYL KETONE","III",null,"F-E S-D"]
["IMDG_2713_10988/III/ACRIDINE","III",null,"F-A S-A"]
["IMDG_2714_10989/III/ZINC RESINATE","III",null,"F-A S-I"]
["IMDG_2715_10990/III/ALUMINIUM RESINATE","III",null,"F-A S-I"]
["IMDG_2716_10991/III/1,4-BUTYNEDIOL","III",null,"F-A S-A"]
["IMDG_2717_10992/III/CAMPHOR, synthetic","III",null,"F-A S-I"]
["IMDG_2719_10993/II/BARIUM BROMATE","II",null,"F-H S-Q"]
["IMDG_2720_10994/III/CHROMIUM NITRATE","III",null,"F-A S-Q"]
["IMDG_2721_10995/II/COPPER CHLORATE","II",null,"F-H S-Q"]
["IMDG_2722_10996/III/LITHIUM NITRATE","III",null,"F-A S-Q"]
["IMDG_2723_10997/II/MAGNESIUM CHLORATE","II",null,"F-H S-Q"]
["IMDG_2724_10998/III/MANGANESE NITRATE","III",null,"F-A S-Q"]
["IMDG_2725_10999/III/NICKEL NITRATE","III",null,"F-A S-Q"]
["IMDG_2726_11000/III/NICKEL NITRITE","III",null,"F-A S-Q"]
["IMDG_2727_11001/II/THALLIUM NITRATE","II","P","F-A S-Q"]
["IMDG_2728_11002/III/ZIRCONIUM NITRATE","III",null,"F-A S-Q"]
["IMDG_2729_11003/III/HEXACHLOROBENZENE","III",null,"F-A S-A"]
["IMDG_2730_11004/III/NITROANISOLES, LIQUID","III",null,"F-A S-A"]
["IMDG_2732_11005/III/NITROBROMOBENZENES, LIQUID","III",null,"F-A S-A"]
["IMDG_2733_11006/I/AMINES, FLAMMABLE, CORROSIVE, N.O.S. or POLYAMINES, FLAMMABLE, CORROSIVE, N.O.S.","I",null,"F-E S-C"]
["IMDG_2733_11007/II/AMINES, FLAMMABLE, CORROSIVE, N.O.S. or POLYAMINES, FLAMMABLE, CORROSIVE, N.O.S.","II",null,"F-E S-C"]
["IMDG_2733_11008/III/AMINES, FLAMMABLE, CORROSIVE, N.O.S. or POLYAMINES, FLAMMABLE, CORROSIVE, N.O.S.","III",null,"F-E S-C"]
["IMDG_2734_11009/I/AMINES, LIQUID, CORROSIVE, FLAMMABLE, N.O.S. or POLYAMINES, LIQUID, CORROSIVE, FLAMMABLE, N.O.S.","I",null,"F-E S-C"]
["IMDG_2734_11010/II/AMINES, LIQUID, CORROSIVE, FLAMMABLE, N.O.S. or POLYAMINES, LIQUID, CORROSIVE, FLAMMABLE, N.O.S.","II",null,"F-E S-C"]
["IMDG_2735_11011/I/AMINES, LIQUID, CORROSIVE, N.O.S. or POLYAMINES, LIQUID, CORROSIVE, N.O.S.","I",null,"F-E S-B"]
["IMDG_2735_11012/II/AMINES, LIQUID, CORROSIVE, N.O.S. or POLYAMINES, LIQUID, CORROSIVE, N.O.S.","II",null,"F-A S-B"]
["IMDG_2735_11013/III/AMINES, LIQUID, CORROSIVE, N.O.S. or POLYAMINES, LIQUID, CORROSIVE, N.O.S.","III",null,"F-A S-B"]
["IMDG_2738_11014/II/N-BUTYLANILINE","II",null,"F-A S-A"]
["IMDG_2739_11015/III/BUTYRIC ANHYDRIDE","III",null,"F-A S-B"]
["IMDG_2740_11016/I/n-PROPYL CHLOROFORMATE","I",null,"F-E S-C"]
["IMDG_2741_11017/II/BARIUM HYPOCHLORITE with more than 22% available chlorine","II",null,"F-H S-Q"]
["IMDG_2742_11018/II/CHLOROFORMATES, TOXIC, CORROSIVE, FLAMMABLE, N.O.S.","II",null,"F-E S-C"]
["IMDG_2743_11019/II/n-BUTYL CHLOROFORMATE","II",null,"F-E S-C"]
["IMDG_2744_11020/II/CYCLOBUTYL CHLOROFORMATE","II",null,"F-E S-C"]
["IMDG_2745_11021/II/CHLOROMETHYL CHLOROFORMATE","II",null,"F-A S-B"]
["IMDG_2746_11022/II/PHENYL CHLOROFORMATE","II",null,"F-A S-B"]
["IMDG_2747_11023/III/tert-BUTYLCYCLOHEXYL CHLOROFORMATE","III",null,"F-A S-A"]
["IMDG_2748_11024/II/2-ETHYLHEXYL CHLOROFORMATE","II",null,"F-A S-B"]
["IMDG_2749_11025/I/TETRAMETHYLSILANE","I",null,"F-E S-D"]
["IMDG_2750_11026/II/1,3-DICHLOROPROPANOL-2","II",null,"F-A S-A"]
["IMDG_2751_11027/II/DIETHYLTHIOPHOSPHORYL CHLORIDE","II",null,"F-A S-B"]
["IMDG_2752_12119/III/1,2-EPOXY-3-ETHOXY-PROPANE","III",null,"F-E S-D"]
["IMDG_2753_11029/III/N-ETHYLBENZYLTOLUIDINES, LIQUID","III",null,"F-A S-A"]
["IMDG_2754_11030/II/N-ETHYLTOLUIDINES","II",null,"F-A S-A"]
["IMDG_2757_11031/I/CARBAMATE PESTICIDE, SOLID, TOXIC","I",null,"F-A S-A"]
["IMDG_2757_11032/II/CARBAMATE PESTICIDE, SOLID, TOXIC","II",null,"F-A S-A"]
["IMDG_2757_11033/III/CARBAMATE PESTICIDE, SOLID, TOXIC","III",null,"F-A S-A"]
["IMDG_2758_12120/I/CARBAMATE PESTICIDE, LIQUID, FLAMMABLE, TOXIC, flashpoint less than 23°C","I",null,"F-E S-D"]
["IMDG_2758_12121/II/CARBAMATE PESTICIDE, LIQUID, FLAMMABLE, TOXIC, flashpoint less than 23°C","II",null,"F-E S-D"]
["IMDG_2759_11036/I/ARSENICAL PESTICIDE, SOLID, TOXIC","I",null,"F-A S-A"]
["IMDG_2759_11037/II/ARSENICAL PESTICIDE, SOLID, TOXIC","II",null,"F-A S-A"]
["IMDG_2759_11038/III/ARSENICAL PESTICIDE, SOLID, TOXIC","III",null,"F-A S-A"]
["IMDG_2760_12122/I/ARSENICAL PESTICIDE, LIQUID, FLAMMABLE, TOXIC, flashpoint less than 23°C","I",null,"F-E S-D"]
["IMDG_2760_12123/II/ARSENICAL PESTICIDE, LIQUID, FLAMMABLE, TOXIC, flashpoint less than 23°C","II",null,"F-E S-D"]
["IMDG_2761_11041/I/ORGANOCHLORINE PESTICIDE, SOLID, TOXIC","I",null,"F-A S-A"]
["IMDG_2761_11042/II/ORGANOCHLORINE PESTICIDE, SOLID, TOXIC","II",null,"F-A S-A"]
["IMDG_2761_11043/III/ORGANOCHLORINE PESTICIDE, SOLID, TOXIC","III",null,"F-A S-A"]
["IMDG_2762_12124/I/ORGANOCHLORINE PESTICIDE, LIQUID, FLAMMABLE, TOXIC, flashpoint less than 23°C","I",null,"F-E S-D"]
["IMDG_2762_12125/II/ORGANOCHLORINE PESTICIDE, LIQUID, FLAMMABLE, TOXIC, flashpoint less than 23°C","II",null,"F-E S-D"]
["IMDG_2763_11046/I/TRIAZINE PESTICIDE, SOLID, TOXIC","I",null,"F-A S-A"]
["IMDG_2763_11047/II/TRIAZINE PESTICIDE, SOLID, TOXIC","II",null,"F-A S-A"]
["IMDG_2763_11048/III/TRIAZINE PESTICIDE, SOLID, TOXIC","III",null,"F-A S-A"]
["IMDG_2764_12126/I/TRIAZINE PESTICIDE, LIQUID, FLAMMABLE, TOXIC, flashpoint less than 23°C","I",null,"F-E S-D"]
["IMDG_2764_12127/II/TRIAZINE PESTICIDE, LIQUID, FLAMMABLE, TOXIC, flashpoint less than 23°C","II",null,"F-E S-D"]
["IMDG_2771_11051/I/THIOCARBAMATE PESTICIDE, SOLID, TOXIC","I",null,"F-A S-A"]
["IMDG_2771_11052/II/THIOCARBAMATE PESTICIDE, SOLID, TOXIC","II",null,"F-A S-A"]
["IMDG_2771_11053/III/THIOCARBAMATE PESTICIDE, SOLID, TOXIC","III",null,"F-A S-A"]
["IMDG_2772_12128/I/THIOCARBAMATE PESTICIDE, LIQUID, FLAMMABLE, TOXIC, flashpoint less than 23°C","I",null,"F-E S-D"]
["IMDG_2772_12129/II/THIOCARBAMATE PESTICIDE, LIQUID, FLAMMABLE, TOXIC, flashpoint less than 23°C","II",null,"F-E S-D"]
["IMDG_2775_11056/I/COPPER BASED PESTICIDE, SOLID, TOXIC","I",null,"F-A S-A"]
["IMDG_2775_11057/II/COPPER BASED PESTICIDE, SOLID, TOXIC","II",null,"F-A S-A"]
["IMDG_2775_11058/III/COPPER BASED PESTICIDE, SOLID, TOXIC","III",null,"F-A S-A"]
["IMDG_2776_12130/I/COPPER BASED PESTICIDE, LIQUID, FLAMMABLE, TOXIC, flashpoint less than 23°C","I",null,"F-E S-D"]
["IMDG_2776_12131/II/COPPER BASED PESTICIDE, LIQUID, FLAMMABLE, TOXIC, flashpoint less than 23°C","II",null,"F-E S-D"]
["IMDG_2777_11061/I/MERCURY BASED PESTICIDE, SOLID, TOXIC","I","P","F-A S-A"]
["IMDG_2777_11062/II/MERCURY BASED PESTICIDE, SOLID, TOXIC","II","P","F-A S-A"]
["IMDG_2777_11063/III/MERCURY BASED PESTICIDE, SOLID, TOXIC","III","P","F-A S-A"]
["IMDG_2778_12132/I/MERCURY BASED PESTICIDE, LIQUID, FLAMMABLE, TOXIC, flashpoint less than 23°C","I","P","F-E S-D"]
["IMDG_2778_12133/II/MERCURY BASED PESTICIDE, LIQUID, FLAMMABLE, TOXIC, flashpoint less than 23°C","II","P","F-E S-D"]
["IMDG_2779_11066/I/SUBSTITUTED NITROPHENOL PESTICIDE, SOLID, TOXIC","I",null,"F-A S-A"]
["IMDG_2779_11067/II/SUBSTITUTED NITROPHENOL PESTICIDE, SOLID, TOXIC","II",null,"F-A S-A"]
["IMDG_2779_11068/III/SUBSTITUTED NITROPHENOL PESTICIDE, SOLID, TOXIC","III",null,"F-A S-A"]
["IMDG_2780_12134/I/SUBSTITUTED NITROPHENOL PESTICIDE, LIQUID, FLAMMABLE, TOXIC, flashpoint less than 23°C","I",null,"F-E S-D"]
["IMDG_2780_12135/II/SUBSTITUTED NITROPHENOL PESTICIDE, LIQUID, FLAMMABLE, TOXIC, flashpoint less than 23°C","II",null,"F-E S-D"]
["IMDG_2781_11071/I/BIPYRIDILIUM PESTICIDE, SOLID, TOXIC","I",null,"F-A S-A"]
["IMDG_2781_11072/II/BIPYRIDILIUM PESTICIDE, SOLID, TOXIC","II",null,"F-A S-A"]
["IMDG_2781_11073/III/BIPYRIDILIUM PESTICIDE, SOLID, TOXIC","III",null,"F-A S-A"]
["IMDG_2782_12136/I/BIPYRIDILIUM PESTICIDE, LIQUID, FLAMMABLE, TOXIC, flashpoint less than 23°C","I",null,"F-E S-D"]
["IMDG_2782_12137/II/BIPYRIDILIUM PESTICIDE, LIQUID, FLAMMABLE, TOXIC, flashpoint less than 23°C","II",null,"F-E S-D"]
["IMDG_2783_11076/I/ORGANOPHOSPHORUS PESTICIDE, SOLID, TOXIC","I",null,"F-A S-A"]
["IMDG_2783_11077/II/ORGANOPHOSPHORUS PESTICIDE, SOLID, TOXIC","II",null,"F-A S-A"]
["IMDG_2783_11078/III/ORGANOPHOSPHORUS PESTICIDE, SOLID, TOXIC","III",null,"F-A S-A"]
["IMDG_2784_12138/I/ORGANOPHOSPHORUS PESTICIDE, LIQUID, FLAMMABLE, TOXIC, flashpoint less than 23°C","I",null,"F-E S-D"]
["IMDG_2784_12139/II/ORGANOPHOSPHORUS PESTICIDE, LIQUID, FLAMMABLE, TOXIC, flashpoint less than 23°C","II",null,"F-E S-D"]
["IMDG_2785_11081/III/4-THIAPENTANAL","III",null,"F-A S-A"]
["IMDG_2786_11082/I/ORGANOTIN PESTICIDE, SOLID, TOXIC","I","P","F-A S-A"]
["IMDG_2786_11083/II/ORGANOTIN PESTICIDE, SOLID, TOXIC","II","P","F-A S-A"]
["IMDG_2786_11084/III/ORGANOTIN PESTICIDE, SOLID, TOXIC","III","P","F-A S-A"]
["IMDG_2787_12140/I/ORGANOTIN PESTICIDE, LIQUID, FLAMMABLE, TOXIC, flashpoint less than 23°C","I","P","F-E S-D"]
["IMDG_2787_12141/II/ORGANOTIN PESTICIDE, LIQUID, FLAMMABLE, TOXIC, flashpoint less than 23°C","II","P","F-E S-D"]
["IMDG_2788_11087/I/ORGANOTIN COMPOUND, LIQUID, N.O.S.","I","P","F-A S-A"]
["IMDG_2788_11088/II/ORGANOTIN COMPOUND, LIQUID, N.O.S.","II","P","F-A S-A"]
["IMDG_2788_11089/III/ORGANOTIN COMPOUND, LIQUID, N.O.S.","III","P","F-A S-A"]
["IMDG_2789_11090/II/ACETIC ACID, GLACIAL or ACETIC ACID SOLUTION, more than 80% acid, by mass","II",null,"F-E S-C"]
["IMDG_2790_12142/II/ACETIC ACID SOLUTION not less than 50% but not more than 80% acid, by mass","II",null,"F-A S-B"]
["IMDG_2790_12143/III/ACETIC ACID SOLUTION more than 10% and less than 50% acid, by mass","III",null,"F-A S-B"]
["IMDG_2793_11093/III/FERROUS METAL BORINGS, SHAVINGS, TURNINGS, or CUTTINGS in a form liable to self-heating","III",null,"F-G S-J"]
["IMDG_2794_11094/ /BATTERIES, WET, FILLED WITH ACID electric storage",null,null,"F-A S-B"]
["IMDG_2795_11095/ /BATTERIES, WET, FILLED WITH ALKALI electric storage",null,null,"F-A S-B"]
["IMDG_2796_11096/II/SULPHURIC ACID with not more than 51% acid or BATTERY FLUID, ACID","II",null,"F-A S-B"]
["IMDG_2797_11097/II/BATTERY FLUID, ALKALI","II",null,"F-A S-B"]
["IMDG_2798_11098/II/PHENYLPHOSPHORUS DICHLORIDE","II",null,"F-A S-B"]
["IMDG_2799_11099/II/PHENYLPHOSPHORUS THIODICHLORIDE","II",null,"F-A S-B"]
["IMDG_2800_12144/ /BATTERIES, WET, NON-SPILLABLE electric storage",null,null,"F-A S-B"]
["IMDG_2801_11101/I/DYE, LIQUID, CORROSIVE, N.O.S. or DYE INTERMEDIATE, LIQUID, CORROSIVE, N.O.S.","I",null,"F-A S-B"]
["IMDG_2801_11102/II/DYE, LIQUID, CORROSIVE, N.O.S. or DYE INTERMEDIATE, LIQUID, CORROSIVE, N.O.S.","II",null,"F-A S-B"]
["IMDG_2801_11103/III/DYE, LIQUID, CORROSIVE, N.O.S. or DYE INTERMEDIATE, LIQUID, CORROSIVE, N.O.S.","III",null,"F-A S-B"]
["IMDG_2802_11104/III/COPPER CHLORIDE","III","P","F-A S-B"]
["IMDG_2803_11105/III/GALLIUM","III",null,"F-A S-B"]
["IMDG_2805_11106/II/LITHIUM HYDRIDE, FUSED SOLID","II",null,"F-G S-N"]
["IMDG_2806_11107/I/LITHIUM NITRIDE","I",null,"F-A S-O"]
["IMDG_2807_11108/ /MAGNETIZED MATERIAL"]
["IMDG_2809_11109/III/MERCURY","III",null,"F-A S-B"]
["IMDG_2810_11110/I/TOXIC LIQUID, ORGANIC, N.O.S.","I",null,"F-A S-A"]
["IMDG_2810_11111/II/TOXIC LIQUID, ORGANIC, N.O.S.","II",null,"F-A S-A"]
["IMDG_2810_11112/III/TOXIC LIQUID, ORGANIC, N.O.S.","III",null,"F-A S-A"]
["IMDG_2811_11113/I/TOXIC SOLID, ORGANIC, N.O.S.","I",null,"F-A S-A"]
["IMDG_2811_11114/II/TOXIC SOLID, ORGANIC, N.O.S.","II",null,"F-A S-A"]
["IMDG_2811_11115/III/TOXIC SOLID, ORGANIC, N.O.S.","III",null,"F-A S-A"]
["IMDG_2812_11116/ /SODIUM ALUMINATE, SOLID"]
["IMDG_2813_11117/I/WATER-REACTIVE SOLID, N.O.S.","I",null,"F-G S-N"]
["IMDG_2813_11118/II/WATER-REACTIVE SOLID, N.O.S.","II",null,"F-G S-N"]
["IMDG_2813_11119/III/WATER-REACTIVE SOLID, N.O.S.","III",null,"F-G S-N"]
["IMDG_2814_11120/ /INFECTIOUS SUBSTANCE, AFFECTING HUMANS",null,null,"F-A S-T"]
["IMDG_2815_11121/III/N-AMINOETHYLPIPERAZINE","III",null,"F-A S-B"]
["IMDG_2817_12145/II/AMMONIUM HYDROGEN- DIFLUORIDE SOLUTION","II",null,"F-A S-B"]
["IMDG_2817_12146/III/AMMONIUM HYDROGEN- DIFLUORIDE SOLUTION","III",null,"F-A S-B"]
["IMDG_2818_11124/II/AMMONIUM POLYSULPHIDE SOLUTION","II",null,"F-A S-B"]
["IMDG_2818_11125/III/AMMONIUM POLYSULPHIDE SOLUTION","III",null,"F-A S-B"]
["IMDG_2819_11126/III/AMYL ACID PHOSPHATE","III",null,"F-A S-B"]
["IMDG_2820_11127/III/BUTYRIC ACID","III",null,"F-A S-B"]
["IMDG_2821_11128/II/PHENOL SOLUTION","II",null,"F-A S-A"]
["IMDG_2821_11129/III/PHENOL SOLUTION","III",null,"F-A S-A"]
["IMDG_2822_11130/II/2-CHLOROPYRIDINE","II",null,"F-A S-A"]
["IMDG_2823_11131/III/CROTONIC ACID, SOLID","III",null,"F-A S-B"]
["IMDG_2826_11132/II/ETHYL CHLOROTHIOFORMATE","II","P","F-E S-C"]
["IMDG_2829_11133/III/CAPROIC ACID","III",null,"F-A S-B"]
["IMDG_2830_11134/II/LITHIUM FERROSILICON","II",null,"F-G S-N"]
["IMDG_2831_11135/III/1,1,1-TRICHLOROETHANE","III",null,"F-A S-A"]
["IMDG_2834_11136/III/PHOSPHOROUS ACID","III",null,"F-A S-B"]
["IMDG_2835_11137/II/SODIUM ALUMINIUM HYDRIDE","II",null,"F-G S-O"]
["IMDG_2837_11138/II/BISULPHATES, AQUEOUS SOLUTION","II",null,"F-A S-B"]
["IMDG_2837_11139/III/BISULPHATES, AQUEOUS SOLUTION","III",null,"F-A S-B"]
["IMDG_2838_11140/II/VINYL BUTYRATE, STABILIZED","II",null,"F-E S-D"]
["IMDG_2839_11141/II/ALDOL","II",null,"F-A S-A"]
["IMDG_2840_11142/III/BUTYRALDOXIME","III",null,"F-E S-D"]
["IMDG_2841_11143/III/DI-n-AMYLAMINE","III",null,"F-E S-D"]
["IMDG_2842_11144/III/NITROETHANE","III",null,"F-E S-D"]
["IMDG_2844_11145/III/CALCIUM MANGANESE SILICON","III",null,"F-G S-N"]
["IMDG_2845_11146/I/PYROPHORIC LIQUID, ORGANIC, N.O.S.","I",null,"F-G S-M"]
["IMDG_2846_11147/I/PYROPHORIC SOLID, ORGANIC, N.O.S.","I",null,"F-G S-M"]
["IMDG_2849_11148/III/3-CHLOROPROPANOL-1","III",null,"F-A S-A"]
["IMDG_2850_11149/III/PROPYLENE TETRAMER","III","P","F-E S-E"]
["IMDG_2851_11150/II/BORON TRIFLUORIDE DIHYDRATE","II",null,"F-A S-B"]
["IMDG_2852_11151/I/DIPICRYL SULPHIDE, WETTED with not less than 10% water, by mass","I",null,"F-B S-J"]
["IMDG_2853_11152/III/MAGNESIUM FLUOROSILICATE","III",null,"F-A S-A"]
["IMDG_2854_11153/III/AMMONIUM FLUOROSILICATE","III",null,"F-A S-A"]
["IMDG_2855_11154/III/ZINC FLUOROSILICATE","III",null,"F-A S-A"]
["IMDG_2856_11155/III/FLUOROSILICATES, N.O.S.","III",null,"F-A S-A"]
["IMDG_2857_11156/ /REFRIGERATING MACHINES containing non-flammable, non-toxic gases or ammonia solutions (UN 2672)",null,null,"F-C S-V"]
["IMDG_2858_11157/III/ZIRCONIUM, DRY coiled wire, finished metal sheets, strip (thinner than 254 microns but not thinner than 18 microns)","III",null,"F-G S-G"]
["IMDG_2859_11158/II/AMMONIUM METAVANADATE","II",null,"F-A S-A"]
["IMDG_2861_11159/II/AMMONIUM POLYVANADATE","II",null,"F-A S-A"]
["IMDG_2862_11160/III/VANADIUM PENTOXIDE, non-fused form","III",null,"F-A S-A"]
["IMDG_2863_11161/II/SODIUM AMMONIUM VANADATE","II",null,"F-A S-A"]
["IMDG_2864_11162/II/POTASSIUM METAVANADATE","II",null,"F-A S-A"]
["IMDG_2865_11163/III/HYDROXYLAMINE SULPHATE","III",null,"F-A S-B"]
["IMDG_2869_11164/II/TITANIUM TRICHLORIDE MIXTURE","II",null,"F-A S-B"]
["IMDG_2869_11165/III/TITANIUM TRICHLORIDE MIXTURE","III",null,"F-A S-B"]
["IMDG_2870_11166/I/ALUMINIUM BOROHYDRIDE","I",null,"F-G S-M"]
["IMDG_2870_11167/I/ALUMINIUM BOROHYDRIDE IN DEVICES","I",null,"F-G S-M"]
["IMDG_2871_11168/III/ANTIMONY POWDER","III",null,"F-A S-A"]
["IMDG_2872_11169/II/DIBROMOCHLOROPROPANES","II",null,"F-A S-A"]
["IMDG_2872_11170/III/DIBROMOCHLOROPROPANES","III",null,"F-A S-A"]
["IMDG_2873_11171/III/DIBUTYLAMINOETHANOL","III",null,"F-A S-A"]
["IMDG_2874_11172/III/FURFURYL ALCOHOL","III",null,"F-A S-A"]
["IMDG_2875_11173/III/HEXACHLOROPHENE","III",null,"F-A S-A"]
["IMDG_2876_11174/III/RESORCINOL","III",null,"F-A S-A"]
["IMDG_2878_11175/III/TITANIUM SPONGE GRANULES or TITANIUM SPONGE POWDERS","III",null,"F-G S-G"]
["IMDG_2879_11176/I/SELENIUM OXYCHLORIDE","I",null,"F-A S-B"]
["IMDG_2880_11177/II/CALCIUM HYPOCHLORITE, HYDRATED or CALCIUM HYPOCHLORITE, HYDRATED MIXTURE with not less than 5.5% but not more than 16% water","II","P","F-H S-Q"]
["IMDG_2880_11178/III/CALCIUM HYPOCHLORITE, HYDRATED or CALCIUM HYPOCHLORITE, HYDRATED MIXTURE with not less than 5.5% but not more than 16% water","III","P","F-H S-Q"]
["IMDG_2881_11179/I/METAL CATALYST, DRY","I",null,"F-G S-M"]
["IMDG_2881_11180/II/METAL CATALYST, DRY","II",null,"F-G S-M"]
["IMDG_2881_11181/III/METAL CATALYST, DRY","III",null,"F-G S-M"]
["IMDG_2900_11182/ /INFECTIOUS SUBSTANCE, AFFECTING ANIMALS only",null,null,"F-A S-T"]
["IMDG_2901_11183/ /BROMINE CHLORIDE",null,null,"F-C S-W"]
["IMDG_2902_11184/I/PESTICIDE, LIQUID, TOXIC, N.O.S.","I",null,"F-A S-A"]
["IMDG_2902_11185/II/PESTICIDE, LIQUID, TOXIC, N.O.S.","II",null,"F-A S-A"]
["IMDG_2902_11186/III/PESTICIDE, LIQUID, TOXIC, N.O.S.","III",null,"F-A S-A"]
["IMDG_2903_12147/I/PESTICIDE, LIQUID, TOXIC, FLAMMABLE, N.O.S. flashpoint not less than 23°C","I",null,"F-E S-D"]
["IMDG_2903_12148/II/PESTICIDE, LIQUID, TOXIC, FLAMMABLE, N.O.S. flashpoint not less than 23°C","II",null,"F-E S-D"]
["IMDG_2903_12149/III/PESTICIDE, LIQUID, TOXIC, FLAMMABLE, N.O.S. flashpoint not less than 23°C","III",null,"F-E S-D"]
["IMDG_2904_11190/III/CHLOROPHENOLATES, LIQUID or PHENOLATES, LIQUID","III",null,"F-A S-B"]
["IMDG_2905_11191/III/CHLOROPHENOLATES, SOLID or PHENOLATES, SOLID","III",null,"F-A S-B"]
["IMDG_2907_11192/II/ISOSORBIDE DINITRATE MIXTURE with not less than 60% lactose, mannose, starch, or calcium hydrogen phosphate","II",null,"F-A S-J"]
["IMDG_2908_11193/ /RADIOACTIVE MATERIAL, EXCEPTED PACKAGE - EMPTY PACKAGING",null,null,"F-I S-S"]
["IMDG_2909_11194/ /RADIOACTIVE MATERIAL, EXCEPTED PACKAGE - ARTICLES MANUFACTURED FROM NATURAL URANIUM or DEPLETED URANIUM or NATURAL THORIUM",null,null,"F-I S-S"]
["IMDG_2910_12150/ /RADIOACTIVE MATERIAL, EXCEPTED PACKAGE - LIMITED QUANTITY OF MATERIAL",null,null,"F-I S-S"]
["IMDG_2911_11196/ /RADIOACTIVE MATERIAL, EXCEPTED PACKAGE - INSTRUMENTS or ARTICLES",null,null,"F-I S-S"]
["IMDG_2912_12151/ /RADIOACTIVE MATERIAL, LOW SPECIFIC ACTIVITY (LSA-I), non fissile or fissile-excepted",null,null,"F-I S-S"]
["IMDG_2913_12152/ /RADIOACTIVE MATERIAL, SURFACE CONTAMINATED OBJECTS (SCO-I or SCO-II), non fissile or fissile-excepted",null,null,"F-I S-S"]
["IMDG_2915_11199/ /RADIOACTIVE MATERIAL, TYPE A PACKAGE, non-special form, non fissile or fissile-excepted",null,null,"F-I S-S"]
["IMDG_2916_11200/ /RADIOACTIVE MATERIAL, TYPE B(U) PACKAGE, non fissile or fissile-excepted",null,null,"F-I S-S"]
["IMDG_2917_11201/ /RADIOACTIVE MATERIAL, TYPE B(M) PACKAGE, non fissile or fissile-excepted",null,null,"F-I S-S"]
["IMDG_2919_11202/ /RADIOACTIVE MATERIAL TRANSPORTED UNDER SPECIAL ARRANGEMENT, non fissile or fissile-excepted",null,null,"F-I S-S"]
["IMDG_2920_11203/I/CORROSIVE LIQUID, FLAMMABLE, N.O.S.","I",null,"F-E S-C"]
["IMDG_2920_11204/II/CORROSIVE LIQUID, FLAMMABLE, N.O.S.","II",null,"F-E S-C"]
["IMDG_2921_11205/I/CORROSIVE SOLID, FLAMMABLE, N.O.S.","I",null,"F-A S-G"]
["IMDG_2921_11206/II/CORROSIVE SOLID, FLAMMABLE, N.O.S.","II",null,"F-A S-G"]
["IMDG_2922_11207/I/CORROSIVE LIQUID, TOXIC, N.O.S.","I",null,"F-A S-B"]
["IMDG_2922_11208/II/CORROSIVE LIQUID, TOXIC, N.O.S.","II",null,"F-A S-B"]
["IMDG_2922_11209/III/CORROSIVE LIQUID, TOXIC, N.O.S.","III",null,"F-A S-B"]
["IMDG_2923_11210/I/CORROSIVE SOLID, TOXIC, N.O.S.","I",null,"F-A S-B"]
["IMDG_2923_11211/II/CORROSIVE SOLID, TOXIC, N.O.S.","II",null,"F-A S-B"]
["IMDG_2923_11212/III/CORROSIVE SOLID, TOXIC, N.O.S.","III",null,"F-A S-B"]
["IMDG_2924_11213/I/FLAMMABLE LIQUID, CORROSIVE, N.O.S.","I",null,"F-E S-C"]
["IMDG_2924_11214/II/FLAMMABLE LIQUID, CORROSIVE, N.O.S.","II",null,"F-E S-C"]
["IMDG_2924_11215/III/FLAMMABLE LIQUID, CORROSIVE, N.O.S.","III",null,"F-E S-C"]
["IMDG_2925_11216/II/FLAMMABLE SOLID, CORROSIVE, ORGANIC, N.O.S.","II",null,"F-A S-G"]
["IMDG_2925_11217/III/FLAMMABLE SOLID, CORROSIVE, ORGANIC, N.O.S.","III",null,"F-A S-G"]
["IMDG_2926_11218/II/FLAMMABLE SOLID, TOXIC, ORGANIC, N.O.S.","II",null,"F-A S-G"]
["IMDG_2926_11219/III/FLAMMABLE SOLID, TOXIC, ORGANIC, N.O.S.","III",null,"F-A S-G"]
["IMDG_2927_11220/I/TOXIC LIQUID, CORROSIVE, ORGANIC, N.O.S.","I",null,"F-A S-B"]
["IMDG_2927_11221/II/TOXIC LIQUID, CORROSIVE, ORGANIC, N.O.S.","II",null,"F-A S-B"]
["IMDG_2928_11222/I/TOXIC SOLID, CORROSIVE, ORGANIC, N.O.S.","I",null,"F-A S-B"]
["IMDG_2928_11223/II/TOXIC SOLID, CORROSIVE, ORGANIC, N.O.S.","II",null,"F-A S-B"]
["IMDG_2929_11224/I/TOXIC LIQUID, FLAMMABLE, ORGANIC, N.O.S.","I",null,"F-E S-D"]
["IMDG_2929_11225/II/TOXIC LIQUID, FLAMMABLE, ORGANIC, N.O.S.","II",null,"F-E S-D"]
["IMDG_2930_11226/I/TOXIC SOLID, FLAMMABLE, ORGANIC, N.O.S.","I",null,"F-A S-G"]
["IMDG_2930_11227/II/TOXIC SOLID, FLAMMABLE, ORGANIC, N.O.S.","II",null,"F-A S-G"]
["IMDG_2931_11228/II/VANADYL SULPHATE","II",null,"F-A S-A"]
["IMDG_2933_12153/III/METHYL 2-CHLORO- PROPIONATE","III",null,"F-E S-D"]
["IMDG_2934_12154/III/ISOPROPYL 2-CHLORO- PROPIONATE","III",null,"F-E S-D"]
["IMDG_2935_12155/III/ETHYL 2-CHLORO-PROPIONATE","III",null,"F-E S-D"]
["IMDG_2936_11232/II/THIOLACTIC ACID","II",null,"F-A S-A"]
["IMDG_2937_11233/III/alpha-METHYLBENZYL ALCOHOL, LIQUID","III",null,"F-A S-A"]
["IMDG_2940_12156/II/9-PHOSPHABICYCLONONANES (CYCLOOCTADIENE- PHOSPHINES)","II",null,"F-A S-J"]
["IMDG_2941_11235/III/FLUOROANILINES","III",null,"F-A S-A"]
["IMDG_2942_11236/III/2-TRIFLUOROMETHYLANILINE","III",null,"F-A S-A"]
["IMDG_2943_12157/III/TETRAHYDRO-FURFURYLAMINE","III",null,"F-E S-D"]
["IMDG_2945_11238/II/N-METHYLBUTYLAMINE","II",null,"F-E S-C"]
["IMDG_2946_12158/III/2-AMINO-5-DIETHYLAMINO- PENTANE","III",null,"F-A S-A"]
["IMDG_2947_11240/III/ISOPROPYL CHLOROACETATE","III",null,"F-E S-D"]
["IMDG_2948_11241/II/3-TRIFLUOROMETHYLANILINE","II",null,"F-A S-A"]
["IMDG_2949_12159/II/SODIUM HYDROSULPHIDE, HYDRATED with not less than 25% water of crystallization","II",null,"F-A S-B"]
["IMDG_2950_11243/III/MAGNESIUM GRANULES, COATED particle size not less than 149 microns","III",null,"F-G S-O"]
["IMDG_2956_12160/III/5-tert-BUTYL-2,4,6-TRINITRO- m-XYLENE (MUSK XYLENE)","III",null,"F-B S-G"]
["IMDG_2965_11245/I/BORON TRIFLUORIDE DIMETHYL ETHERATE","I",null,"F-G S-O"]
["IMDG_2966_11246/II/THIOGLYCOL","II",null,"F-A S-A"]
["IMDG_2967_11247/III/SULPHAMIC ACID","III",null,"F-A S-B"]
["IMDG_2968_11248/III/MANEB, STABILIZED or MANEB PREPARATION, STABILIZED against self-heating","III","P","F-G S-L"]
["IMDG_2969_11249/II/CASTOR BEANS or CASTOR MEAL or CASTOR POMACE or CASTOR FLAKE","II",null,"F-A S-A"]
["IMDG_2977_11250/ /RADIOACTIVE MATERIAL, URANIUM HEXAFLUORIDE, FISSILE",null,null,"F-I S-S"]
["IMDG_2978_11251/ /RADIOACTIVE MATERIAL, URANIUM HEXAFLUORIDE non fissile or fissile-excepted",null,null,"F-I S-S"]
["IMDG_2983_11252/I/ETHYLENE OXIDE AND PROPYLENE OXIDE MIXTURE with not more than 30% ethylene oxide","I",null,"F-E S-D"]
["IMDG_2984_11253/III/HYDROGEN PEROXIDE, AQUEOUS SOLUTION with not less than 8% but less than 20% hydrogen peroxide (stabilized as necessary)","III",null,"F-H S-Q"]
["IMDG_2985_11254/II/CHLOROSILANES, FLAMMABLE, CORROSIVE, N.O.S.","II",null,"F-E S-C"]
["IMDG_2986_11255/II/CHLOROSILANES, CORROSIVE, FLAMMABLE, N.O.S.","II",null,"F-E S-C"]
["IMDG_2987_11256/II/CHLOROSILANES, CORROSIVE, N.O.S.","II",null,"F-A S-B"]
["IMDG_2988_12161/I/CHLOROSILANES, WATER- REACTIVE, FLAMMABLE, CORROSIVE, N.O.S.","I",null,"F-G S-N"]
["IMDG_2989_11258/II/LEAD PHOSPHITE, DIBASIC","II",null,"F-A S-G"]
["IMDG_2989_11259/III/LEAD PHOSPHITE, DIBASIC","III",null,"F-A S-G"]
["IMDG_2990_11260/ /LIFE-SAVING APPLIANCES, SELF-INFLATING",null,null,"F-A S-V"]
["IMDG_2991_12162/I/CARBAMATE PESTICIDE, LIQUID, TOXIC, FLAMMABLE, flashpoint not less than 23°C","I",null,"F-E S-D"]
["IMDG_2991_12163/II/CARBAMATE PESTICIDE, LIQUID, TOXIC, FLAMMABLE, flashpoint not less than 23°C","II",null,"F-E S-D"]
["IMDG_2991_12164/III/CARBAMATE PESTICIDE, LIQUID, TOXIC, FLAMMABLE, flashpoint not less than 23°C","III",null,"F-E S-D"]
["IMDG_2992_11264/I/CARBAMATE PESTICIDE, LIQUID, TOXIC","I",null,"F-A S-A"]
["IMDG_2992_11265/II/CARBAMATE PESTICIDE, LIQUID, TOXIC","II",null,"F-A S-A"]
["IMDG_2992_11266/III/CARBAMATE PESTICIDE, LIQUID, TOXIC","III",null,"F-A S-A"]
["IMDG_2993_12165/I/ARSENICAL PESTICIDE, LIQUID, TOXIC, FLAMMABLE, flashpoint not less than 23°C","I",null,"F-E S-D"]
["IMDG_2993_12166/II/ARSENICAL PESTICIDE, LIQUID, TOXIC, FLAMMABLE, flashpoint not less than 23°C","II",null,"F-E S-D"]
["IMDG_2993_12167/III/ARSENICAL PESTICIDE, LIQUID, TOXIC, FLAMMABLE, flashpoint not less than 23°C","III",null,"F-E S-D"]
["IMDG_2994_11270/I/ARSENICAL PESTICIDE, LIQUID, TOXIC","I",null,"F-A S-A"]
["IMDG_2994_11271/II/ARSENICAL PESTICIDE, LIQUID, TOXIC","II",null,"F-A S-A"]
["IMDG_2994_11272/III/ARSENICAL PESTICIDE, LIQUID, TOXIC","III",null,"F-A S-A"]
["IMDG_2995_12168/I/ORGANOCHLORINE PESTICIDE, LIQUID, TOXIC, FLAMMABLE, flashpoint not less than 23°C","I",null,"F-E S-D"]
["IMDG_2995_12169/II/ORGANOCHLORINE PESTICIDE, LIQUID, TOXIC, FLAMMABLE, flashpoint not less than 23°C","II",null,"F-E S-D"]
["IMDG_2995_12170/III/ORGANOCHLORINE PESTICIDE, LIQUID, TOXIC, FLAMMABLE, flashpoint not less than 23°C","III",null,"F-E S-D"]
["IMDG_2996_11276/I/ORGANOCHLORINE PESTICIDE, LIQUID, TOXIC","I",null,"F-A S-A"]
["IMDG_2996_11277/II/ORGANOCHLORINE PESTICIDE, LIQUID, TOXIC","II",null,"F-A S-A"]
["IMDG_2996_11278/III/ORGANOCHLORINE PESTICIDE, LIQUID, TOXIC","III",null,"F-A S-A"]
["IMDG_2997_12171/I/TRIAZINE PESTICIDE, LIQUID, TOXIC, FLAMMABLE, flashpoint not less than 23°C","I",null,"F-E S-D"]
["IMDG_2997_12172/II/TRIAZINE PESTICIDE, LIQUID, TOXIC, FLAMMABLE, flashpoint not less than 23°C","II",null,"F-E S-D"]
["IMDG_2997_12173/III/TRIAZINE PESTICIDE, LIQUID, TOXIC, FLAMMABLE, flashpoint not less than 23°C","III",null,"F-E S-D"]
["IMDG_2998_11282/I/TRIAZINE PESTICIDE, LIQUID, TOXIC","I",null,"F-A S-A"]
["IMDG_2998_11283/II/TRIAZINE PESTICIDE, LIQUID, TOXIC","II",null,"F-A S-A"]
["IMDG_2998_11284/III/TRIAZINE PESTICIDE, LIQUID, TOXIC","III",null,"F-A S-A"]
["IMDG_3005_12174/I/THIOCARBAMATE PESTICIDE, LIQUID, TOXIC, FLAMMABLE, flashpoint not less than 23°C","I",null,"F-E S-D"]
["IMDG_3005_12175/II/THIOCARBAMATE PESTICIDE, LIQUID, TOXIC, FLAMMABLE, flashpoint not less than 23°C","II",null,"F-E S-D"]
["IMDG_3005_12176/III/THIOCARBAMATE PESTICIDE, LIQUID, TOXIC, FLAMMABLE, flashpoint not less than 23°C","III",null,"F-E S-D"]
["IMDG_3006_11288/I/THIOCARBAMATE PESTICIDE, LIQUID, TOXIC","I",null,"F-A S-A"]
["IMDG_3006_11289/II/THIOCARBAMATE PESTICIDE, LIQUID, TOXIC","II",null,"F-A S-A"]
["IMDG_3006_11290/III/THIOCARBAMATE PESTICIDE, LIQUID, TOXIC","III",null,"F-A S-A"]
["IMDG_3009_12177/I/COPPER BASED PESTICIDE, LIQUID, TOXIC, FLAMMABLE, flashpoint not less than 23°C","I",null,"F-E S-D"]
["IMDG_3009_12178/II/COPPER BASED PESTICIDE, LIQUID, TOXIC, FLAMMABLE, flashpoint not less than 23°C","II",null,"F-E S-D"]
["IMDG_3009_12179/III/COPPER BASED PESTICIDE, LIQUID, TOXIC, FLAMMABLE, flashpoint not less than 23°C","III",null,"F-E S-D"]
["IMDG_3010_11294/I/COPPER BASED PESTICIDE, LIQUID, TOXIC","I",null,"F-A S-A"]
["IMDG_3010_11295/II/COPPER BASED PESTICIDE, LIQUID, TOXIC","II",null,"F-A S-A"]
["IMDG_3010_11296/III/COPPER BASED PESTICIDE, LIQUID, TOXIC","III",null,"F-A S-A"]
["IMDG_3011_12180/I/MERCURY BASED PESTICIDE, LIQUID, TOXIC, FLAMMABLE, flashpoint not less than 23°C","I","P","F-E S-D"]
["IMDG_3011_12181/II/MERCURY BASED PESTICIDE, LIQUID, TOXIC, FLAMMABLE, flashpoint not less than 23°C","II","P","F-E S-D"]
["IMDG_3011_12182/III/MERCURY BASED PESTICIDE, LIQUID, TOXIC, FLAMMABLE, flashpoint not less than 23°C","III","P","F-E S-D"]
["IMDG_3012_11300/I/MERCURY BASED PESTICIDE, LIQUID, TOXIC","I","P","F-A S-A"]
["IMDG_3012_11301/II/MERCURY BASED PESTICIDE, LIQUID, TOXIC","II","P","F-A S-A"]
["IMDG_3012_11302/III/MERCURY BASED PESTICIDE, LIQUID, TOXIC","III","P","F-A S-A"]
["IMDG_3013_12183/I/SUBSTITUTED NITROPHENOL PESTICIDE, LIQUID, TOXIC, FLAMMABLE, flashpoint not less than 23°C","I",null,"F-E S-D"]
["IMDG_3013_12184/II/SUBSTITUTED NITROPHENOL PESTICIDE, LIQUID, TOXIC, FLAMMABLE, flashpoint not less than 23°C","II",null,"F-E S-D"]
["IMDG_3013_12185/III/SUBSTITUTED NITROPHENOL PESTICIDE, LIQUID, TOXIC, FLAMMABLE, flashpoint not less than 23°C","III",null,"F-E S-D"]
["IMDG_3014_11306/I/SUBSTITUTED NITROPHENOL PESTICIDE, LIQUID, TOXIC","I",null,"F-A S-A"]
["IMDG_3014_11307/II/SUBSTITUTED NITROPHENOL PESTICIDE, LIQUID, TOXIC","II",null,"F-A S-A"]
["IMDG_3014_11308/III/SUBSTITUTED NITROPHENOL PESTICIDE, LIQUID, TOXIC","III",null,"F-A S-A"]
["IMDG_3015_12186/I/BIPYRIDILIUM PESTICIDE, LIQUID, TOXIC, FLAMMABLE, flashpoint not less than 23°C","I",null,"F-E S-D"]
["IMDG_3015_12187/II/BIPYRIDILIUM PESTICIDE, LIQUID, TOXIC, FLAMMABLE, flashpoint not less than 23°C","II",null,"F-E S-D"]
["IMDG_3015_12188/III/BIPYRIDILIUM PESTICIDE, LIQUID, TOXIC, FLAMMABLE, flashpoint not less than 23°C","III",null,"F-E S-D"]
["IMDG_3016_11312/I/BIPYRIDILIUM PESTICIDE, LIQUID, TOXIC","I",null,"F-A S-A"]
["IMDG_3016_11313/II/BIPYRIDILIUM PESTICIDE, LIQUID, TOXIC","II",null,"F-A S-A"]
["IMDG_3016_11314/III/BIPYRIDILIUM PESTICIDE, LIQUID, TOXIC","III",null,"F-A S-A"]
["IMDG_3017_12189/I/ORGANOPHOSPHORUS PESTICIDE, LIQUID, TOXIC, FLAMMABLE, flashpoint not less than 23°C","I",null,"F-E S-D"]
["IMDG_3017_12190/II/ORGANOPHOSPHORUS PESTICIDE, LIQUID, TOXIC, FLAMMABLE, flashpoint not less than 23°C","II",null,"F-E S-D"]
["IMDG_3017_12191/III/ORGANOPHOSPHORUS PESTICIDE, LIQUID, TOXIC, FLAMMABLE, flashpoint not less than 23°C","III",null,"F-E S-D"]
["IMDG_3018_11318/I/ORGANOPHOSPHORUS PESTICIDE, LIQUID, TOXIC","I",null,"F-A S-A"]
["IMDG_3018_11319/II/ORGANOPHOSPHORUS PESTICIDE, LIQUID, TOXIC","II",null,"F-A S-A"]
["IMDG_3018_11320/III/ORGANOPHOSPHORUS PESTICIDE, LIQUID, TOXIC","III",null,"F-A S-A"]
["IMDG_3019_12192/I/ORGANOTIN PESTICIDE, LIQUID, TOXIC, FLAMMABLE, flashpoint not less than 23°C","I","P","F-E S-D"]
["IMDG_3019_12193/II/ORGANOTIN PESTICIDE, LIQUID, TOXIC, FLAMMABLE, flashpoint not less than 23°C","II","P","F-E S-D"]
["IMDG_3019_12194/III/ORGANOTIN PESTICIDE, LIQUID, TOXIC, FLAMMABLE, flashpoint not less than 23°C","III","P","F-E S-D"]
["IMDG_3020_11324/I/ORGANOTIN PESTICIDE, LIQUID, TOXIC","I","P","F-A S-A"]
["IMDG_3020_11325/II/ORGANOTIN PESTICIDE, LIQUID, TOXIC","II","P","F-A S-A"]
["IMDG_3020_11326/III/ORGANOTIN PESTICIDE, LIQUID, TOXIC","III","P","F-A S-A"]
["IMDG_3021_12195/I/PESTICIDE, LIQUID, FLAMMABLE, TOXIC, N.O.S., flashpoint less than 23°C","I",null,"F-E S-D"]
["IMDG_3021_12196/II/PESTICIDE, LIQUID, FLAMMABLE, TOXIC, N.O.S., flashpoint less than 23°C","II",null,"F-E S-D"]
["IMDG_3022_11329/II/1,2-BUTYLENE OXIDE, STABILIZED","II",null,"F-E S-D"]
["IMDG_3023_11330/I/2-METHYL-2-HEPTANETHIOL","I",null,"F-E S-D"]
["IMDG_3024_12197/I/COUMARIN DERIVATIVE PESTICIDE, LIQUID, FLAMMABLE, TOXIC, flashpoint less than 23°C","I",null,"F-E S-D"]
["IMDG_3024_12198/II/COUMARIN DERIVATIVE PESTICIDE, LIQUID, FLAMMABLE, TOXIC, flashpoint less than 23°C","II",null,"F-E S-D"]
["IMDG_3025_12199/I/COUMARIN DERIVATIVE PESTICIDE, LIQUID, TOXIC, FLAMMABLE, flashpoint not less than 23°C","I",null,"F-E S-D"]
["IMDG_3025_12200/II/COUMARIN DERIVATIVE PESTICIDE, LIQUID, TOXIC, FLAMMABLE, flashpoint not less than 23°C","II",null,"F-E S-D"]
["IMDG_3025_12201/III/COUMARIN DERIVATIVE PESTICIDE, LIQUID, TOXIC, FLAMMABLE, flashpoint not less than 23°C","III",null,"F-E S-D"]
["IMDG_3026_11336/I/COUMARIN DERIVATIVE PESTICIDE, LIQUID, TOXIC","I",null,"F-A S-A"]
["IMDG_3026_11337/II/COUMARIN DERIVATIVE PESTICIDE, LIQUID, TOXIC","II",null,"F-A S-A"]
["IMDG_3026_11338/III/COUMARIN DERIVATIVE PESTICIDE, LIQUID, TOXIC","III",null,"F-A S-A"]
["IMDG_3027_11339/I/COUMARIN DERIVATIVE PESTICIDE, SOLID, TOXIC","I",null,"F-A S-A"]
["IMDG_3027_11340/II/COUMARIN DERIVATIVE PESTICIDE, SOLID, TOXIC","II",null,"F-A S-A"]
["IMDG_3027_11341/III/COUMARIN DERIVATIVE PESTICIDE, SOLID, TOXIC","III",null,"F-A S-A"]
["IMDG_3028_11342/III/BATTERIES, DRY, CONTAINING POTASSIUM HYDROXIDE, SOLID electric storage","III",null,"F-A S-B"]
["IMDG_3048_11343/I/ALUMINIUM PHOSPHIDE PESTICIDE","I",null,"F-A S-A"]
["IMDG_3054_11344/III/CYCLOHEXYL MERCAPTAN","III",null,"F-E S-D"]
["IMDG_3055_12202/III/2-(2-AMINOETHOXY)ETHANOL","III",null,"F-A S-B"]
["IMDG_3056_11346/III/n-HEPTALDEHYDE","III",null,"F-E S-D"]
["IMDG_3057_11347/ /TRIFLUOROACETYL CHLORIDE",null,null,"F-C S-U"]
["IMDG_3064_11348/II/NITROGLYCERIN SOLUTION IN ALCOHOL with more than 1% but not more than 5% nitroglycerin","II",null,"F-E S-D"]
["IMDG_3065_11350/III/ALCOHOLIC BEVERAGES, with more than 24% but not more than 70% alcohol by volume","III",null,"F-E S-D"]
["IMDG_3065_12203/II/ALCOHOLIC BEVERAGES, with more than 70% alcohol by volume","II",null,"F-E S-D"]
["IMDG_3066_11351/II/PAINT (including paint, lacquer, enamel, stain, shellac, varnish, polish, liquid filler and liquid lacquer base) or PAINT RELATED MATERIAL (including paint thinning or reducing compound)","II",null,"F-A S-B"]
["IMDG_3066_11352/III/PAINT (including paint, lacquer, enamel, stain, shellac, varnish, polish, liquid filler and liquid lacquer base) or PAINT RELATED MATERIAL (including paint thinning or reducing compound)","III",null,"F-A S-B"]
["IMDG_3070_12204/ /ETHYLENE OXIDE AND DICHLORODIFLUORO-METHANE MIXTURE with not more than 12.5% ethylene oxide",null,null,"F-C S-V"]
["IMDG_3071_11354/II/MERCAPTANS, LIQUID, TOXIC, FLAMMABLE, N.O.S. or MERCAPTAN MIXTURE, LIQUID, TOXIC, FLAMMABLE, N.O.S.","II",null,"F-E S-D"]
["IMDG_3072_11355/ /LIFE-SAVING APPLIANCES, NOT SELF-INFLATING containing dangerous goods as equipment",null,null,"F-A S-V"]
["IMDG_3073_11356/II/VINYLPYRIDINES, STABILIZED","II",null,"F-E S-C"]
["IMDG_3077_11357/III/ENVIRONMENTALLY HAZARDOUS SUBSTANCE, SOLID, N.O.S.","III",null,"F-A S-F"]
["IMDG_3078_11358/II/CERIUM turnings or gritty powder","II",null,"F-G S-O"]
["IMDG_3079_11359/I/METHACRYLONITRILE, STABILIZED","I",null,"F-E S-D"]
["IMDG_3080_11360/II/ISOCYANATES, TOXIC, FLAMMABLE, N.O.S or ISOCYANATE SOLUTION, TOXIC, FLAMMABLE, N.O.S.","II",null,"F-E S-D"]
["IMDG_3082_11361/III/ENVIRONMENTALLY HAZARDOUS SUBSTANCE, LIQUID, N.O.S.","III",null,"F-A S-F"]
["IMDG_3083_11362/ /PERCHLORYL FLUORIDE",null,null,"F-C S-W"]
["IMDG_3084_11363/I/CORROSIVE SOLID, OXIDIZING, N.O.S.","I",null,"F-A S-Q"]
["IMDG_3084_11364/II/CORROSIVE SOLID, OXIDIZING, N.O.S.","II",null,"F-A S-Q"]
["IMDG_3085_11365/I/OXIDIZING SOLID, CORROSIVE, N.O.S.","I",null,"F-A S-Q"]
["IMDG_3085_11366/II/OXIDIZING SOLID, CORROSIVE, N.O.S.","II",null,"F-A S-Q"]
["IMDG_3085_11367/III/OXIDIZING SOLID, CORROSIVE, N.O.S.","III",null,"F-A S-Q"]
["IMDG_3086_11368/I/TOXIC SOLID, OXIDIZING, N.O.S.","I",null,"F-A S-Q"]
["IMDG_3086_11369/II/TOXIC SOLID, OXIDIZING, N.O.S.","II",null,"F-A S-Q"]
["IMDG_3087_11370/I/OXIDIZING SOLID, TOXIC, N.O.S.","I",null,"F-A S-Q"]
["IMDG_3087_11371/II/OXIDIZING SOLID, TOXIC, N.O.S.","II",null,"F-A S-Q"]
["IMDG_3087_11372/III/OXIDIZING SOLID, TOXIC, N.O.S.","III",null,"F-A S-Q"]
["IMDG_3088_11373/II/SELF-HEATING SOLID, ORGANIC, N.O.S.","II",null,"F-A S-J"]
["IMDG_3088_11374/III/SELF-HEATING SOLID, ORGANIC, N.O.S.","III",null,"F-A S-J"]
["IMDG_3089_11375/II/METAL POWDER, FLAMMABLE, N.O.S.","II",null,"F-G S-G"]
["IMDG_3089_11376/III/METAL POWDER, FLAMMABLE, N.O.S.","III",null,"F-G S-G"]
["IMDG_3090_11377/ /LITHIUM METAL BATTERIES (including lithium alloy batteries)",null,null,"F-A S-I"]
["IMDG_3091_12205/ /LITHIUM METAL BATTERIES CONTAINED IN EQUIPMENT or LITHIUM METAL BATTERIES PACKED WITH EQUIPMENT (including lithium alloy batteries)",null,null,"F-A S-I"]
["IMDG_3092_11379/III/1-METHOXY-2-PROPANOL","III",null,"F-E S-D"]
["IMDG_3093_11380/I/CORROSIVE LIQUID, OXIDIZING, N.O.S.","I",null,"F-A S-Q"]
["IMDG_3093_11381/II/CORROSIVE LIQUID, OXIDIZING, N.O.S.","II",null,"F-A S-Q"]
["IMDG_3094_11382/I/CORROSIVE LIQUID, WATER-REACTIVE, N.O.S.","I",null,"F-G S-L"]
["IMDG_3094_11383/II/CORROSIVE LIQUID, WATER-REACTIVE, N.O.S.","II",null,"F-G S-L"]
["IMDG_3095_12206/I/CORROSIVE SOLID, SELF-HEATING, N.O.S.","I",null,"F-A S-N"]
["IMDG_3095_12207/II/CORROSIVE SOLID, SELF-HEATING, N.O.S.","II",null,"F-A S-N"]
["IMDG_3096_11386/I/CORROSIVE SOLID, WATER-REACTIVE, N.O.S.","I",null,"F-G S-L"]
["IMDG_3096_11387/II/CORROSIVE SOLID, WATER-REACTIVE, N.O.S.","II",null,"F-G S-L"]
["IMDG_3097_11388/II/FLAMMABLE SOLID, OXIDIZING, N.O.S.","II",null,"F-A S-Q"]
["IMDG_3097_11389/III/FLAMMABLE SOLID, OXIDIZING, N.O.S.","III",null,"F-A S-Q"]
["IMDG_3098_11390/I/OXIDIZING LIQUID, CORROSIVE, N.O.S.","I",null,"F-A S-Q"]
["IMDG_3098_11391/II/OXIDIZING LIQUID, CORROSIVE, N.O.S.","II",null,"F-A S-Q"]
["IMDG_3098_11392/III/OXIDIZING LIQUID, CORROSIVE, N.O.S.","III",null,"F-A S-Q"]
["IMDG_3099_11393/I/OXIDIZING LIQUID, TOXIC, N.O.S.","I",null,"F-A S-Q"]
["IMDG_3099_11394/II/OXIDIZING LIQUID, TOXIC, N.O.S.","II",null,"F-A S-Q"]
["IMDG_3099_11395/III/OXIDIZING LIQUID, TOXIC, N.O.S.","III",null,"F-A S-Q"]
["IMDG_3100_11396/I/OXIDIZING SOLID, SELF-HEATING, N.O.S.","I",null,"F-A S-Q"]
["IMDG_3100_11397/II/OXIDIZING SOLID, SELF-HEATING, N.O.S.","II",null,"F-A S-Q"]
["IMDG_3101_11398/ /ORGANIC PEROXIDE TYPE B, LIQUID",null,null,"F-J S-R"]
["IMDG_3102_11399/ /ORGANIC PEROXIDE TYPE B, SOLID",null,null,"F-J S-R"]
["IMDG_3103_11400/ /ORGANIC PEROXIDE TYPE C, LIQUID",null,null,"F-J S-R"]
["IMDG_3104_11401/ /ORGANIC PEROXIDE TYPE C, SOLID",null,null,"F-J S-R"]
["IMDG_3105_11402/ /ORGANIC PEROXIDE TYPE D, LIQUID",null,null,"F-J S-R"]
["IMDG_3106_11403/ /ORGANIC PEROXIDE TYPE D, SOLID",null,null,"F-J S-R"]
["IMDG_3107_11404/ /ORGANIC PEROXIDE TYPE E, LIQUID",null,null,"F-J S-R"]
["IMDG_3108_11405/ /ORGANIC PEROXIDE TYPE E, SOLID",null,null,"F-J S-R"]
["IMDG_3109_11406/ /ORGANIC PEROXIDE TYPE F, LIQUID",null,null,"F-J S-R"]
["IMDG_3110_11407/ /ORGANIC PEROXIDE TYPE F, SOLID",null,null,"F-J S-R"]
["IMDG_3111_11408/ /ORGANIC PEROXIDE TYPE B, LIQUID, TEMPERATURE CONTROLLED",null,null,"F-F S-R"]
["IMDG_3112_11409/ /ORGANIC PEROXIDE TYPE B, SOLID, TEMPERATURE CONTROLLED",null,null,"F-F S-R"]
["IMDG_3113_11410/ /ORGANIC PEROXIDE TYPE C, LIQUID, TEMPERATURE CONTROLLED",null,null,"F-F S-R"]
["IMDG_3114_11411/ /ORGANIC PEROXIDE TYPE C, SOLID, TEMPERATURE CONTROLLED",null,null,"F-F S-R"]
["IMDG_3115_11412/ /ORGANIC PEROXIDE TYPE D, LIQUID, TEMPERATURE CONTROLLED",null,null,"F-F S-R"]
["IMDG_3116_11413/ /ORGANIC PEROXIDE TYPE D, SOLID, TEMPERATURE CONTROLLED",null,null,"F-F S-R"]
["IMDG_3117_11414/ /ORGANIC PEROXIDE TYPE E, LIQUID, TEMPERATURE CONTROLLED",null,null,"F-F S-R"]
["IMDG_3118_11415/ /ORGANIC PEROXIDE TYPE E, SOLID, TEMPERATURE CONTROLLED",null,null,"F-F S-R"]
["IMDG_3119_11416/ /ORGANIC PEROXIDE TYPE F, LIQUID, TEMPERATURE CONTROLLED",null,null,"F-F S-R"]
["IMDG_3120_11417/ /ORGANIC PEROXIDE TYPE F, SOLID, TEMPERATURE CONTROLLED",null,null,"F-F S-R"]
["IMDG_3121_11418/I/OXIDIZING SOLID, WATER-REACTIVE, N.O.S.","I",null,"F-G S-L"]
["IMDG_3121_11419/II/OXIDIZING SOLID, WATER-REACTIVE, N.O.S.","II",null,"F-G S-L"]
["IMDG_3122_11420/I/TOXIC LIQUID, OXIDIZING, N.O.S.","I",null,"F-A S-Q"]
["IMDG_3122_11421/II/TOXIC LIQUID, OXIDIZING, N.O.S.","II",null,"F-A S-Q"]
["IMDG_3123_11422/I/TOXIC LIQUID, WATER-REACTIVE, N.O.S.","I",null,"F-G S-N"]
["IMDG_3123_11423/II/TOXIC LIQUID, WATER-REACTIVE, N.O.S.","II",null,"F-G S-N"]
["IMDG_3124_11424/I/TOXIC SOLID, SELF-HEATING, N.O.S.","I",null,"F-A S-J"]
["IMDG_3124_11425/II/TOXIC SOLID, SELF-HEATING, N.O.S.","II",null,"F-A S-J"]
["IMDG_3125_11426/I/TOXIC SOLID, WATER-REACTIVE, N.O.S.","I",null,"F-G S-N"]
["IMDG_3125_11427/II/TOXIC SOLID, WATER-REACTIVE, N.O.S.","II",null,"F-G S-N"]
["IMDG_3126_11428/II/SELF-HEATING SOLID, CORROSIVE, ORGANIC, N.O.S.","II",null,"F-A S-J"]
["IMDG_3126_11429/III/SELF-HEATING SOLID, CORROSIVE, ORGANIC, N.O.S.","III",null,"F-A S-J"]
["IMDG_3127_11430/II/SELF-HEATING SOLID, OXIDIZING, N.O.S.","II",null,"F-A S-J"]
["IMDG_3127_11431/III/SELF-HEATING SOLID, OXIDIZING, N.O.S.","III",null,"F-A S-J"]
["IMDG_3128_11432/II/SELF-HEATING SOLID, TOXIC, ORGANIC, N.O.S.","II",null,"F-A S-J"]
["IMDG_3128_11433/III/SELF-HEATING SOLID, TOXIC, ORGANIC, N.O.S.","III",null,"F-A S-J"]
["IMDG_3129_11434/I/WATER-REACTIVE LIQUID, CORROSIVE, N.O.S.","I",null,"F-G S-N"]
["IMDG_3129_11435/II/WATER-REACTIVE LIQUID, CORROSIVE, N.O.S.","II",null,"F-G S-N"]
["IMDG_3129_11436/III/WATER-REACTIVE LIQUID, CORROSIVE, N.O.S.","III",null,"F-G S-N"]
["IMDG_3130_11437/I/WATER-REACTIVE LIQUID, TOXIC, N.O.S.","I",null,"F-G S-N"]
["IMDG_3130_11438/II/WATER-REACTIVE LIQUID, TOXIC, N.O.S.","II",null,"F-G S-N"]
["IMDG_3130_11439/III/WATER-REACTIVE LIQUID, TOXIC, N.O.S.","III",null,"F-G S-N"]
["IMDG_3131_11440/I/WATER-REACTIVE SOLID, CORROSIVE, N.O.S.","I",null,"F-G S-L"]
["IMDG_3131_11441/II/WATER-REACTIVE SOLID, CORROSIVE, N.O.S.","II",null,"F-G S-L"]
["IMDG_3131_11442/III/WATER-REACTIVE SOLID, CORROSIVE, N.O.S.","III",null,"F-G S-L"]
["IMDG_3132_11443/I/WATER-REACTIVE SOLID, FLAMMABLE, N.O.S.","I",null,"F-G S-N"]
["IMDG_3132_11444/II/WATER-REACTIVE SOLID, FLAMMABLE, N.O.S.","II",null,"F-G S-N"]
["IMDG_3132_11445/III/WATER-REACTIVE SOLID, FLAMMABLE, N.O.S.","III",null,"F-G S-N"]
["IMDG_3133_11446/II/WATER-REACTIVE SOLID, OXIDIZING, N.O.S.","II",null,"F-G S-L"]
["IMDG_3133_11447/III/WATER-REACTIVE SOLID, OXIDIZING, N.O.S.","III",null,"F-G S-L"]
["IMDG_3134_11448/I/WATER-REACTIVE SOLID, TOXIC, N.O.S.","I",null,"F-G S-N"]
["IMDG_3134_11449/II/WATER-REACTIVE SOLID, TOXIC, N.O.S.","II",null,"F-G S-N"]
["IMDG_3134_11450/III/WATER-REACTIVE SOLID, TOXIC, N.O.S.","III",null,"F-G S-N"]
["IMDG_3135_11451/I/WATER-REACTIVE SOLID, SELF-HEATING, N.O.S.","I",null,"F-G S-N"]
["IMDG_3135_11452/II/WATER-REACTIVE SOLID, SELF-HEATING, N.O.S.","II",null,"F-G S-N"]
["IMDG_3135_11453/III/WATER-REACTIVE SOLID, SELF-HEATING, N.O.S.","III",null,"F-G S-N"]
["IMDG_3136_11454/ /TRIFLUOROMETHANE, REFRIGERATED LIQUID",null,null,"F-C S-V"]
["IMDG_3137_11455/I/OXIDIZING SOLID, FLAMMABLE, N.O.S.","I",null,"F-G S-Q"]
["IMDG_3138_11456/ /ETHYLENE, ACETYLENE AND PROPYLENE MIXTURE, REFRIGERATED LIQUID containing at least 71.5% ethylene, with not more than 22.5% acetylene and not more than 6% propylene",null,null,"F-D S-U"]
["IMDG_3139_11457/I/OXIDIZING LIQUID, N.O.S.","I",null,"F-A S-Q"]
["IMDG_3139_11458/II/OXIDIZING LIQUID, N.O.S.","II",null,"F-A S-Q"]
["IMDG_3139_11459/III/OXIDIZING LIQUID, N.O.S.","III",null,"F-A S-Q"]
["IMDG_3140_11460/I/ALKALOIDS, LIQUID, N.O.S. or ALKALOIDS SALTS, LIQUID, N.O.S.","I",null,"F-A S-A"]
["IMDG_3140_11461/II/ALKALOIDS, LIQUID, N.O.S. or ALKALOIDS SALTS, LIQUID, N.O.S.","II",null,"F-A S-A"]
["IMDG_3140_11462/III/ALKALOIDS, LIQUID, N.O.S. or ALKALOIDS SALTS, LIQUID, N.O.S.","III",null,"F-A S-A"]
["IMDG_3141_11463/III/ANTIMONY COMPOUND, INORGANIC, LIQUID, N.O.S.","III",null,"F-A S-A"]
["IMDG_3142_11464/I/DISINFECTANT, LIQUID, TOXIC, N.O.S.","I",null,"F-A S-A"]
["IMDG_3142_11465/II/DISINFECTANT, LIQUID, TOXIC, N.O.S.","II",null,"F-A S-A"]
["IMDG_3142_11466/III/DISINFECTANT, LIQUID, TOXIC, N.O.S.","III",null,"F-A S-A"]
["IMDG_3143_11467/I/DYE, SOLID, TOXIC, N.O.S. or DYE INTERMEDIATE, SOLID, TOXIC, N.O.S.","I",null,"F-A S-A"]
["IMDG_3143_11468/II/DYE, SOLID, TOXIC, N.O.S. or DYE INTERMEDIATE, SOLID, TOXIC, N.O.S.","II",null,"F-A S-A"]
["IMDG_3143_11469/III/DYE, SOLID, TOXIC, N.O.S. or DYE INTERMEDIATE, SOLID, TOXIC, N.O.S.","III",null,"F-A S-A"]
["IMDG_3144_11470/I/NICOTINE COMPOUND, LIQUID, N.O.S. or NICOTINE PREPARATION, LIQUID, N.O.S.","I",null,"F-A S-A"]
["IMDG_3144_11471/II/NICOTINE COMPOUND, LIQUID, N.O.S. or NICOTINE PREPARATION, LIQUID, N.O.S.","II",null,"F-A S-A"]
["IMDG_3144_11472/III/NICOTINE COMPOUND, LIQUID, N.O.S. or NICOTINE PREPARATION, LIQUID, N.O.S.","III",null,"F-A S-A"]
["IMDG_3145_12208/I/ALKYLPHENOLS, LIQUID, N.O.S. (including C2-C12 homologues)","I",null,"F-A S-B"]
["IMDG_3145_12209/II/ALKYLPHENOLS, LIQUID, N.O.S. (including C2-C12 homologues)","II",null,"F-A S-B"]
["IMDG_3145_12210/III/ALKYLPHENOLS, LIQUID, N.O.S. (including C2-C12 homologues)","III",null,"F-A S-B"]
["IMDG_3146_11476/I/ORGANOTIN COMPOUND, SOLID, N.O.S.","I","P","F-A S-A"]
["IMDG_3146_11477/II/ORGANOTIN COMPOUND, SOLID, N.O.S.","II","P","F-A S-A"]
["IMDG_3146_11478/III/ORGANOTIN COMPOUND, SOLID, N.O.S.","III","P","F-A S-A"]
["IMDG_3147_11479/I/DYE, SOLID, CORROSIVE, N.O.S. or DYE INTERMEDIATE, SOLID, CORROSIVE, N.O.S.","I",null,"F-A S-B"]
["IMDG_3147_11480/II/DYE, SOLID, CORROSIVE, N.O.S. or DYE INTERMEDIATE, SOLID, CORROSIVE, N.O.S.","II",null,"F-A S-B"]
["IMDG_3147_11481/III/DYE, SOLID, CORROSIVE, N.O.S. or DYE INTERMEDIATE, SOLID, CORROSIVE, N.O.S.","III",null,"F-A S-B"]
["IMDG_3148_11482/I/WATER-REACTIVE LIQUID, N.O.S.","I",null,"F-G S-N"]
["IMDG_3148_11483/II/WATER-REACTIVE LIQUID, N.O.S.","II",null,"F-G S-N"]
["IMDG_3148_11484/III/WATER-REACTIVE LIQUID, N.O.S.","III",null,"F-G S-N"]
["IMDG_3149_11485/II/HYDROGEN PEROXIDE AND PEROXYACETIC ACID MIXTURE with acid(s), water and not more than 5% peroxyacetic acid, STABILIZED","II",null,"F-H S-Q"]
["IMDG_3150_11486/ /DEVICES, SMALL, HYDROCARBON GAS POWERED or HYDROCARBON GAS REFILLS FOR SMALL DEVICES with release device",null,null,"F-D S-U"]
["IMDG_3151_12211/II/POLYHALOGENATED BIPHENYLS, LIQUID or HALOGENATED MONOMETHYL- DIPHENYLMETHANES, LIQUID or POLYHALOGENATED TERPHENYLS, LIQUID","II","P","F-A S-A"]
["IMDG_3152_12212/II/POLYHALOGENATED BIPHENYLS, SOLID or HALOGENATED MONOMETHYL- DIPHENYLMETHANES, SOLID or POLYHALOGENATED TERPHENYLS, SOLID","II","P","F-A S-A"]
["IMDG_3153_12213/ /PERFLUORO(METHYL VINYL ETHER)",null,null,"F-D S-U"]
["IMDG_3154_12214/ /PERFLUORO(ETHYL VINYL ETHER)",null,null,"F-D S-U"]
["IMDG_3155_11491/II/PENTACHLOROPHENOL","II","P","F-A S-A"]
["IMDG_3156_11492/ /COMPRESSED GAS, OXIDIZING, N.O.S.",null,null,"F-C S-W"]
["IMDG_3157_11493/ /LIQUEFIED GAS, OXIDIZING, N.O.S.",null,null,"F-C S-W"]
["IMDG_3158_11494/ /GAS, REFRIGERATED LIQUID, N.O.S.",null,null,"F-C S-V"]
["IMDG_3159_11495/ /1,1,1,2-TETRAFLUOROETHANE (REFRIGERANT GAS R 134a)",null,null,"F-C S-V"]
["IMDG_3160_11496/ /LIQUEFIED GAS, TOXIC, FLAMMABLE, N.O.S.",null,null,"F-D S-U"]
["IMDG_3161_11497/ /LIQUEFIED GAS, FLAMMABLE, N.O.S.",null,null,"F-D S-U"]
["IMDG_3162_11498/ /LIQUEFIED GAS, TOXIC, N.O.S.",null,null,"F-C S-U"]
["IMDG_3163_11499/ /LIQUEFIED GAS, N.O.S.",null,null,"F-C S-V"]
["IMDG_3164_12215/ /ARTICLES, PRESSURIZED, PNEUMATIC or HYDRAULIC (containing non-flammable gas)",null,null,"F-C S-V"]
["IMDG_3165_11501/I/AIRCRAFT HYDRAULIC POWER UNIT FUEL TANK (containing a mixture of anhydrous hydrazine and methylhydrazine) (M86 fuel)","I",null,"F-E S-C"]
["IMDG_3166_12216/ /VEHICLE, FLAMMABLE GAS POWERED or VEHICLE, FLAMMABLE LIQUID POWERED or VEHICLE, FUEL CELL, FLAMMABLE GAS POWERED or VEHICLE, FUEL CELL, FLAMMABLE LIQUID POWERED",null,null,"*"]
["IMDG_3167_11503/ /GAS SAMPLE, NON-PRESSURIZED, FLAMMABLE, N.O.S., not refrigerated liquid",null,null,"F-D S-U"]
["IMDG_3168_11504/ /GAS SAMPLE, NON-PRESSURIZED, TOXIC, FLAMMABLE, N.O.S., not refrigerated liquid",null,null,"F-D S-U"]
["IMDG_3169_11505/ /GAS SAMPLE, NON-PRESSURIZED, TOXIC, N.O.S., not refrigerated liquid",null,null,"F-C S-U"]
["IMDG_3170_11506/II/ALUMINIUM SMELTING BY-PRODUCTS or ALUMINIUM REMELTING BY-PRODUCTS","II",null,"F-G S-P"]
["IMDG_3170_11507/III/ALUMINIUM SMELTING BY-PRODUCTS or ALUMINIUM REMELTING BY-PRODUCTS","III",null,"F-G S-P"]
["IMDG_3171_11508/ /BATTERY-POWERED VEHICLE or BATTERY-POWERED EQUIPMENT",null,null,"F-A S-I"]
["IMDG_3172_11509/I/TOXINS, EXTRACTED FROM LIVING SOURCES, LIQUID, N.O.S.","I",null,"F-A S-A"]
["IMDG_3172_11510/II/TOXINS, EXTRACTED FROM LIVING SOURCES, LIQUID, N.O.S.","II",null,"F-A S-A"]
["IMDG_3172_11511/III/TOXINS, EXTRACTED FROM LIVING SOURCES, LIQUID, N.O.S.","III",null,"F-A S-A"]
["IMDG_3174_11512/III/TITANIUM DISULPHIDE","III",null,"F-A S-J"]
["IMDG_3175_11513/II/SOLIDS CONTAINING FLAMMABLE LIQUID, N.O.S.","II",null,"F-A S-I"]
["IMDG_3176_11514/II/FLAMMABLE SOLID, ORGANIC, MOLTEN, N.O.S.","II",null,"F-A S-H"]
["IMDG_3176_11515/III/FLAMMABLE SOLID, ORGANIC, MOLTEN, N.O.S.","III",null,"F-A S-H"]
["IMDG_3178_11516/II/FLAMMABLE SOLID, INORGANIC, N.O.S.","II",null,"F-A S-G"]
["IMDG_3178_11517/III/FLAMMABLE SOLID, INORGANIC, N.O.S.","III",null,"F-A S-G"]
["IMDG_3179_11518/II/FLAMMABLE SOLID, TOXIC, INORGANIC, N.O.S.","II",null,"F-A S-G"]
["IMDG_3179_11519/III/FLAMMABLE SOLID, TOXIC, INORGANIC, N.O.S.","III",null,"F-A S-G"]
["IMDG_3180_11520/II/FLAMMABLE SOLID, CORROSIVE, INORGANIC, N.O.S.","II",null,"F-A S-G"]
["IMDG_3180_11521/III/FLAMMABLE SOLID, CORROSIVE, INORGANIC, N.O.S.","III",null,"F-A S-G"]
["IMDG_3181_11522/II/METAL SALTS OF ORGANIC COMPOUNDS, FLAMMABLE, N.O.S.","II",null,"F-A S-I"]
["IMDG_3181_11523/III/METAL SALTS OF ORGANIC COMPOUNDS, FLAMMABLE, N.O.S.","III",null,"F-A S-I"]
["IMDG_3182_11524/II/METAL HYDRIDES, FLAMMABLE, N.O.S.","II",null,"F-A S-G"]
["IMDG_3182_11525/III/METAL HYDRIDES, FLAMMABLE, N.O.S.","III",null,"F-A S-G"]
["IMDG_3183_12217/II/SELF-HEATING LIQUID, ORGANIC, N.O.S.","II",null,"F-A S-J"]
["IMDG_3183_12218/III/SELF-HEATING LIQUID, ORGANIC, N.O.S.","III",null,"F-A S-J"]
["IMDG_3184_11528/II/SELF-HEATING LIQUID, TOXIC, ORGANIC, N.O.S.","II",null,"F-A S-J"]
["IMDG_3184_11529/III/SELF-HEATING LIQUID, TOXIC, ORGANIC, N.O.S.","III",null,"F-A S-J"]
["IMDG_3185_11530/II/SELF-HEATING LIQUID, CORROSIVE, ORGANIC, N.O.S.","II",null,"F-A S-J"]
["IMDG_3185_11531/III/SELF-HEATING LIQUID, CORROSIVE, ORGANIC, N.O.S.","III",null,"F-A S-J"]
["IMDG_3186_11532/II/SELF-HEATING LIQUID, INORGANIC, N.O.S.","II",null,"F-A S-J"]
["IMDG_3186_11533/III/SELF-HEATING LIQUID, INORGANIC, N.O.S.","III",null,"F-A S-J"]
["IMDG_3187_11534/II/SELF-HEATING LIQUID, TOXIC, INORGANIC, N.O.S.","II",null,"F-A S-J"]
["IMDG_3187_11535/III/SELF-HEATING LIQUID, TOXIC, INORGANIC, N.O.S.","III",null,"F-A S-J"]
["IMDG_3188_11536/II/SELF-HEATING LIQUID, CORROSIVE, INORGANIC, N.O.S.","II",null,"F-A S-J"]
["IMDG_3188_11537/III/SELF-HEATING LIQUID, CORROSIVE, INORGANIC, N.O.S.","III",null,"F-A S-J"]
["IMDG_3189_11538/II/METAL POWDER, SELF-HEATING, N.O.S.","II",null,"F-G S-J"]
["IMDG_3189_11539/III/METAL POWDER, SELF-HEATING, N.O.S.","III",null,"F-G S-J"]
["IMDG_3190_11540/II/SELF-HEATING SOLID, INORGANIC, N.O.S.","II",null,"F-A S-J"]
["IMDG_3190_11541/III/SELF-HEATING SOLID, INORGANIC, N.O.S.","III",null,"F-A S-J"]
["IMDG_3191_11542/II/SELF-HEATING SOLID, TOXIC, INORGANIC, N.O.S.","II",null,"F-A S-J"]
["IMDG_3191_11543/III/SELF-HEATING SOLID, TOXIC, INORGANIC, N.O.S.","III",null,"F-A S-J"]
["IMDG_3192_11544/II/SELF-HEATING SOLID, CORROSIVE, INORGANIC, N.O.S.","II",null,"F-A S-J"]
["IMDG_3192_11545/III/SELF-HEATING SOLID, CORROSIVE, INORGANIC, N.O.S.","III",null,"F-A S-J"]
["IMDG_3194_11546/I/PYROPHORIC LIQUID, INORGANIC, N.O.S.","I",null,"F-G S-M"]
["IMDG_3200_11547/I/PYROPHORIC SOLID, INORGANIC, N.O.S.","I",null,"F-G S-M"]
["IMDG_3205_11548/II/ALKALINE EARTH METAL ALCOHOLATES, N.O.S.","II",null,"F-A S-J"]
["IMDG_3205_11549/III/ALKALINE EARTH METAL ALCOHOLATES, N.O.S.","III",null,"F-A S-J"]
["IMDG_3206_11550/II/ALKALI METAL ALCOHOLATES, SELF-HEATING, CORROSIVE, N.O.S.","II",null,"F-A S-J"]
["IMDG_3206_11551/III/ALKALI METAL ALCOHOLATES, SELF-HEATING, CORROSIVE, N.O.S.","III",null,"F-A S-J"]
["IMDG_3208_12219/I/METALLIC SUBSTANCE, WATER- REACTIVE, N.O.S.","I",null,"F-G S-N"]
["IMDG_3208_12220/II/METALLIC SUBSTANCE, WATER- REACTIVE, N.O.S.","II",null,"F-G S-N"]
["IMDG_3208_12221/III/METALLIC SUBSTANCE, WATER- REACTIVE, N.O.S.","III",null,"F-G S-N"]
["IMDG_3209_12222/I/METALLIC SUBSTANCE, WATER-REACTIVE, SELF-HEATING, N.O.S.","I",null,"F-G S-N"]
["IMDG_3209_12223/II/METALLIC SUBSTANCE, WATER-REACTIVE, SELF-HEATING, N.O.S.","II",null,"F-G S-N"]
["IMDG_3209_12224/III/METALLIC SUBSTANCE, WATER-REACTIVE, SELF-HEATING, N.O.S.","III",null,"F-G S-N"]
["IMDG_3210_11558/II/CHLORATES, INORGANIC, AQUEOUS SOLUTION, N.O.S.","II",null,"F-H S-Q"]
["IMDG_3210_11559/III/CHLORATES, INORGANIC, AQUEOUS SOLUTION, N.O.S.","III",null,"F-H S-Q"]
["IMDG_3211_11560/II/PERCHLORATES, INORGANIC, AQUEOUS SOLUTION, N.O.S.","II",null,"F-H S-Q"]
["IMDG_3211_11561/III/PERCHLORATES, INORGANIC, AQUEOUS SOLUTION, N.O.S.","III",null,"F-H S-Q"]
["IMDG_3212_11562/II/HYPOCHLORITES, INORGANIC, N.O.S.","II",null,"F-H S-Q"]
["IMDG_3213_11563/II/BROMATES, INORGANIC, AQUEOUS SOLUTION, N.O.S.","II",null,"F-H S-Q"]
["IMDG_3213_11564/III/BROMATES, INORGANIC, AQUEOUS SOLUTION, N.O.S.","III",null,"F-H S-Q"]
["IMDG_3214_11565/II/PERMANGANATES, INORGANIC, AQUEOUS SOLUTION, N.O.S.","II",null,"F-H S-Q"]
["IMDG_3215_11566/III/PERSULPHATES, INORGANIC, N.O.S.","III",null,"F-A S-Q"]
["IMDG_3216_11567/III/PERSULPHATES, INORGANIC, AQUEOUS SOLUTION, N.O.S.","III",null,"F-A S-Q"]
["IMDG_3218_11568/II/NITRATES, INORGANIC, AQUEOUS SOLUTION, N.O.S.","II",null,"F-A S-Q"]
["IMDG_3218_11569/III/NITRATES, INORGANIC, AQUEOUS SOLUTION, N.O.S.","III",null,"F-A S-Q"]
["IMDG_3219_11570/II/NITRITES, INORGANIC, AQUEOUS SOLUTION, N.O.S.","II",null,"F-A S-Q"]
["IMDG_3219_11571/III/NITRITES, INORGANIC, AQUEOUS SOLUTION, N.O.S.","III",null,"F-A S-Q"]
["IMDG_3220_11572/ /PENTAFLUOROETHANE (REFRIGERANT GAS R 125)",null,null,"F-C S-V"]
["IMDG_3221_11573/ /SELF-REACTIVE LIQUID TYPE B",null,null,"F-J S-G"]
["IMDG_3222_11574/ /SELF-REACTIVE SOLID TYPE B",null,null,"F-J S-G"]
["IMDG_3223_11575/ /SELF-REACTIVE LIQUID TYPE C",null,null,"F-J S-G"]
["IMDG_3224_11576/ /SELF-REACTIVE SOLID TYPE C",null,null,"F-J S-G"]
["IMDG_3225_11577/ /SELF-REACTIVE LIQUID TYPE D",null,null,"F-J S-G"]
["IMDG_3226_11578/ /SELF-REACTIVE SOLID TYPE D",null,null,"F-J S-G"]
["IMDG_3227_11579/ /SELF-REACTIVE LIQUID TYPE E",null,null,"F-J S-G"]
["IMDG_3228_11580/ /SELF-REACTIVE SOLID TYPE E",null,null,"F-J S-G"]
["IMDG_3229_11581/ /SELF-REACTIVE LIQUID TYPE F",null,null,"F-J S-G"]
["IMDG_3230_11582/ /SELF-REACTIVE SOLID TYPE F",null,null,"F-J S-G"]
["IMDG_3231_11583/ /SELF-REACTIVE LIQUID TYPE B, TEMPERATURE CONTROLLED",null,null,"F-F S-K"]
["IMDG_3232_11584/ /SELF-REACTIVE SOLID TYPE B, TEMPERATURE CONTROLLED",null,null,"F-F S-K"]
["IMDG_3233_11585/ /SELF-REACTIVE LIQUID TYPE C, TEMPERATURE CONTROLLED",null,null,"F-F S-K"]
["IMDG_3234_11586/ /SELF-REACTIVE SOLID TYPE C, TEMPERATURE CONTROLLED",null,null,"F-F S-K"]
["IMDG_3235_11587/ /SELF-REACTIVE LIQUID TYPE D, TEMPERATURE CONTROLLED",null,null,"F-F S-K"]
["IMDG_3236_11588/ /SELF-REACTIVE SOLID TYPE D, TEMPERATURE CONTROLLED",null,null,"F-F S-K"]
["IMDG_3237_11589/ /SELF-REACTIVE LIQUID TYPE E, TEMPERATURE CONTROLLED",null,null,"F-F S-K"]
["IMDG_3238_11590/ /SELF-REACTIVE SOLID TYPE E, TEMPERATURE CONTROLLED",null,null,"F-F S-K"]
["IMDG_3239_11591/ /SELF-REACTIVE LIQUID TYPE F, TEMPERATURE CONTROLLED",null,null,"F-F S-K"]
["IMDG_3240_11592/ /SELF-REACTIVE SOLID TYPE F, TEMPERATURE CONTROLLED",null,null,"F-F S-K"]
["IMDG_3241_12225/III/2-BROMO-2-NITROPROPANE- 1,3-DIOL","III",null,"F-J S-G"]
["IMDG_3242_11594/II/AZODICARBONAMIDE","II",null,"F-J S-G"]
["IMDG_3243_11595/II/SOLIDS CONTAINING TOXIC LIQUID, N.O.S.","II",null,"F-A S-A"]
["IMDG_3244_11596/II/SOLIDS CONTAINING CORROSIVE LIQUID, N.O.S.","II",null,"F-A S-B"]
["IMDG_3245_11597/ /GENETICALLY MODIFIED MICROORGANISMS or GENETICALLY MODIFIED ORGANISMS",null,null,"F-A S-T"]
["IMDG_3246_11598/I/METHANESULPHONYL CHLORIDE","I",null,"F-A S-B"]
["IMDG_3247_11599/II/SODIUM PEROXOBORATE, ANHYDROUS","II",null,"F-A S-Q"]
["IMDG_3248_12226/II/MEDICINE, LIQUID, FLAMMABLE, TOXIC, N.O.S.","II",null,"F-E S-D"]
["IMDG_3248_12227/III/MEDICINE, LIQUID, FLAMMABLE, TOXIC, N.O.S.","III",null,"F-E S-D"]
["IMDG_3249_11602/II/MEDICINE, SOLID, TOXIC, N.O.S.","II",null,"F-A S-A"]
["IMDG_3249_11603/III/MEDICINE, SOLID, TOXIC, N.O.S.","III",null,"F-A S-A"]
["IMDG_3250_11604/II/CHLOROACETIC ACID, MOLTEN","II",null,"F-A S-B"]
["IMDG_3251_11605/III/ISOSORBIDE-5-MONONITRATE","III",null,"F-F S-G"]
["IMDG_3252_11606/ /DIFLUOROMETHANE (REFRIGERANT GAS R 32)",null,null,"F-D S-U"]
["IMDG_3253_11607/III/DISODIUM TRIOXOSILICATE","III",null,"F-A S-B"]
["IMDG_3254_11608/I/TRIBUTYLPHOSPHANE","I",null,"F-A S-M"]
["IMDG_3255_11609/I/tert-BUTYL HYPOCHLORITE","I",null,"F-A S-M"]
["IMDG_3256_12228/III/ELEVATED TEMPERATURE LIQUID, FLAMMABLE, N.O.S. with flashpoint above 60°C, at or above its flashpoint","III",null,"F-E S-D"]
["IMDG_3257_12229/III/ELEVATED TEMPERATURE LIQUID, N.O.S. at or above 100°C and below its flashpoint (including molten metals, molten salts, etc.)","III",null,"F-A S-P"]
["IMDG_3258_12230/III/ELEVATED TEMPERATURE SOLID, N.O.S. at or above 240°C","III",null,"F-A S-P"]
["IMDG_3259_11613/I/AMINES, SOLID, CORROSIVE, N.O.S. or POLYAMINES, SOLID, CORROSIVE, N.O.S.","I",null,"F-A S-B"]
["IMDG_3259_11614/II/AMINES, SOLID, CORROSIVE, N.O.S. or POLYAMINES, SOLID, CORROSIVE, N.O.S.","II",null,"F-A S-B"]
["IMDG_3259_11615/III/AMINES, SOLID, CORROSIVE, N.O.S. or POLYAMINES, SOLID, CORROSIVE, N.O.S.","III",null,"F-A S-B"]
["IMDG_3260_11616/I/CORROSIVE SOLID, ACIDIC, INORGANIC, N.O.S.","I",null,"F-A S-B"]
["IMDG_3260_11617/II/CORROSIVE SOLID, ACIDIC, INORGANIC, N.O.S.","II",null,"F-A S-B"]
["IMDG_3260_11618/III/CORROSIVE SOLID, ACIDIC, INORGANIC, N.O.S.","III",null,"F-A S-B"]
["IMDG_3261_11619/I/CORROSIVE SOLID, ACIDIC, ORGANIC, N.O.S.","I",null,"F-A S-B"]
["IMDG_3261_11620/II/CORROSIVE SOLID, ACIDIC, ORGANIC, N.O.S.","II",null,"F-A S-B"]
["IMDG_3261_11621/III/CORROSIVE SOLID, ACIDIC, ORGANIC, N.O.S.","III",null,"F-A S-B"]
["IMDG_3262_11622/I/CORROSIVE SOLID, BASIC, INORGANIC, N.O.S.","I",null,"F-A S-B"]
["IMDG_3262_11623/II/CORROSIVE SOLID, BASIC, INORGANIC, N.O.S.","II",null,"F-A S-B"]
["IMDG_3262_11624/III/CORROSIVE SOLID, BASIC, INORGANIC, N.O.S.","III",null,"F-A S-B"]
["IMDG_3263_12231/I/CORROSIVE SOLID, BASIC, ORGANIC, N.O.S.","I",null,"F-A S-B"]
["IMDG_3263_12232/II/CORROSIVE SOLID, BASIC, ORGANIC, N.O.S.","II",null,"F-A S-B"]
["IMDG_3263_12233/III/CORROSIVE SOLID, BASIC, ORGANIC, N.O.S.","III",null,"F-A S-B"]
["IMDG_3264_11628/I/CORROSIVE LIQUID, ACIDIC, INORGANIC, N.O.S.","I",null,"F-A S-B"]
["IMDG_3264_11629/II/CORROSIVE LIQUID, ACIDIC, INORGANIC, N.O.S.","II",null,"F-A S-B"]
["IMDG_3264_11630/III/CORROSIVE LIQUID, ACIDIC, INORGANIC, N.O.S.","III",null,"F-A S-B"]
["IMDG_3265_11631/I/CORROSIVE LIQUID, ACIDIC, ORGANIC, N.O.S.","I",null,"F-A S-B"]
["IMDG_3265_11632/II/CORROSIVE LIQUID, ACIDIC, ORGANIC, N.O.S.","II",null,"F-A S-B"]
["IMDG_3265_11633/III/CORROSIVE LIQUID, ACIDIC, ORGANIC, N.O.S.","III",null,"F-A S-B"]
["IMDG_3266_11634/I/CORROSIVE LIQUID, BASIC, INORGANIC, N.O.S.","I",null,"F-A S-B"]
["IMDG_3266_11635/II/CORROSIVE LIQUID, BASIC, INORGANIC, N.O.S.","II",null,"F-A S-B"]
["IMDG_3266_11636/III/CORROSIVE LIQUID, BASIC, INORGANIC, N.O.S.","III",null,"F-A S-B"]
["IMDG_3267_11637/I/CORROSIVE LIQUID, BASIC, ORGANIC, N.O.S.","I",null,"F-A S-B"]
["IMDG_3267_11638/II/CORROSIVE LIQUID, BASIC, ORGANIC, N.O.S.","II",null,"F-A S-B"]
["IMDG_3267_11639/III/CORROSIVE LIQUID, BASIC, ORGANIC, N.O.S.","III",null,"F-A S-B"]
["IMDG_3268_11640/ /SAFETY DEVICES, electrically initiated",null,null,"F-B S-X"]
["IMDG_3269_12234/II/POLYESTER RESIN KIT, liquid base material","II",null,"F-E S-D"]
["IMDG_3269_12235/III/POLYESTER RESIN KIT, liquid base material","III",null,"F-E S-D"]
["IMDG_3270_12236/II/NITROCELLULOSE MEMBRANE FILTERS with not more than 12.6% nitrogen, by dry mass","II",null,"F-A S-I"]
["IMDG_3271_11644/II/ETHERS, N.O.S.","II",null,"F-E S-D"]
["IMDG_3271_11645/III/ETHERS, N.O.S.","III",null,"F-E S-D"]
["IMDG_3272_11646/II/ESTERS, N.O.S.","II",null,"F-E S-D"]
["IMDG_3272_11647/III/ESTERS, N.O.S.","III",null,"F-E S-D"]
["IMDG_3273_11648/I/NITRILES, FLAMMABLE, TOXIC, N.O.S.","I",null,"F-E S-D"]
["IMDG_3273_11649/II/NITRILES, FLAMMABLE, TOXIC, N.O.S.","II",null,"F-E S-D"]
["IMDG_3274_11650/II/ALCOHOLATES SOLUTION, N.O.S. in alcohol","II",null,"F-E S-C"]
["IMDG_3275_11651/I/NITRILES, TOXIC, FLAMMABLE, N.O.S.","I",null,"F-E S-D"]
["IMDG_3275_11652/II/NITRILES, TOXIC, FLAMMABLE, N.O.S.","II",null,"F-E S-D"]
["IMDG_3276_11653/I/NITRILES, LIQUID, TOXIC, N.O.S.","I",null,"F-A S-A"]
["IMDG_3276_11654/II/NITRILES, LIQUID, TOXIC, N.O.S.","II",null,"F-A S-A"]
["IMDG_3276_11655/III/NITRILES, LIQUID, TOXIC, N.O.S.","III",null,"F-A S-A"]
["IMDG_3277_11656/II/CHLOROFORMATES, TOXIC, CORROSIVE, N.O.S.","II",null,"F-A S-B"]
["IMDG_3278_11657/I/ORGANOPHOSPHORUS COMPOUND, LIQUID, TOXIC, N.O.S.","I",null,"F-A S-A"]
["IMDG_3278_11658/II/ORGANOPHOSPHORUS COMPOUND, LIQUID, TOXIC, N.O.S.","II",null,"F-A S-A"]
["IMDG_3278_11659/III/ORGANOPHOSPHORUS COMPOUND, LIQUID, TOXIC, N.O.S.","III",null,"F-A S-A"]
["IMDG_3279_12237/I/ORGANOPHOSPHORUS COMPOUND, TOXIC, FLAMMABLE, N.O.S.","I",null,"F-E S-D"]
["IMDG_3279_12238/II/ORGANOPHOSPHORUS COMPOUND, TOXIC, FLAMMABLE, N.O.S.","II",null,"F-E S-D"]
["IMDG_3280_11662/I/ORGANOARSENIC COMPOUND, LIQUID, N.O.S.","I",null,"F-A S-A"]
["IMDG_3280_11663/II/ORGANOARSENIC COMPOUND, LIQUID, N.O.S.","II",null,"F-A S-A"]
["IMDG_3280_11664/III/ORGANOARSENIC COMPOUND, LIQUID, N.O.S.","III",null,"F-A S-A"]
["IMDG_3281_11665/I/METAL CARBONYLS, LIQUID, N.O.S.","I",null,"F-A S-A"]
["IMDG_3281_11666/II/METAL CARBONYLS, LIQUID, N.O.S.","II",null,"F-A S-A"]
["IMDG_3281_11667/III/METAL CARBONYLS, LIQUID, N.O.S.","III",null,"F-A S-A"]
["IMDG_3282_11668/I/ORGANOMETALLIC COMPOUND, LIQUID, TOXIC, N.O.S.","I",null,"F-A S-A"]
["IMDG_3282_11669/II/ORGANOMETALLIC COMPOUND, LIQUID, TOXIC, N.O.S.","II",null,"F-A S-A"]
["IMDG_3282_11670/III/ORGANOMETALLIC COMPOUND, LIQUID, TOXIC, N.O.S.","III",null,"F-A S-A"]
["IMDG_3283_11671/I/SELENIUM COMPOUND, SOLID, N.O.S.","I",null,"F-A S-A"]
["IMDG_3283_11672/II/SELENIUM COMPOUND, SOLID, N.O.S.","II",null,"F-A S-A"]
["IMDG_3283_11673/III/SELENIUM COMPOUND, SOLID, N.O.S.","III",null,"F-A S-A"]
["IMDG_3284_11674/I/TELLURIUM COMPOUND, N.O.S.","I",null,"F-A S-A"]
["IMDG_3284_11675/II/TELLURIUM COMPOUND, N.O.S.","II",null,"F-A S-A"]
["IMDG_3284_11676/III/TELLURIUM COMPOUND, N.O.S.","III",null,"F-A S-A"]
["IMDG_3285_11677/I/VANADIUM COMPOUND, N.O.S.","I",null,"F-A S-A"]
["IMDG_3285_11678/II/VANADIUM COMPOUND, N.O.S.","II",null,"F-A S-A"]
["IMDG_3285_11679/III/VANADIUM COMPOUND, N.O.S.","III",null,"F-A S-A"]
["IMDG_3286_11680/I/FLAMMABLE LIQUID, TOXIC, CORROSIVE, N.O.S.","I",null,"F-E S-C"]
["IMDG_3286_11681/II/FLAMMABLE LIQUID, TOXIC, CORROSIVE, N.O.S.","II",null,"F-E S-C"]
["IMDG_3287_11682/I/TOXIC LIQUID, INORGANIC, N.O.S.","I",null,"F-A S-A"]
["IMDG_3287_11683/II/TOXIC LIQUID, INORGANIC, N.O.S.","II",null,"F-A S-A"]
["IMDG_3287_11684/III/TOXIC LIQUID, INORGANIC, N.O.S.","III",null,"F-A S-A"]
["IMDG_3288_11685/I/TOXIC SOLID, INORGANIC, N.O.S.","I",null,"F-A S-A"]
["IMDG_3288_11686/II/TOXIC SOLID, INORGANIC, N.O.S.","II",null,"F-A S-A"]
["IMDG_3288_11687/III/TOXIC SOLID, INORGANIC, N.O.S.","III",null,"F-A S-A"]
["IMDG_3289_11688/I/TOXIC LIQUID, CORROSIVE, INORGANIC, N.O.S.","I",null,"F-A S-B"]
["IMDG_3289_11689/II/TOXIC LIQUID, CORROSIVE, INORGANIC, N.O.S.","II",null,"F-A S-B"]
["IMDG_3290_11690/I/TOXIC SOLID, CORROSIVE, INORGANIC, N.O.S.","I",null,"F-A S-B"]
["IMDG_3290_11691/II/TOXIC SOLID, CORROSIVE, INORGANIC, N.O.S.","II",null,"F-A S-B"]
["IMDG_3291_12239/II/CLINICAL WASTE, UNSPECIFIED, N.O.S. or (BIO) MEDICAL WASTE, N.O.S. or REGULATED MEDICAL WASTE, N.O.S.","II",null,"F-A S-T"]
["IMDG_3292_11693/ /BATTERIES, CONTAINING SODIUM or CELLS, CONTAINING SODIUM",null,null,"F-G S-P"]
["IMDG_3293_11694/III/HYDRAZINE, AQUEOUS SOLUTION with not more than 37% hydrazine, by mass","III",null,"F-A S-A"]
["IMDG_3294_11695/I/HYDROGEN CYANIDE, SOLUTION IN ALCOHOL with not more than 45% hydrogen cyanide","I","P","F-E S-D"]
["IMDG_3295_11696/I/HYDROCARBONS, LIQUID, N.O.S.","I",null,"F-E S-D"]
["IMDG_3295_11697/II/HYDROCARBONS, LIQUID, N.O.S.","II",null,"F-E S-D"]
["IMDG_3295_11698/III/HYDROCARBONS, LIQUID, N.O.S.","III",null,"F-E S-D"]
["IMDG_3296_11699/ /HEPTAFLUOROPROPANE (REFRIGERANT GAS R 227)",null,null,"F-C S-V"]
["IMDG_3297_12240/ /ETHYLENE OXIDE AND CHLOROTETRAFLUORO- ETHANE MIXTURE with not more than 8.8% ethylene oxide",null,null,"F-C S-V"]
["IMDG_3298_11701/ /ETHYLENE OXIDE AND PENTAFLUOROETHANE MIXTURE with not more than 7.9% ethylene oxide",null,null,"F-C S-V"]
["IMDG_3299_11702/ /ETHYLENE OXIDE AND TETRAFLUOROETHANE MIXTURE with not more than 5.6% ethylene oxide",null,null,"F-C S-V"]
["IMDG_3300_12241/ /ETHYLENE OXIDE AND CARBON DIOXIDE MIXTURE with more than 87% ethylene oxide",null,null,"F-D S-U"]
["IMDG_3301_11704/I/CORROSIVE LIQUID, SELF-HEATING, N.O.S.","I",null,"F-A S-J"]
["IMDG_3301_11705/II/CORROSIVE LIQUID, SELF-HEATING, N.O.S.","II",null,"F-A S-J"]
["IMDG_3302_12448/II/2-DIMETHYLAMINOETHYL ACRYLATE STABILIZED","II",null,"F-A S-A"]
["IMDG_3303_11707/ /COMPRESSED GAS, TOXIC, OXIDIZING, N.O.S.",null,null,"F-C S-W"]
["IMDG_3304_11708/ /COMPRESSED GAS, TOXIC, CORROSIVE, N.O.S.",null,null,"F-C S-U"]
["IMDG_3305_11709/ /COMPRESSED GAS, TOXIC, FLAMMABLE, CORROSIVE, N.O.S.",null,null,"F-D S-U"]
["IMDG_3306_11710/ /COMPRESSED GAS, TOXIC, OXIDIZING, CORROSIVE, N.O.S.",null,null,"F-C S-W"]
["IMDG_3307_12242/ /LIQUEFIED GAS, TOXIC, OXIDIZING, N.O.S.",null,null,"F-C S-W"]
["IMDG_3308_11712/ /LIQUEFIED GAS, TOXIC, CORROSIVE, N.O.S.",null,null,"F-C S-U"]
["IMDG_3309_12243/ /LIQUEFIED GAS, TOXIC, FLAMMABLE, CORROSIVE, N.O.S.",null,null,"F-D S-U"]
["IMDG_3310_12244/ /LIQUEFIED GAS, TOXIC, OXIDIZING, CORROSIVE, N.O.S.",null,null,"F-C S-W"]
["IMDG_3311_11715/ /GAS, REFRIGERATED LIQUID, OXIDIZING, N.O.S.",null,null,"F-C S-W"]
["IMDG_3312_11716/ /GAS, REFRIGERATED LIQUID, FLAMMABLE, N.O.S.",null,null,"F-D S-U"]
["IMDG_3313_11717/II/ORGANIC PIGMENTS, SELF-HEATING","II",null,"F-A S-J"]
["IMDG_3313_11718/III/ORGANIC PIGMENTS, SELF-HEATING","III",null,"F-A S-J"]
["IMDG_3314_11719/III/PLASTICS MOULDING COMPOUND in dough, sheet or extruded rope form, evolving flammable vapour","III",null,"F-A S-I"]
["IMDG_3315_11720/I/CHEMICAL SAMPLE, TOXIC","I",null,"F-A S-A"]
["IMDG_3316_12449/ /CHEMICAL KIT or FIRST AID KIT",null,null,"F-A S-P"]
["IMDG_3317_11722/I/2-AMINO-4,6-DINITROPHENOL, WETTED with not less than 20% water, by mass","I",null,"F-B S-J"]
["IMDG_3318_11723/ /AMMONIA SOLUTION relative density less than 0.880 at 15°C in water, with more than 50% ammonia",null,"P","F-C S-U"]
["IMDG_3319_11724/II/NITROGLYCERIN MIXTURE, DESENSITIZED, SOLID, N.O.S. with more than 2% but not more than 10% nitroglycerin, by mass","II",null,"F-B S-J"]
["IMDG_3320_11725/II/SODIUM BOROHYDRIDE AND SODIUM HYDROXIDE SOLUTION with not more than 12% sodium borohydride and not more than 40% sodium hydroxide, by mass","II",null,"F-A S-B"]
["IMDG_3320_11726/III/SODIUM BOROHYDRIDE AND SODIUM HYDROXIDE SOLUTION with not more than 12% sodium borohydride and not more than 40% sodium hydroxide, by mass","III",null,"F-A S-B"]
["IMDG_3321_12246/ /RADIOACTIVE MATERIAL, LOW SPECIFIC ACTIVITY (LSA-II), non fissile or fissile-excepted",null,null,"F-I S-S"]
["IMDG_3322_12247/ /RADIOACTIVE MATERIAL, LOW SPECIFIC ACTIVITY (LSA-III), non fissile or fissile-excepted",null,null,"F-I S-S"]
["IMDG_3323_11729/ /RADIOACTIVE MATERIAL, TYPE C PACKAGE, non fissile or fissile-excepted",null,null,"F-I S-S"]
["IMDG_3324_12248/ /RADIOACTIVE MATERIAL, LOW SPECIFIC ACTIVITY (LSA-II), FISSILE",null,null,"F-I S-S"]
["IMDG_3325_12249/ /RADIOACTIVE MATERIAL, LOW SPECIFIC ACTIVITY, (LSA-III), FISSILE",null,null,"F-I S-S"]
["IMDG_3326_11732/ /RADIOACTIVE MATERIAL, SURFACE CONTAMINATED OBJECTS (SCO-I or SCO-II), FISSILE",null,null,"F-I S-S"]
["IMDG_3327_12250/ /RADIOACTIVE MATERIAL, TYPE A PACKAGE, FISSILE, non-special form",null,null,"F-I S-S"]
["IMDG_3328_11734/ /RADIOACTIVE MATERIAL, TYPE B(U) PACKAGE, FISSILE",null,null,"F-I S-S"]
["IMDG_3329_11735/ /RADIOACTIVE MATERIAL, TYPE B(M) PACKAGE, FISSILE",null,null,"F-I S-S"]
["IMDG_3330_11736/ /RADIOACTIVE MATERIAL, TYPE C PACKAGE, FISSILE",null,null,"F-I S-S"]
["IMDG_3331_11737/ /RADIOACTIVE MATERIAL, TRANSPORTED UNDER SPECIAL ARRANGEMENT, FISSILE",null,null,"F-I S-S"]
["IMDG_3332_11738/ /RADIOACTIVE MATERIAL, TYPE A PACKAGE, SPECIAL FORM, non fissile or fissile-excepted",null,null,"F-I S-S"]
["IMDG_3333_11739/ /RADIOACTIVE MATERIAL, TYPE A PACKAGE, SPECIAL FORM, FISSILE",null,null,"F-I S-S"]
["IMDG_3334_11740/ /AVIATION REGULATED LIQUID, N.O.S."]
["IMDG_3335_11741/ /AVIATION REGULATED SOLID, N.O.S."]
["IMDG_3336_11742/I/MERCAPTANS, LIQUID, FLAMMABLE, N.O.S. or MERCAPTAN MIXTURE, LIQUID, FLAMMABLE, N.O.S.","I",null,"F-E S-D"]
["IMDG_3336_11743/II/MERCAPTANS, LIQUID, FLAMMABLE, N.O.S. or MERCAPTAN MIXTURE, LIQUID, FLAMMABLE, N.O.S.","II",null,"F-E S-D"]
["IMDG_3336_11744/III/MERCAPTANS, LIQUID, FLAMMABLE, N.O.S. or MERCAPTAN MIXTURE, LIQUID, FLAMMABLE, N.O.S.","III",null,"F-E S-D"]
["IMDG_3337_11745/ /REFRIGERANT GAS R 404A",null,null,"F-C S-V"]
["IMDG_3338_11746/ /REFRIGERANT GAS R 407A",null,null,"F-C S-V"]
["IMDG_3339_11747/ /REFRIGERANT GAS R 407B",null,null,"F-C S-V"]
["IMDG_3340_11748/ /REFRIGERANT GAS R 407C",null,null,"F-C S-V"]
["IMDG_3341_11749/II/THIOUREA DIOXIDE","II",null,"F-A S-J"]
["IMDG_3341_11750/III/THIOUREA DIOXIDE","III",null,"F-A S-J"]
["IMDG_3342_11751/II/XANTHATES","II",null,"F-A S-J"]
["IMDG_3342_11752/III/XANTHATES","III",null,"F-A S-J"]
["IMDG_3343_11753/ /NITROGLYCERIN MIXTURE, DESENSITIZED, LIQUID, FLAMMABLE, N.O.S. with not more than 30% nitroglycerin, by mass",null,null,"F-E S-Y"]
["IMDG_3344_11754/II/PENTAERYTHRITE TETRANITRATE (PENTAERYTHRITOL TETRANITRATE; PETN) MIXTURE, DESENSITIZED, SOLID, N.O.S. with more than 10% but not more than 20% PETN, by mass","II",null,"F-B S-J"]
["IMDG_3345_11755/I/PHENOXYACETIC ACID DERIVATIVE PESTICIDE, SOLID, TOXIC","I",null,"F-A S-A"]
["IMDG_3345_11756/II/PHENOXYACETIC ACID DERIVATIVE PESTICIDE, SOLID, TOXIC","II",null,"F-A S-A"]
["IMDG_3345_11757/III/PHENOXYACETIC ACID DERIVATIVE PESTICIDE, SOLID, TOXIC","III",null,"F-A S-A"]
["IMDG_3346_11758/I/PHENOXYACETIC ACID DERIVATIVE PESTICIDE, LIQUID, FLAMMABLE, TOXIC flashpoint less than 23°C","I",null,"F-E S-D"]
["IMDG_3346_11759/II/PHENOXYACETIC ACID DERIVATIVE PESTICIDE, LIQUID, FLAMMABLE, TOXIC flashpoint less than 23°C","II",null,"F-E S-D"]
["IMDG_3347_12251/I/PHENOXYACETIC ACID DERIVATIVE PESTICIDE, LIQUID, TOXIC, FLAMMABLE, flashpoint not less than 23°C","I",null,"F-E S-D"]
["IMDG_3347_12252/II/PHENOXYACETIC ACID DERIVATIVE PESTICIDE, LIQUID, TOXIC, FLAMMABLE, flashpoint not less than 23°C","II",null,"F-E S-D"]
["IMDG_3347_12253/III/PHENOXYACETIC ACID DERIVATIVE PESTICIDE, LIQUID, TOXIC, FLAMMABLE, flashpoint not less than 23°C","III",null,"F-E S-D"]
["IMDG_3348_11763/I/PHENOXYACETIC ACID DERIVATIVE PESTICIDE, LIQUID, TOXIC","I",null,"F-A S-A"]
["IMDG_3348_11764/II/PHENOXYACETIC ACID DERIVATIVE PESTICIDE, LIQUID, TOXIC","II",null,"F-A S-A"]
["IMDG_3348_11765/III/PHENOXYACETIC ACID DERIVATIVE PESTICIDE, LIQUID, TOXIC","III",null,"F-A S-A"]
["IMDG_3349_11766/I/PYRETHROID PESTICIDE, SOLID, TOXIC","I",null,"F-A S-A"]
["IMDG_3349_11767/II/PYRETHROID PESTICIDE, SOLID, TOXIC","II",null,"F-A S-A"]
["IMDG_3349_11768/III/PYRETHROID PESTICIDE, SOLID, TOXIC","III",null,"F-A S-A"]
["IMDG_3350_12254/I/PYRETHROID PESTICIDE, LIQUID, FLAMMABLE, TOXIC, flashpoint less than 23°C","I",null,"F-E S-D"]
["IMDG_3350_12255/II/PYRETHROID PESTICIDE, LIQUID, FLAMMABLE, TOXIC, flashpoint less than 23°C","II",null,"F-E S-D"]
["IMDG_3351_11771/I/PYRETHROID PESTICIDE, LIQUID, TOXIC, FLAMMABLE, flashpoint not less than 23°C","I",null,"F-E S-D"]
["IMDG_3351_11772/II/PYRETHROID PESTICIDE, LIQUID, TOXIC, FLAMMABLE, flashpoint not less than 23°C","II",null,"F-E S-D"]
["IMDG_3351_11773/III/PYRETHROID PESTICIDE, LIQUID, TOXIC, FLAMMABLE, flashpoint not less than 23°C","III",null,"F-E S-D"]
["IMDG_3352_11774/I/PYRETHROID PESTICIDE, LIQUID, TOXIC","I",null,"F-A S-A"]
["IMDG_3352_11775/II/PYRETHROID PESTICIDE, LIQUID, TOXIC","II",null,"F-A S-A"]
["IMDG_3352_11776/III/PYRETHROID PESTICIDE, LIQUID, TOXIC","III",null,"F-A S-A"]
["IMDG_3354_11777/ /INSECTICIDE GAS, FLAMMABLE, N.O.S.",null,null,"F-D S-U"]
["IMDG_3355_11778/ /INSECTICIDE GAS, TOXIC, FLAMMABLE, N.O.S.",null,null,"F-D S-U"]
["IMDG_3356_11779/ /OXYGEN GENERATOR, CHEMICAL",null,null,"F-H S-Q"]
["IMDG_3357_12256/II/NITROGLYCERIN MIXTURE, DESENSITIZED, LIQUID, N.O.S. with not more than 30% nitroglycerin, by mass","II",null,"F-E S-Y"]
["IMDG_3358_12257/ /REFRIGERATING MACHINES containing flammable, non-toxic, liquefied gas",null,null,"F-D S-U"]
["IMDG_3359_11782/ /FUMIGATED CARGO TRANSPORT UNIT",null,null,"F-A S-D"]
["IMDG_3360_11783/ /FIBRES, VEGETABLE, DRY",null,null,"F-A S-I"]
["IMDG_3361_11784/II/CHLOROSILANES, TOXIC, CORROSIVE, N.O.S.","II",null,"F-A S-B"]
["IMDG_3362_11785/II/CHLOROSILANES, TOXIC, CORROSIVE, FLAMMABLE, N.O.S.","II",null,"F-E S-C"]
["IMDG_3363_11786/ /DANGEROUS GOODS IN MACHINERY or DANGEROUS GOODS IN APPARATUS",null,null,"F-A S-P"]
["IMDG_3364_11787/I/TRINITROPHENOL (PICRIC ACID), WETTED with not less than 10% water, by mass","I",null,"F-B S-J"]
["IMDG_3365_12258/I/TRINITROCHLOROBENZENE (PICRYL CHLORIDE), WETTED with not less than 10% water, by mass","I",null,"F-B S-J"]
["IMDG_3366_11789/I/TRINITROTOLUENE (TNT), WETTED with not less than 10% water, by mass","I",null,"F-B S-J"]
["IMDG_3367_11790/I/TRINITROBENZENE, WETTED with not less than 10% water, by mass","I",null,"F-B S-J"]
["IMDG_3368_11791/I/TRINITROBENZOIC ACID, WETTED with not less than 10% water, by mass","I",null,"F-B S-J"]
["IMDG_3369_12259/I/SODIUM DINITRO-o- CRESOLATE, WETTED with not less than 10% water, by mass","I","P","F-B S-J"]
["IMDG_3370_11793/I/UREA NITRATE, WETTED with not less than 10% water, by mass","I",null,"F-B S-J"]
["IMDG_3371_11794/II/2-METHYLBUTANAL","II",null,"F-E S-D"]
["IMDG_3373_11795/ /BIOLOGICAL SUBSTANCE, CATEGORY B",null,null,"F-A S-T"]
["IMDG_3374_11796/ /ACETYLENE, SOLVENT FREE",null,null,"F-D S-U"]
["IMDG_3375_12260/II/AMMONIUM NITRATE EMULSION or SUSPENSION or GEL intermediate for blasting explosives","II",null,"F-H S-Q"]
["IMDG_3376_11798/I/4-NITROPHENYLHYDRAZINE, with not less than 30% water, by mass","I",null,"F-B S-J"]
["IMDG_3377_11799/III/SODIUM PERBORATE MONOHYDRATE","III",null,"F-A S-Q"]
["IMDG_3378_11800/II/SODIUM CARBONATE PEROXYHYDRATE","II",null,"F-A S-Q"]
["IMDG_3378_11801/III/SODIUM CARBONATE PEROXYHYDRATE","III",null,"F-A S-Q"]
["IMDG_3379_11802/I/DESENSITIZED EXPLOSIVE, LIQUID, N.O.S.","I",null,"F-E S-Y"]
["IMDG_3380_11803/I/DESENSITIZED EXPLOSIVE, SOLID, N.O.S.","I",null,"F-B S-J"]
["IMDG_3381_12261/I/TOXIC BY INHALATION LIQUID, N.O.S. with an LC50 lower than or equal to 200 mL/m3 and saturated vapour concentration greater than or equal to 500LC50","I",null,"F-A S-A"]
["IMDG_3382_12262/I/TOXIC BY INHALATION LIQUID, N.O.S. with an LC50 lower than or equal to 1000 mL/m3 and saturated vapour concentration greater than or equal to 10LC50","I",null,"F-A S-A"]
["IMDG_3383_12263/I/TOXIC BY INHALATION LIQUID, FLAMMABLE, N.O.S. with an LC50 lower than or equal to 200 mL/m3 and saturated vapour concentration greater than or equal to 500LC50","I",null,"F-E S-D"]
["IMDG_3384_12264/I/TOXIC BY INHALATION LIQUID, FLAMMABLE, N.O.S. with an LC50 lower than or equal to 1000 mL/m3 and saturated vapour concentration greater than or equal to 10LC50","I",null,"F-E S-D"]
["IMDG_3385_12265/I/TOXIC BY INHALATION LIQUID, WATER-REACTIVE, N.O.S. with an LC50 lower than or equal to 200 mL/m3 and saturated vapour concentration greater than or equal to 500LC50","I",null,"F-G S-N"]
["IMDG_3386_12266/I/TOXIC BY INHALATION LIQUID, WATER-REACTIVE, N.O.S. with an LC50 lower than or equal to 1000 mL/m3 and saturated vapour concentration greater than or equal to 10LC50","I",null,"F-G S-N"]
["IMDG_3387_12267/I/TOXIC BY INHALATION LIQUID, OXIDIZING, N.O.S. with an LC50 lower than or equal to 200 mL/m3 and saturated vapour concentration greater than or equal to 500LC50","I",null,"F-A S-Q"]
["IMDG_3388_12268/I/TOXIC BY INHALATION LIQUID, OXIDIZING, N.O.S. with an LC50 lower than or equal to 1000 mL/m3 and saturated vapour concentration greater than or equal to 10LC50","I",null,"F-A S-Q"]
["IMDG_3389_12269/I/TOXIC BY INHALATION LIQUID, CORROSIVE, N.O.S. with an LC50 lower than or equal to 200 mL/m3 and saturated vapour concentration greater than or equal to 500LC50","I",null,"F-A S-B"]
["IMDG_3390_12270/I/TOXIC BY INHALATION LIQUID, CORROSIVE, N.O.S. with an LC50 lower than or equal to 1000 mL/m3 and saturated vapour concentration greater than or equal to 10LC50","I",null,"F-A S-B"]
["IMDG_3391_11814/I/ORGANOMETALLIC SUBSTANCE, SOLID, PYROPHORIC","I",null,"F-G S-M"]
["IMDG_3392_11815/I/ORGANOMETALLIC SUBSTANCE, LIQUID, PYROPHORIC","I",null,"F-G S-M"]
["IMDG_3393_11816/I/ORGANOMETALLIC SUBSTANCE, SOLID, PYROPHORIC, WATER-REACTIVE","I",null,"F-G S-M"]
["IMDG_3394_11817/I/ORGANOMETALLIC SUBSTANCE, LIQUID, PYROPHORIC, WATER-REACTIVE","I",null,"F-G S-M"]
["IMDG_3395_11818/I/ORGANOMETALLIC SUBSTANCE, SOLID, WATER-REACTIVE","I",null,"F-G S-N"]
["IMDG_3395_11819/II/ORGANOMETALLIC SUBSTANCE, SOLID, WATER-REACTIVE","II",null,"F-G S-N"]
["IMDG_3395_11820/III/ORGANOMETALLIC SUBSTANCE, SOLID, WATER-REACTIVE","III",null,"F-G S-N"]
["IMDG_3396_12271/I/ORGANOMETALLIC SUBSTANCE, SOLID, WATER-REACTIVE, FLAMMABLE","I",null,"F-G S-N"]
["IMDG_3396_12272/II/ORGANOMETALLIC SUBSTANCE, SOLID, WATER-REACTIVE, FLAMMABLE","II",null,"F-G S-N"]
["IMDG_3396_12273/III/ORGANOMETALLIC SUBSTANCE, SOLID, WATER-REACTIVE, FLAMMABLE","III",null,"F-G S-N"]
["IMDG_3397_12274/I/ORGANOMETALLIC SUBSTANCE, SOLID, WATER-REACTIVE, SELF-HEATING","I",null,"F-G S-N"]
["IMDG_3397_12275/II/ORGANOMETALLIC SUBSTANCE, SOLID, WATER-REACTIVE, SELF-HEATING","II",null,"F-G S-N"]
["IMDG_3397_12276/III/ORGANOMETALLIC SUBSTANCE, SOLID, WATER-REACTIVE, SELF-HEATING","III",null,"F-G S-N"]
["IMDG_3398_12277/I/ORGANOMETALLIC SUBSTANCE, LIQUID, WATER-REACTIVE","I",null,"F-G S-N"]
["IMDG_3398_12278/II/ORGANOMETALLIC SUBSTANCE, LIQUID, WATER-REACTIVE","II",null,"F-G S-N"]
["IMDG_3398_12279/III/ORGANOMETALLIC SUBSTANCE, LIQUID, WATER-REACTIVE","III",null,"F-G S-N"]
["IMDG_3399_12280/I/ORGANOMETALLIC SUBSTANCE, LIQUID, WATER-REACTIVE, FLAMMABLE","I",null,"F-G S-N"]
["IMDG_3399_12281/II/ORGANOMETALLIC SUBSTANCE, LIQUID, WATER-REACTIVE, FLAMMABLE","II",null,"F-G S-N"]
["IMDG_3399_12282/III/ORGANOMETALLIC SUBSTANCE, LIQUID, WATER-REACTIVE, FLAMMABLE","III",null,"F-G S-N"]
["IMDG_3400_12283/II/ORGANOMETALLIC SUBSTANCE, SOLID, SELF-HEATING","II",null,"F-A S-J"]
["IMDG_3400_12284/III/ORGANOMETALLIC SUBSTANCE, SOLID, SELF-HEATING","III",null,"F-A S-J"]
["IMDG_3401_11835/I/ALKALI METAL AMALGAM, SOLID","I",null,"F-G S-N"]
["IMDG_3402_11836/I/ALKALINE EARTH METAL AMALGAM, SOLID","I",null,"F-G S-N"]
["IMDG_3403_11837/I/POTASSIUM METAL ALLOYS, SOLID","I",null,"F-G S-L"]
["IMDG_3404_11838/I/POTASSIUM SODIUM ALLOYS, SOLID","I",null,"F-G S-L"]
["IMDG_3405_11839/II/BARIUM CHLORATE SOLUTION","II",null,"F-H S-Q"]
["IMDG_3405_11840/III/BARIUM CHLORATE SOLUTION","III",null,"F-H S-Q"]
["IMDG_3406_11841/II/BARIUM PERCHLORATE SOLUTION","II",null,"F-H S-Q"]
["IMDG_3406_11842/III/BARIUM PERCHLORATE SOLUTION","III",null,"F-H S-Q"]
["IMDG_3407_11843/II/CHLORATE AND MAGNESIUM CHLORIDE MIXTURE SOLUTION","II",null,"F-H S-Q"]
["IMDG_3407_11844/III/CHLORATE AND MAGNESIUM CHLORIDE MIXTURE SOLUTION","III",null,"F-H S-Q"]
["IMDG_3408_11845/II/LEAD PERCHLORATE SOLUTION","II","P","F-H S-Q"]
["IMDG_3408_11846/III/LEAD PERCHLORATE SOLUTION","III","P","F-H S-Q"]
["IMDG_3409_11847/II/CHLORONITROBENZENES, LIQUID","II",null,"F-A S-A"]
["IMDG_3410_11848/III/4-CHLORO-o-TOLUIDINE HYDROCHLORIDE SOLUTION","III",null,"F-A S-A"]
["IMDG_3411_11849/II/beta-NAPHTHYLAMINE SOLUTION","II",null,"F-A S-A"]
["IMDG_3411_11850/III/beta-NAPHTHYLAMINE SOLUTION","III",null,"F-A S-A"]
["IMDG_3412_11851/II/FORMIC ACID with not less than 10% but not more than 85% acid by mass","II",null,"F-A S-B"]
["IMDG_3412_11852/III/FORMIC ACID with not less than 5% but less than 10% acid by mass","III",null,"F-A S-B"]
["IMDG_3413_11853/I/POTASSIUM CYANIDE SOLUTION","I","P","F-A S-A"]
["IMDG_3413_11854/II/POTASSIUM CYANIDE SOLUTION","II","P","F-A S-A"]
["IMDG_3413_11855/III/POTASSIUM CYANIDE SOLUTION","III","P","F-A S-A"]
["IMDG_3414_11856/I/SODIUM CYANIDE SOLUTION","I","P","F-A S-A"]
["IMDG_3414_11857/II/SODIUM CYANIDE SOLUTION","II","P","F-A S-A"]
["IMDG_3414_11858/III/SODIUM CYANIDE SOLUTION","III","P","F-A S-A"]
["IMDG_3415_11859/III/SODIUM FLUORIDE SOLUTION","III",null,"F-A S-A"]
["IMDG_3416_11860/II/CHLOROACETOPHENONE, LIQUID","II",null,"F-A S-A"]
["IMDG_3417_11861/II/XYLYL BROMIDE, SOLID","II",null,"F-A S-G"]
["IMDG_3418_11862/III/2,4-TOLUYLENEDIAMINE SOLUTION","III",null,"F-A S-A"]
["IMDG_3419_11863/II/BORON TRIFLUORIDE ACETIC ACID COMPLEX, SOLID","II",null,"F-A S-B"]
["IMDG_3420_11864/II/BORON TRIFLUORIDE PROPIONIC ACID COMPLEX, SOLID","II",null,"F-A S-B"]
["IMDG_3421_11865/II/POTASSIUM HYDROGEN DIFLUORIDE SOLUTION","II",null,"F-A S-B"]
["IMDG_3421_11866/III/POTASSIUM HYDROGEN DIFLUORIDE SOLUTION","III",null,"F-A S-B"]
["IMDG_3422_11867/III/POTASSIUM FLUORIDE SOLUTION","III",null,"F-A S-A"]
["IMDG_3423_11868/II/TETRAMETHYLAMMONIUM HYDROXIDE, SOLID","II",null,"F-A S-B"]
["IMDG_3424_12285/II/AMMONIUM DINITRO-o- CRESOLATE SOLUTION","II","P","F-A S-A"]
["IMDG_3424_12286/III/AMMONIUM DINITRO-o- CRESOLATE SOLUTION","III","P","F-A S-A"]
["IMDG_3425_11871/II/BROMOACETIC ACID, SOLID","II",null,"F-A S-B"]
["IMDG_3426_11872/III/ACRYLAMIDE SOLUTION","III",null,"F-A S-A"]
["IMDG_3427_11873/III/CHLOROBENZYL CHLORIDES, SOLID","III","P","F-A S-A"]
["IMDG_3428_12287/II/3-CHLORO-4-METHYLPHENYL ISOCYANATE, SOLID","II",null,"F-A S-A"]
["IMDG_3429_11875/III/CHLOROTOLUIDINES, LIQUID","III",null,"F-A S-A"]
["IMDG_3430_11876/II/XYLENOLS, LIQUID","II",null,"F-A S-A"]
["IMDG_3431_11877/II/NITROBENZOTRIFLUORIDES, SOLID","II","P","F-A S-A"]
["IMDG_3432_11878/II/POLYCHLORINATED BIPHENYLS, SOLID","II","P","F-A S-A"]
["IMDG_3434_11879/III/NITROCRESOLS, LIQUID","III",null,"F-A S-A"]
["IMDG_3436_11880/II/HEXAFLUOROACETONE HYDRATE, SOLID","II",null,"F-A S-A"]
["IMDG_3437_11881/II/CHLOROCRESOLS, SOLID","II",null,"F-A S-A"]
["IMDG_3438_11882/III/alpha-METHYLBENZYL ALCOHOL, SOLID","III",null,"F-A S-A"]
["IMDG_3439_11883/I/NITRILES, SOLID, TOXIC, N.O.S.","I",null,"F-A S-A"]
["IMDG_3439_11884/II/NITRILES, SOLID, TOXIC, N.O.S.","II",null,"F-A S-A"]
["IMDG_3439_11885/III/NITRILES, SOLID, TOXIC, N.O.S.","III",null,"F-A S-A"]
["IMDG_3440_11886/I/SELENIUM COMPOUND, LIQUID, N.O.S.","I",null,"F-A S-A"]
["IMDG_3440_11887/II/SELENIUM COMPOUND, LIQUID, N.O.S.","II",null,"F-A S-A"]
["IMDG_3440_11888/III/SELENIUM COMPOUND, LIQUID, N.O.S.","III",null,"F-A S-A"]
["IMDG_3441_11889/II/CHLORODINITROBENZENES, SOLID","II","P","F-A S-A"]
["IMDG_3442_11890/II/DICHLOROANILINES, SOLID","II","P","F-A S-A"]
["IMDG_3443_11891/II/DINITROBENZENES, SOLID","II",null,"F-A S-A"]
["IMDG_3444_11892/II/NICOTINE HYDROCHLORIDE, SOLID","II",null,"F-A S-A"]
["IMDG_3445_11893/II/NICOTINE SULPHATE, SOLID","II",null,"F-A S-A"]
["IMDG_3446_11894/II/NITROTOLUENES, SOLID","II",null,"F-A S-A"]
["IMDG_3447_11895/II/NITROXYLENES, SOLID","II",null,"F-A S-A"]
["IMDG_3448_11896/I/TEAR GAS SUBSTANCE, SOLID, N.O.S.","I",null,"F-A S-A"]
["IMDG_3448_11897/II/TEAR GAS SUBSTANCE, SOLID, N.O.S.","II",null,"F-A S-A"]
["IMDG_3449_11898/I/BROMOBENZYL CYANIDES, SOLID","I",null,"F-A S-A"]
["IMDG_3450_11899/I/DIPHENYLCHLOROARSINE, SOLID","I","P","F-A S-A"]
["IMDG_3451_11900/II/TOLUIDINES, SOLID","II","P","F-A S-A"]
["IMDG_3452_11901/II/XYLIDINES, SOLID","II",null,"F-A S-A"]
["IMDG_3453_11902/III/PHOSPHORIC ACID, SOLID","III",null,"F-A S-B"]
["IMDG_3454_11903/II/DINITROTOLUENES, SOLID","II","P","F-A S-A"]
["IMDG_3455_11904/II/CRESOLS, SOLID","II",null,"F-A S-B"]
["IMDG_3456_11905/II/NITROSYLSULPHURIC ACID, SOLID","II",null,"F-A S-B"]
["IMDG_3457_11906/III/CHLORONITROTOLUENES, SOLID","III","P","F-A S-A"]
["IMDG_3458_11907/III/NITROANISOLES, SOLID","III",null,"F-A S-A"]
["IMDG_3459_11908/III/NITROBROMOBENZENES, SOLID","III",null,"F-A S-A"]
["IMDG_3460_11909/III/N-ETHYLBENZYLTOLUIDINES, SOLID","III",null,"F-A S-A"]
["IMDG_3462_11910/I/TOXINS, EXTRACTED FROM LIVING SOURCES, SOLID, N.O.S.","I",null,"F-A S-A"]
["IMDG_3462_11911/II/TOXINS, EXTRACTED FROM LIVING SOURCES, SOLID, N.O.S.","II",null,"F-A S-A"]
["IMDG_3462_11912/III/TOXINS, EXTRACTED FROM LIVING SOURCES, SOLID, N.O.S.","III",null,"F-A S-A"]
["IMDG_3463_12288/II/PROPIONIC ACID, with not less than 90% acid by mass","II",null,"F-E S-C"]
["IMDG_3464_11914/I/ORGANOPHOSPHORUS COMPOUND, SOLID, TOXIC, N.O.S.","I",null,"F-A S-A"]
["IMDG_3464_11915/II/ORGANOPHOSPHORUS COMPOUND, SOLID, TOXIC, N.O.S.","II",null,"F-A S-A"]
["IMDG_3464_11916/III/ORGANOPHOSPHORUS COMPOUND, SOLID, TOXIC, N.O.S.","III",null,"F-A S-A"]
["IMDG_3465_11917/I/ORGANOARSENIC COMPOUND, SOLID, N.O.S.","I",null,"F-A S-A"]
["IMDG_3465_11918/II/ORGANOARSENIC COMPOUND, SOLID, N.O.S.","II",null,"F-A S-A"]
["IMDG_3465_11919/III/ORGANOARSENIC COMPOUND, SOLID, N.O.S.","III",null,"F-A S-A"]
["IMDG_3466_11920/I/METAL CARBONYLS, SOLID, N.O.S.","I",null,"F-A S-A"]
["IMDG_3466_11921/II/METAL CARBONYLS, SOLID, N.O.S.","II",null,"F-A S-A"]
["IMDG_3466_11922/III/METAL CARBONYLS, SOLID, N.O.S.","III",null,"F-A S-A"]
["IMDG_3467_11923/I/ORGANOMETALLIC COMPOUND, SOLID, TOXIC, N.O.S.","I",null,"F-A S-A"]
["IMDG_3467_11924/II/ORGANOMETALLIC COMPOUND, SOLID, TOXIC, N.O.S.","II",null,"F-A S-A"]
["IMDG_3467_11925/III/ORGANOMETALLIC COMPOUND, SOLID, TOXIC, N.O.S.","III",null,"F-A S-A"]
["IMDG_3468_11926/ /HYDROGEN IN A METAL HYDRIDE STORAGE SYSTEM or HYDROGEN IN A METAL HYDRIDE STORAGE SYSTEM CONTAINED IN EQUIPMENT or HYDROGEN IN A METAL HYDRIDE STORAGE SYSTEM PACKED WITH EQUIPMENT",null,null,"F-D S-U"]
["IMDG_3469_11927/I/PAINT, FLAMMABLE, CORROSIVE (including paint, lacquer, enamel, stain, shellac, varnish, polish, liquid filler and liquid lacquer base) or PAINT RELATED MATERIAL, FLAMMABLE, CORROSIVE (including paint thinning or reducing compound)","I",null,"F-E S-C"]
["IMDG_3469_11928/II/PAINT, FLAMMABLE, CORROSIVE (including paint, lacquer, enamel, stain, shellac, varnish, polish, liquid filler and liquid lacquer base) or PAINT RELATED MATERIAL, FLAMMABLE, CORROSIVE (including paint thinning or reducing compound)","II",null,"F-E S-C"]
["IMDG_3469_11929/III/PAINT, FLAMMABLE, CORROSIVE (including paint, lacquer, enamel, stain, shellac, varnish, polish, liquid filler and liquid lacquer base) or PAINT RELATED MATERIAL, FLAMMABLE, CORROSIVE (including paint thinning or reducing compound)","III",null,"F-E S-C"]
["IMDG_3470_12289/II/PAINT, CORROSIVE, FLAMMABLE (including paint, lacquer, enamel, stain, shellac, varnish, polish, liquid filler and liquid lacquer base) or PAINT RELATED MATERIAL, CORROSIVE, FLAMMABLE (including paint thinning or reducing compound)","II",null,"F-E S-C"]
["IMDG_3471_11931/II/HYDROGENDIFLUORIDES SOLUTION, N.O.S.","II",null,"F-A S-B"]
["IMDG_3471_11932/III/HYDROGENDIFLUORIDES SOLUTION, N.O.S.","III",null,"F-A S-B"]
["IMDG_3472_11933/III/CROTONIC ACID, LIQUID","III",null,"F-A S-B"]
["IMDG_3473_11934/ /FUEL CELL CARTRIDGES or FUEL CELL CARTRIDGES CONTAINED IN EQUIPMENT or FUEL CELL CARTRIDGES PACKED WITH EQUIPMENT containing flammable liquids",null,null,"F-E S-D"]
["IMDG_3474_11935/I/1-HYDROXYBENZOTRIAZOLE MONOHYDRATE","I",null,"F-B S-J"]
["IMDG_3475_11936/II/ETHANOL AND GASOLINE MIXTURE or ETHANOL AND MOTOR SPIRIT MIXTURE or ETHANOL AND PETROL MIXTURE, with more than 10% ethanol","II",null,"F-E S-E"]
["IMDG_3476_11937/ /FUEL CELL CARTRIDGES or FUEL CELL CARTRIDGES CONTAINED IN EQUIPMENT or FUEL CELL CARTRIDGES PACKED WITH EQUIPMENT, containing water-reactive substances",null,null,"F-G S-P"]
["IMDG_3477_11938/ /FUEL CELL CARTRIDGES or FUEL CELL CARTRIDGES CONTAINED IN EQUIPMENT or FUEL CELL CARTRIDGES PACKED WITH EQUIPMENT, containing corrosive substances",null,null,"F-A S-B"]
["IMDG_3478_11939/ /FUEL CELL CARTRIDGES or FUEL CELL CARTRIDGES CONTAINED IN EQUIPMENT or FUEL CELL CARTRIDGES PACKED WITH EQUIPMENT, containing liquefied flammable gas",null,null,"F-D S-U"]
["IMDG_3479_11940/ /FUEL CELL CARTRIDGES or FUEL CELL CARTRIDGES CONTAINED IN EQUIPMENT or FUEL CELL CARTRIDGES PACKED WITH EQUIPMENT, containing hydrogen in metal hydride",null,null,"F-D S-U"]
["IMDG_3480_11941/ /LITHIUM ION BATTERIES (including lithium ion polymer batteries)",null,null,"F-A S-I"]
["IMDG_3481_11942/ /LITHIUM ION BATTERIES CONTAINED IN EQUIPMENT or LITHIUM ION BATTERIES PACKED WITH EQUIPMENT (including lithium ion polymer batteries)",null,null,"F-A S-I"]
["IMDG_3482_11943/I/ALKALI METAL DISPERSION, FLAMMABLE or ALKALINE EARTH METAL DISPERSION, FLAMMABLE","I",null,"F-G S-N"]
["IMDG_3483_11944/I/MOTOR FUEL ANTI-KNOCK MIXTURE, FLAMMABLE","I","P","F-E S-D"]
["IMDG_3484_12290/I/HYDRAZINE AQUEOUS SOLUTION, FLAMMABLE with more than 37% hydrazine, by mass","I",null,"F-E S-C"]
["IMDG_3485_11946/II/CALCIUM HYPOCHLORITE, DRY, CORROSIVE or CALCIUM HYPOCHLORITE MIXTURE, DRY, CORROSIVE with more than 39% available chlorine (8.8% available oxygen)","II","P","F-H S-Q"]
["IMDG_3486_11947/III/CALCIUM HYPOCHLORITE MIXTURE, DRY, CORROSIVE with more than 10% but not more than 39% available chlorine","III","P","F-H S-Q"]
["IMDG_3487_12291/II/CALCIUM HYPOCHLORITE, HYDRATED, CORROSIVE or CALCIUM HYPOCHLORITE, HYDRATED MIXTURE, CORROSIVE with not less than 5.5% but not more than 16% water","II","P","F-H S-Q"]
["IMDG_3487_12292/III/CALCIUM HYPOCHLORITE, HYDRATED, CORROSIVE or CALCIUM HYPOCHLORITE, HYDRATED MIXTURE, CORROSIVE with not less than 5.5% but not more than 16% water","III","P","F-H S-Q"]
["IMDG_3488_12293/I/TOXIC BY INHALATION LIQUID, FLAMMABLE, CORROSIVE, N.O.S. with an LC50 lower than or equal to 200 mL/m3 and saturated vapour concentration greater than or equal to 500 LC50","I",null,"F-E S-D"]
["IMDG_3489_12294/I/TOXIC BY INHALATION LIQUID, FLAMMABLE, CORROSIVE, N.O.S. with an LC50 lower than or equal to 1000 mL/m3 and saturated vapour concentration greater than or equal to 10 LC50","I",null,"F-E S-D"]
["IMDG_3490_12295/I/TOXIC BY INHALATION LIQUID, WATER-REACTIVE, FLAMMABLE, N.O.S. with an LC50 lower than or equal to 200 mL/m3 and saturated vapour concentration greater than or equal to 500 LC50","I",null,"F-G S-N"]
["IMDG_3491_12296/I/TOXIC BY INHALATION LIQUID, WATER-REACTIVE, FLAMMABLE, N.O.S. with an LC50 lower than or equal to 1000 mL/m3 and saturated vapour concentration greater than or equal to 10 LC50","I",null,"F-G S-N"]
["IMDG_3494_11954/I/PETROLEUM SOUR CRUDE OIL, FLAMMABLE, TOXIC","I",null,"F-E S-E"]
["IMDG_3494_11955/II/PETROLEUM SOUR CRUDE OIL, FLAMMABLE, TOXIC","II",null,"F-E S-E"]
["IMDG_3494_11956/III/PETROLEUM SOUR CRUDE OIL, FLAMMABLE, TOXIC","III",null,"F-E S-E"]
["IMDG_3495_11957/III/IODINE","III",null,"F-A S-B"]
["IMDG_3496_11958/ /BATTERIES, NICKEL-METAL HYDRIDE",null,null,"F-A S-I"]
["IMDG_3497_11959/II/KRILL MEAL","II",null,"F-A S-J"]
["IMDG_3497_11960/III/KRILL MEAL","III",null,"F-A S-J"]
["IMDG_3498_11961/II/IODINE MONOCHLORIDE, LIQUID","II",null,"F-A S-B"]
["IMDG_3499_12297/ /CAPACITOR, ELECTRIC DOUBLE LAYER (with an energy storage capacity greater than 0.3 Wh)",null,null,"F-A S-I"]
["IMDG_3500_11963/ /CHEMICAL UNDER PRESSURE, N.O.S.",null,null,"F-C S-V"]
["IMDG_3501_11964/ /CHEMICAL UNDER PRESSURE, FLAMMABLE, N.O.S.",null,null,"F-D S-U"]
["IMDG_3502_11965/ /CHEMICAL UNDER PRESSURE, TOXIC, N.O.S.",null,null,"F-C S-V"]
["IMDG_3503_11966/ /CHEMICAL UNDER PRESSURE, CORROSIVE, N.O.S.",null,null,"F-C S-V"]
["IMDG_3504_11967/ /CHEMICAL UNDER PRESSURE, FLAMMABLE, TOXIC, N.O.S.",null,null,"F-D S-U"]
["IMDG_3505_11968/ /CHEMICAL UNDER PRESSURE, FLAMMABLE, CORROSIVE, N.O.S.",null,null,"F-D S-U"]
["IMDG_3506_11969/ /MERCURY CONTAINED IN MANUFACTURED ARTICLES",null,null,"F-A S-B"]
["IMDG_3507_12298/I/URANIUM HEXAFLUORIDE, RADIOACTIVE MATERIAL, EXCEPTED PACKAGE, less than 0.1 kg per package, non-fissile or fissile-excepted","I",null,"F-I S-S"]
["IMDG_3508_11971/ /CAPACITOR, ASYMMETRIC (with an energy storage capacity greater than 0.3Wh)",null,null,"F-A S-I"]
["IMDG_3509_11972/ /PACKAGINGS, DISCARDED, EMPTY, UNCLEANED"]
["IMDG_3510_11973/ /ADSORBED GAS, FLAMMABLE, N.O.S.",null,null,"F-D S-U"]
["IMDG_3511_11974/ /ADSORBED GAS, N.O.S.",null,null,"F-C S-V"]
["IMDG_3512_11975/ /ADSORBED GAS, TOXIC, N.O.S.",null,null,"F-C S-U"]
["IMDG_3513_11976/ /ADSORBED GAS, OXIDIZING, N.O.S.",null,null,"F-C S-W"]
["IMDG_3514_11977/ /ADSORBED GAS, TOXIC, FLAMMABLE, N.O.S.",null,null,"F-D S-U"]
["IMDG_3515_11978/ /ADSORBED GAS, TOXIC, OXIDIZING, N.O.S.",null,null,"F-C S-W"]
["IMDG_3516_11979/ /ADSORBED GAS, TOXIC, CORROSIVE, N.O.S.",null,null,"F-C S-U"]
["IMDG_3517_11980/ /ADSORBED GAS, TOXIC, FLAMMABLE, CORROSIVE, N.O.S.",null,null,"F-D S-U"]
["IMDG_3518_11981/ /ADSORBED GAS, TOXIC, OXIDIZING, CORROSIVE, N.O.S.",null,null,"F-C S-W"]
["IMDG_3519_11982/ /BORON TRIFLUORIDE, ADSORBED",null,null,"F-C S-U"]
["IMDG_3520_11983/ /CHLORINE, ADSORBED",null,null,"F-C S-W"]
["IMDG_3521_11984/ /SILICON TETRAFLUORIDE, ADSORBED",null,null,"F-C S-U"]
["IMDG_3522_11985/ /ARSINE, ADSORBED",null,null,"F-D S-U"]
["IMDG_3523_11986/ /GERMANE, ADSORBED",null,null,"F-D S-U"]
["IMDG_3524_11987/ /PHOSPHORUS PENTAFLUORIDE, ADSORBED",null,null,"F-C S-U"]
["IMDG_3525_11988/ /PHOSPHINE, ADSORBED",null,null,"F-D S-U"]
["IMDG_3526_11989/ /HYDROGEN SELENIDE, ADSORBED",null,null,"F-D S-U"]
["IMDG_3527_12299/II/POLYESTER RESIN KIT, solid base material","II",null,"F-A S-G"]
["IMDG_3527_12300/III/POLYESTER RESIN KIT, solid base material","III",null,"F-A S-G"]
["IMDG_3528_12301/ /ENGINE, INTERNAL COMBUSTION, FLAMMABLE LIQUID POWERED or ENGINE, FUEL CELL, FLAMMABLE LIQUID POWERED or MACHINERY, INTERNAL COMBUSTION, FLAMMABLE LIQUID POWERED or MACHINERY, FUEL CELL, FLAMMABLE LIQUID POWERED",null,null,"F-E S-E"]
["IMDG_3529_12302/ /ENGINE, INTERNAL COMBUSTION, FLAMMABLE GAS POWERED or ENGINE, FUEL CELL, FLAMMABLE GAS POWERED or MACHINERY, INTERNAL COMBUSTION, FLAMMABLE GAS POWERED or MACHINERY, FUEL CELL, FLAMMABLE GAS POWERED",null,null,"F-D S-U"]
["IMDG_3530_12303/ /ENGINE, INTERNAL COMBUSTION or MACHINERY, INTERNAL COMBUSTION",null,"P","F-A S-F"]
["IMDG_3531_12304/III/POLYMERIZING SUBSTANCE, SOLID, STABILIZED, N.O.S.","III",null,"F-J S-G"]
["IMDG_3532_12305/III/POLYMERIZING SUBSTANCE, LIQUID, STABILIZED, N.O.S.","III",null,"F-J S-G"]
["IMDG_3533_12306/III/POLYMERIZING SUBSTANCE, SOLID, TEMPERATURE CONTROLLED, N.O.S.","III",null,"F-F S-K"]
["IMDG_3534_12307/III/POLYMERIZING SUBSTANCE, LIQUID, TEMPERATURE CONTROLLED, N.O.S.","III",null,"F-F S-K"]
["IMDG_3535_12450/I/TOXIC SOLID, FLAMMABLE, INORGANIC, N.O.S.","I",null,"F-A S-G"]
["IMDG_3535_12451/II/TOXIC SOLID, FLAMMABLE, INORGANIC, N.O.S.","II",null,"F-A S-G"]
["IMDG_3536_12452/ /LITHIUM BATTERIES INSTALLED IN CARGO TRANSPORT UNIT lithium ion batteries or lithium metal batteries",null,null,"F-A S-I"]
["IMDG_3537_12453/ /ARTICLES CONTAINING FLAMMABLE GAS, N.O.S.",null,null,"F-D S-U"]
["IMDG_3538_12454/ /ARTICLES CONTAINING NON-FLAMMABLE, NON-TOXIC GAS, N.O.S.",null,null,"F-C S-V"]
["IMDG_3539_12455/ /ARTICLES CONTAINING TOXIC GAS, N.O.S.",null,null,"F-C S-U"]
["IMDG_3540_12456/ /ARTICLES CONTAINING FLAMMABLE LIQUID, N.O.S.",null,null,"F-E S-D"]
["IMDG_3541_12457/ /ARTICLES CONTAINING FLAMMABLE SOLID, N.O.S.",null,null,"F-A S-G"]
["IMDG_3542_12458/ /ARTICLES CONTAINING A SUBSTANCE LIABLE TO SPONTANEOUS COMBUSTION, N.O.S.",null,null,"*"]
["IMDG_3543_12459/ /ARTICLES CONTAINING A SUBSTANCE WHICH EMITS FLAMMABLE GAS IN CONTACT WITH WATER, N.O.S.",null,null,"F-G S-N"]
["IMDG_3544_12460/ /ARTICLES CONTAINING OXIDIZING SUBSTANCE, N.O.S.",null,null,"F-A S-Q"]
["IMDG_3545_12461/ /ARTICLES CONTAINING ORGANIC PEROXIDE, N.O.S."]
["IMDG_3546_12462/ /ARTICLES CONTAINING TOXIC SUBSTANCE, N.O.S.",null,null,"F-A S-A"]
["IMDG_3547_12463/ /ARTICLES CONTAINING CORROSIVE SUBSTANCE, N.O.S.",null,null,"F-A S-B"]
["IMDG_3548_12464/ /ARTICLES CONTAINING MISCELLANEOUS DANGEROUS GOODS, N.O.S."]
["IMSBC_0000_12001/ /ALUMINIUM FLUORIDE"]
["IMSBC_0000_12002/ /AMORPHOUS SODIUM SILICATE LUMPS"]
["IMSBC_0000_12003/ /BORIC ACID"]
["IMSBC_0000_12004/ /CHEMICAL GYPSUM"]
["IMSBC_0000_12005/ /CLINKER ASH"]
["IMSBC_0000_12006/ /COPPER SLAG"]
["IMSBC_0000_12007/ /GLASS CULLET"]
["IMSBC_0000_12008/ /IRON AND STEEL SLAG AND ITS MIXTURE"]
["IMSBC_0000_12009/ /IRON ORE FINES"]
["IMSBC_0000_12010/ /IRON OXIDE TECHNICAL"]
["IMSBC_0000_12011/ /IRON SINTER"]
["IMSBC_0000_12012/ /MANGANESE COMPONENT FERROALLOY SLAG"]
["IMSBC_0000_12013/ /MANGANESE ORE FINES"]
["IMSBC_0000_12015/ /SPODUMENE (UPGRADED)"]
["IMSBC_0000_12016/ /WOOD PELLETS CONTAINING ADDITIVES AND/OR BINDERS"]
["IMSBC_0000_12017/ /WOOD PELLETS NOT CONTAINING ANY ADDITIVES AND/OR BINDERS"]
["IMSBC_0000_12018/ /ZINC SLAG"]
["IMSBC_0000_12019/ /ZIRCON KYANITE CONCENTRATE"]
["IMSBC_0000_12321/ /Beach iron"]
["IMSBC_0000_12324/ /Flint flat glass cullet"]
["IMSBC_0000_12325/ /FOAM GLASS GRAVEL"]
["IMSBC_0000_12326/ /Granulated iron"]
["IMSBC_0000_12327/ /Iron pan edges"]
["IMSBC_0000_12328/ /Iron skulls"]
["IMSBC_0000_12329/ /IRON SMELTING BY-PRODUCTS"]
["IMSBC_0000_12330/ /K1-K3 bears"]
["IMSBC_0000_12333/ /MONOCALCIUMPHOSPHATE (MCP)"]
["IMSBC_0000_12334/ /OLIVINE SAND"]
["IMSBC_0000_12336/ /Pig iron by-product"]
["IMSBC_0000_12337/ /Plate iron"]
["IMSBC_0000_12338/ /Pool iron"]
["IMSBC_0000_12342/ /Separation of iron"]
["IMSBC_0000_12343/ /Silicon dross"]
["IMSBC_0000_12344/ /Steel bears"]
["IMSBC_0000_12345/ /SUGARCANE BIOMASS PELLETS"]
["IMSBC_0000_12346/ /SYNTHETIC CALCIUM FLUORIDE"]
["IMSBC_0000_12347/ /SYNTHETIC SILICON DIOXIDE"]
["IMSBC_0000_12348/ /TITANOMAGNETITE SAND"]
["IMSBC_0000_12361/ /Aluminium dross"]
["IMSBC_0000_12362/ /Aluminium hydroxide"]
["IMSBC_0000_12363/ /Aluminium salt slags"]
["IMSBC_0000_12364/ /Aluminium skimmings"]
["IMSBC_0000_12365/ /ALUMINIUM SMELTING/REMELTING BY- PRODUCTS, PROCESSED"]
["IMSBC_0000_12366/ /AMMONIUM NITRATE BASED FERTILIZER (non-hazardous)"]
["IMSBC_0000_12367/ /BAUXITE FINES"]
["IMSBC_0000_12368/ /Bottom ash"]
["IMSBC_0000_12369/ /BRUCITE"]
["IMSBC_0000_12370/ /CALCIUM FLUORIDE, CALCIUM SULPHATE, CALCIUM CARBONATE MIXTURE"]
["IMSBC_0000_12371/ /Canola pellets"]
["IMSBC_0000_12372/ /CHLORITE"]
["IMSBC_0000_12373/ /DIRECT REDUCED IRON (B) Lumps, pellets, cold-moulded briquettes"]
["IMSBC_0000_12374/ /FERRONICKEL SLAG (granulated)"]
["IMSBC_0000_12375/ /Flat iron"]
["IMSBC_0000_12376/ /FLUE DUST, CONTAINING LEAD AND ZINC"]
["IMSBC_0000_12377/ /Foundry sand"]
["IMSBC_0000_12378/ /Iron silicate granulated"]
["IMSBC_0000_12379/ /MATTE CONTAINING COPPER AND LEAD"]
["IMSBC_0000_12380/ /Meal, oily"]
["IMSBC_0000_12381/ /METAL      SULPHIDE      CONCENTRATES, CORROSIVE UN 1759"]
["IMSBC_0000_12382/ /METAL      SULPHIDE      CONCENTRATES, SELF-HEATING UN 3190"]
["IMSBC_0000_12383/ /MONOAMMONIUM  PHOSPHATE  (M.A.P.), MINERAL ENRICHED COATING"]
["IMSBC_0000_12384/ /OLIVINE     GRANULAR     AND     GRAVEL AGGREGATE PRODUCTS"]
["IMSBC_0000_12385/ /Potassium felspar sand"]
["IMSBC_0000_12386/ /Quartz sand"]
["IMSBC_0000_12387/ /QUARTZITE"]
["IMSBC_0000_12388/ /Quicklime"]
["IMSBC_0000_12389/ /RADIOACTIVE MATERIAL, LOW SPECIFIC ACTIVITY (LSA-I) UN 2912"]
["IMSBC_0000_12390/ /RADIOACTIVE MATERIAL, SURFACE CONTAMINATED OBJECTS (SCO-I) UN 2913"]
["IMSBC_0000_12391/ /SAND,         MINERAL         CONCENTRATE, RADIOACTIVE  MATERIAL,  LOW  SPECIFIC ACTIVITY (LSA-I) UN 2912"]
["IMSBC_0000_12392/ /SCALE GENERATED FROM THE IRON AND STEEL MAKING PROCESS"]
["IMSBC_0000_12393/ /SEED CAKES AND OTHER RESIDUES OF PROCESSED OILY VEGETABLES"]
["IMSBC_0000_12394/ /Silica sand"]
["IMSBC_0000_12395/ /SILICOMANGANESE (carbo-thermic)"]
["IMSBC_0000_12396/ /Soda feldspar sand"]
["IMSBC_0000_12397/ /Spent cathodes"]
["IMSBC_0000_12398/ /Spent potliner"]
["IMSBC_0000_12399/ /Wood Products – General"]
["IMSBC_0000_12400/ /ZINC OXIDE ENRICHED FLUE DUST"]
["IMSBC_0000_12401/ /SEEDCAKES AND OTHER RESIDUES OF PROCESSED OILY VEGETABLES"]
["IMSBC_0000_8102/ /ALFALFA"]
["IMSBC_0000_8103/ /ALUMINA"]
["IMSBC_0000_8104/ /ALUMINA, CALCINED"]
["IMSBC_0000_8105/ /ALUMINA HYDRATE"]
["IMSBC_0000_8106/ /ALUMINA SILICA"]
["IMSBC_0000_8107/ /ALUMINA SILICA, pellets"]
["IMSBC_0000_8109/ /ALUMINIUM FERROSILICON POWDER UN 1395"]
["IMSBC_0000_8110/ /ALUMINIUM NITRATE UN 1438"]
["IMSBC_0000_8111/ /ALUMINIUM REMELTING BY-PRODUCTS UN 3170"]
["IMSBC_0000_8113/ /ALUMINIUM SILICON POWDER, UNCOATED UN 1398"]
["IMSBC_0000_8115/ /ALUMINIUM SMELTING BY-PRODUCTS UN 3170"]
["IMSBC_0000_8117/ /AMMONIUM NITRATE UN 1942"]
["IMSBC_0000_8118/ /AMMONIUM NITRATE BASED FERTILIZER UN 2067"]
["IMSBC_0000_8119/ /AMMONIUM NITRATE BASED FERTILIZER UN 2071"]
["IMSBC_0000_8121/ /AMMONIUM SULPHATE"]
["IMSBC_0000_8122/ /ANTIMONY ORE AND RESIDUE"]
["IMSBC_0000_8123/ /Antimony ore residue"]
["IMSBC_0000_8124/ /Bakery materials"]
["IMSBC_0000_8125/ /BARIUM NITRATE UN 1446"]
["IMSBC_0000_8126/ /Barley malt pellets"]
["IMSBC_0000_8127/ /BARYTES"]
["IMSBC_0000_8128/ /BAUXITE"]
["IMSBC_0000_8129/ /Beet, expelled"]
["IMSBC_0000_8130/ /Beet, extracted"]
["IMSBC_0000_8131/ /BIOSLUDGE"]
["IMSBC_0000_8132/ /Blende (zinc sulphide)"]
["IMSBC_0000_8133/ /BORAX (PENTAHYDRATE CRUDE)"]
["IMSBC_0000_8134/ /BORAX, ANHYDROUS, crude"]
["IMSBC_0000_8135/ /BORAX, ANHYDROUS, refined"]
["IMSBC_0000_8136/ /Bran pellets"]
["IMSBC_0000_8137/ /Brewer's grain pellets"]
["IMSBC_0000_8138/ /BROWN COAL BRIQUETTES"]
["IMSBC_0000_8139/ /Calcined clay"]
["IMSBC_0000_8140/ /Calcined pyrites"]
["IMSBC_0000_8141/ /Calcium fluoride"]
["IMSBC_0000_8142/ /CALCIUM NITRATE UN 1454"]
["IMSBC_0000_8143/ /CALCIUM NITRATE FERTILIZER"]
["IMSBC_0000_8144/ /Calcium oxide"]
["IMSBC_0000_8146/ /CARBORUNDUM"]
["IMSBC_0000_8147/ /CASTOR BEANS UN 2969"]
["IMSBC_0000_8148/ /CASTOR FLAKE UN 2969"]
["IMSBC_0000_8149/ /CASTOR MEAL UN 2969"]
["IMSBC_0000_8150/ /CASTOR POMACE UN 2969"]
["IMSBC_0000_8151/ /CEMENT"]
["IMSBC_0000_8152/ /CEMENT CLINKERS"]
["IMSBC_0000_8153/ /CEMENT COPPER"]
["IMSBC_0000_8154/ /Chalcopyrite"]
["IMSBC_0000_8155/ /CHAMOTTE"]
["IMSBC_0000_8156/ /CHARCOAL"]
["IMSBC_0000_8157/ /CHOPPED RUBBER AND PLASTIC INSULATION"]
["IMSBC_0000_8158/ /Chile saltpetre"]
["IMSBC_0000_8159/ /Chilean natural nitrate"]
["IMSBC_0000_8160/ /Chilean natural potassic nitrate"]
["IMSBC_0000_8161/ /Chrome ore"]
["IMSBC_0000_8162/ /CHROME PELLETS"]
["IMSBC_0000_8163/ /CHROMITE ORE"]
["IMSBC_0000_8164/ /Chromium ore"]
["IMSBC_0000_8165/ /Citrus pulp pellets"]
["IMSBC_0000_8166/ /CLAY"]
["IMSBC_0000_8168/ /COAL"]
["IMSBC_0000_8169/ /COAL SLURRY"]
["IMSBC_0000_8170/ /COAL TAR PITCH"]
["IMSBC_0000_8171/ /COARSE CHOPPED TYRES"]
["IMSBC_0000_8172/ /COARSE IRON AND STEEL SLAG AND ITS MIXTURE"]
["IMSBC_0000_8173/ /Coconut"]
["IMSBC_0000_8174/ /COKE"]
["IMSBC_0000_8175/ /COKE BREEZE"]
["IMSBC_0000_8176/ /COLEMANITE"]
["IMSBC_0000_8177/ /COPPER CONCENTRATE"]
["IMSBC_0000_8178/ /COPPER GRANULES"]
["IMSBC_0000_8179/ /COPPER MATTE"]
["IMSBC_0000_8180/ /Copper nickel"]
["IMSBC_0000_8181/ /Copper ore concentrate"]
["IMSBC_0000_8182/ /Copper precipitate"]
["IMSBC_0000_8183/ /COPRA (dry) UN 1363"]
["IMSBC_0000_8184/ /Copra, expelled"]
["IMSBC_0000_8185/ /Copra, extracted"]
["IMSBC_0000_8186/ /Corn gluten"]
["IMSBC_0000_8187/ /Cotton seed"]
["IMSBC_0000_8188/ /CRUSHED CARBON ANODES"]
["IMSBC_0000_8189/ /CRYOLITE"]
["IMSBC_0000_8190/ /Deadburned magnesite"]
["IMSBC_0000_8191/ /DIAMMONIUM PHOSPHATE"]
["IMSBC_0000_8192/ /DIRECT REDUCED IRON (A) Briquettes, hot-moulded"]
["IMSBC_0000_8194/ /DIRECT REDUCED IRON (C) By-product fines"]
["IMSBC_0000_8195/ /DISTILLERS DRIED GRAINS WITH SOLUBLES"]
["IMSBC_0000_8196/ /DOLOMITE"]
["IMSBC_0000_8197/ /Dolomitic quicklime"]
["IMSBC_0000_8198/ /D.R.I."]
["IMSBC_0000_8199/ /Expellers"]
["IMSBC_0000_8200/ /FELSPAR LUMP"]
["IMSBC_0000_8201/ /FERROCHROME"]
["IMSBC_0000_8202/ /FERROCHROME, exothermic"]
["IMSBC_0000_8203/ /FERROMANGANESE"]
["IMSBC_0000_8204/ /Ferromanganese, exothermic"]
["IMSBC_0000_8205/ /FERRONICKEL"]
["IMSBC_0000_8206/ /FERROPHOSPHORUS"]
["IMSBC_0000_8207/ /Ferrophosphorus briquettes"]
["IMSBC_0000_8208/ /FERROSILICON UN 1408"]
["IMSBC_0000_8209/ /FERROSILICON"]
["IMSBC_0000_8210/ /FERROUS METAL BORINGS UN 2793"]
["IMSBC_0000_8211/ /FERROUS METAL CUTTINGS UN 2793"]
["IMSBC_0000_8212/ /FERROUS METAL SHAVINGS UN 2793"]
["IMSBC_0000_8213/ /FERROUS METAL TURNINGS UN 2793"]
["IMSBC_0000_8214/ /FERROUS SULPHATE HEPTAHYDRATE"]
["IMSBC_0000_8215/ /FERTILIZERS WITHOUT NITRATES"]
["IMSBC_0000_8216/ /FISH (IN BULK)"]
["IMSBC_0000_8217/ /FISHMEAL, STABILIZED UN 2216"]
["IMSBC_0000_8218/ /FISHSCRAP, STABILIZED UN 2216"]
["IMSBC_0000_8219/ /FLUORSPAR"]
["IMSBC_0000_8220/ /FLY ASH, DRY"]
["IMSBC_0000_8221/ /FLY ASH, WET"]
["IMSBC_0000_8222/ /Galena (lead sulphide)"]
["IMSBC_0000_8223/ /Garbage tankage"]
["IMSBC_0000_8224/ /Gluten pellets"]
["IMSBC_0000_8225/ /GRAIN SCREENING PELLETS"]
["IMSBC_0000_8226/ /GRANULAR FERROUS SULPHATE"]
["IMSBC_0000_8227/ /GRANULATED NICKEL MATTE (LESS THAN 2% MOISTURE CONTENT)"]
["IMSBC_0000_8228/ /GRANULATED SLAG"]
["IMSBC_0000_8229/ /GRANULATED TYRE RUBBER"]
["IMSBC_0000_8230/ /Ground nuts, meal"]
["IMSBC_0000_8231/ /GYPSUM"]
["IMSBC_0000_8232/ /GYPSUM GRANULATED"]
["IMSBC_0000_8233/ /Hominy chop"]
["IMSBC_0000_8234/ /ILMENITE CLAY"]
["IMSBC_0000_8235/ /ILMENITE (ROCK)"]
["IMSBC_0000_8236/ /ILMENITE (UPGRADED)"]
["IMSBC_0000_8237/ /ILMENITE SAND"]
["IMSBC_0000_8238/ /IRON CONCENTRATE"]
["IMSBC_0000_8239/ /IRON CONCENTRATE (pellet feed)"]
["IMSBC_0000_8240/ /IRON CONCENTRATE (sinter feed)"]
["IMSBC_0000_8241/ /Iron disulphide"]
["IMSBC_0000_8242/ /IRON ORE"]
["IMSBC_0000_8243/ /Iron ore (concentrate, pellet feed, sinter feed)"]
["IMSBC_0000_8244/ /IRON ORE PELLETS"]
["IMSBC_0000_8245/ /IRON OXIDE, SPENT UN 1376"]
["IMSBC_0000_8246/ /Iron swarf"]
["IMSBC_0000_8247/ /IRON SPONGE, SPENT UN 1376"]
["IMSBC_0000_8248/ /IRONSTONE"]
["IMSBC_0000_8249/ /LABRADORITE"]
["IMSBC_0000_8250/ /LEAD AND ZINC CALCINES (mixed)"]
["IMSBC_0000_8251/ /LEAD AND ZINC MIDDLINGS"]
["IMSBC_0000_8252/ /LEAD CONCENTRATE"]
["IMSBC_0000_8253/ /LEAD NITRATE UN 1469"]
["IMSBC_0000_8254/ /LEAD ORE"]
["IMSBC_0000_8255/ /Lead ore concentrate"]
["IMSBC_0000_8256/ /LEAD ORE RESIDUE"]
["IMSBC_0000_8257/ /LEAD SILVER CONCENTRATE"]
["IMSBC_0000_8258/ /Lead silver ore"]
["IMSBC_0000_8259/ /Lead sulphide"]
["IMSBC_0000_8260/ /Lead sulphide (galena)"]
["IMSBC_0000_8261/ /Lignite"]
["IMSBC_0000_8262/ /LIME (UNSLAKED)"]
["IMSBC_0000_8263/ /LIMESTONE"]
["IMSBC_0000_8264/ /LINTED COTTON SEED"]
["IMSBC_0000_8265/ /Linseed, expelled"]
["IMSBC_0000_8266/ /Linseed, extracted"]
["IMSBC_0000_8267/ /LOGS"]
["IMSBC_0000_8268/ /MAGNESIA (DEADBURNED)"]
["IMSBC_0000_8269/ /MAGNESIA (UNSLAKED)"]
["IMSBC_0000_8270/ /Magnesia, clinker"]
["IMSBC_0000_8271/ /Magnesia, electro-fused"]
["IMSBC_0000_8272/ /Magnesia lightburned"]
["IMSBC_0000_8273/ /Magnesia calcined"]
["IMSBC_0000_8274/ /Magnesia caustic calcined"]
["IMSBC_0000_8275/ /Magnesite clinker"]
["IMSBC_0000_8276/ /MAGNESITE, natural"]
["IMSBC_0000_8277/ /Magnesium carbonate"]
["IMSBC_0000_8278/ /MAGNESIUM NITRATE UN 1474"]
["IMSBC_0000_8279/ /MAGNESIUM SULPHATE FERTILIZERS"]
["IMSBC_0000_8280/ /Maize, expelled"]
["IMSBC_0000_8281/ /Maize, extracted"]
["IMSBC_0000_8282/ /MANGANESE CONCENTRATE"]
["IMSBC_0000_8283/ /MANGANESE ORE"]
["IMSBC_0000_8284/ /M.A.P."]
["IMSBC_0000_8285/ /MARBLE CHIPS"]
["IMSBC_0000_8287/ /METAL SULPHIDE CONCENTRATES"]
["IMSBC_0000_8288/ /Mill feed pellets"]
["IMSBC_0000_8289/ /Milorganite"]
["IMSBC_0000_8290/ /Mineral Concentrates"]
["IMSBC_0000_8291/ /MONOAMMONIUM PHOSPHATE"]
["IMSBC_0000_8292/ /Muriate of potash"]
["IMSBC_0000_8293/ /NEFELINE SYENITE (mineral)"]
["IMSBC_0000_8294/ /NICKEL CONCENTRATE"]
["IMSBC_0000_8295/ /NICKEL ORE"]
["IMSBC_0000_8296/ /Nickel ore concentrate"]
["IMSBC_0000_8297/ /Niger seed, expelled"]
["IMSBC_0000_8298/ /Niger seed, extracted"]
["IMSBC_0000_8299/ /Oil cake"]
["IMSBC_0000_8300/ /Palm kernel, expelled"]
["IMSBC_0000_8301/ /Palm kernel, extracted"]
["IMSBC_0000_8302/ /Peanuts, expelled"]
["IMSBC_0000_8303/ /Peanuts, extracted"]
["IMSBC_0000_8304/ /PEANUTS (in shell)"]
["IMSBC_0000_8305/ /PEAT MOSS"]
["IMSBC_0000_8306/ /PEBBLES (sea)"]
["IMSBC_0000_8307/ /PELLETS (concentrates)"]
["IMSBC_0000_8308/ /Pellets, cereal"]
["IMSBC_0000_8309/ /Pencil pitch"]
["IMSBC_0000_8310/ /PENTAHYDRATE CRUDE"]
["IMSBC_0000_8311/ /PERLITE ROCK"]
["IMSBC_0000_8312/ /PETROLEUM COKE (calcined)"]
["IMSBC_0000_8313/ /PETROLEUM COKE (uncalcined)"]
["IMSBC_0000_8314/ /PHOSPHATE ROCK (calcined)"]
["IMSBC_0000_8315/ /PHOSPHATE ROCK (uncalcined)"]
["IMSBC_0000_8316/ /PHOSPHATE (defluorinated)"]
["IMSBC_0000_8317/ /PIG IRON"]
["IMSBC_0000_8318/ /PITCH PRILL"]
["IMSBC_0000_8319/ /Pollard pellets"]
["IMSBC_0000_8320/ /POTASH"]
["IMSBC_0000_8321/ /Potash muriate"]
["IMSBC_0000_8322/ /POTASSIUM CHLORIDE"]
["IMSBC_0000_8323/ /POTASSIUM NITRATE UN 1486"]
["IMSBC_0000_8324/ /Potassium nitrate/sodium nitrate (mixture)"]
["IMSBC_0000_8325/ /POTASSIUM SULPHATE"]
["IMSBC_0000_8326/ /Prilled coal tar"]
["IMSBC_0000_8327/ /PUMICE"]
["IMSBC_0000_8328/ /PULP WOOD"]
["IMSBC_0000_8329/ /PYRITE (containing copper and iron)"]
["IMSBC_0000_8330/ /PYRITES, CALCINED"]
["IMSBC_0000_8331/ /PYRITES"]
["IMSBC_0000_8332/ /Pyrites (cupreous, fine, flotation or sulphur)"]
["IMSBC_0000_8333/ /Pyritic ash"]
["IMSBC_0000_8334/ /PYRITIC ASHES (iron)"]
["IMSBC_0000_8335/ /PYRITIC CINDERS"]
["IMSBC_0000_8336/ /PYROPHYLLITE"]
["IMSBC_0000_8337/ /QUARTZ"]
["IMSBC_0000_8342/ /Rape seed, expelled"]
["IMSBC_0000_8343/ /Rape seed, extracted"]
["IMSBC_0000_8344/ /RASORITE (ANHYDROUS)"]
["IMSBC_0000_8345/ /Rice bran"]
["IMSBC_0000_8346/ /Rice broken"]
["IMSBC_0000_8347/ /Rough ammonia tankage"]
["IMSBC_0000_8348/ /ROUNDWOOD"]
["IMSBC_0000_8349/ /RUTILE SAND"]
["IMSBC_0000_8350/ /Safflower seed, expelled"]
["IMSBC_0000_8351/ /Safflower seed, extracted"]
["IMSBC_0000_8352/ /SALT"]
["IMSBC_0000_8353/ /SALT CAKE"]
["IMSBC_0000_8354/ /SALT ROCK"]
["IMSBC_0000_8355/ /Saltpetre"]
["IMSBC_0000_8356/ /SAND"]
["IMSBC_0000_8357/ /SAND, HEAVY MINERAL"]
["IMSBC_0000_8358/ /Spodumene"]
["IMSBC_0000_8359/ /Sand, ilmenite"]
["IMSBC_0000_8360/ /Sand, zircon"]
["IMSBC_0000_8361/ /SAWDUST"]
["IMSBC_0000_8362/ /SAW LOGS"]
["IMSBC_0000_8363/ /SCRAP METAL"]
["IMSBC_0000_8364/ /SEED CAKE, containing vegetable oil UN 1386 (a) mechanically expelled seeds, containing more than 10% of oil or more than 20% of oil and moisture combined"]
["IMSBC_0000_8365/ /SEED CAKE, containing vegetable oil UN 1386 (b) solvent extraction and expelled seeds, containing not more than 10% of oil and when the amount of moisture is higher than 10%, not more than 20% of oil and moisture combined"]
["IMSBC_0000_8366/ /SEED CAKE UN 2217"]
["IMSBC_0000_8368/ /Seed expellers, oily"]
["IMSBC_0000_8369/ /SILICOMANGANESE (low carbon)"]
["IMSBC_0000_8370/ /SILICON SLAG"]
["IMSBC_0000_8371/ /SILVER LEAD CONCENTRATE"]
["IMSBC_0000_8372/ /Silver lead ore concentrate"]
["IMSBC_0000_8373/ /Sinter"]
["IMSBC_0000_8374/ /Slag, granulated"]
["IMSBC_0000_8375/ /SLIG (iron ore)"]
["IMSBC_0000_8376/ /SODA ASH"]
["IMSBC_0000_8377/ /SODIUM NITRATE UN 1498"]
["IMSBC_0000_8378/ /SODIUM NITRATE AND POTASSIUM NITRATE MIXTURE UN 1499"]
["IMSBC_0000_8379/ /SOLIDIFIED FUELS RECYCLED FROM PAPER AND PLASTICS"]
["IMSBC_0000_8380/ /Soyabean, expelled"]
["IMSBC_0000_8381/ /Soyabean, extracted"]
["IMSBC_0000_8384/ /STAINLESS STEEL GRINDING DUST"]
["IMSBC_0000_8385/ /Steel swarf"]
["IMSBC_0000_8386/ /Stibnite"]
["IMSBC_0000_8387/ /STONE CHIPPINGS"]
["IMSBC_0000_8388/ /Strussa pellets"]
["IMSBC_0000_8389/ /SUGAR"]
["IMSBC_0000_8390/ /SULPHATE OF POTASH AND MAGNESIUM"]
["IMSBC_0000_8391/ /Sulphide concentrates"]
["IMSBC_0000_8392/ /SULPHUR UN 1350 (crushed lump and coarse grained)"]
["IMSBC_0000_8393/ /SULPHUR (formed, solid)"]
["IMSBC_0000_8394/ /Sunflower seed, expelled"]
["IMSBC_0000_8395/ /Sunflower seed, extracted"]
["IMSBC_0000_8396/ /SUPERPHOSPHATE"]
["IMSBC_0000_8397/ /SUPERPHOSPHATE (triple, granular)"]
["IMSBC_0000_8398/ /Swarf"]
["IMSBC_0000_8399/ /TACONITE PELLETS"]
["IMSBC_0000_8400/ /TALC"]
["IMSBC_0000_8401/ /TANKAGE"]
["IMSBC_0000_8402/ /Tankage fertilizer"]
["IMSBC_0000_8403/ /TAPIOCA"]
["IMSBC_0000_8404/ /TIMBER"]
["IMSBC_0000_8405/ /Toasted meals"]
["IMSBC_0000_8406/ /Triple superphosphate"]
["IMSBC_0000_8407/ /UREA"]
["IMSBC_0000_8408/ /VANADIUM ORE"]
["IMSBC_0000_8409/ /VERMICULITE"]
["IMSBC_0000_8410/ /WHITE QUARTZ"]
["IMSBC_0000_8411/ /WOODCHIPS"]
["IMSBC_0000_8414/ /WOOD TORREFIED"]
["IMSBC_0000_8415/ /ZINC AND LEAD CALCINES (mixed)"]
["IMSBC_0000_8416/ /ZINC AND LEAD MIDDLINGS"]
["IMSBC_0000_8417/ /ZINC ASHES UN 1435"]
["IMSBC_0000_8418/ /ZINC CONCENTRATE"]
["IMSBC_0000_8419/ /Zinc, dross, residue or skimmings"]
["IMSBC_0000_8420/ /Zinc ore, burnt"]
["IMSBC_0000_8421/ /Zinc ore, calamine"]
["IMSBC_0000_8422/ /Zinc ore, concentrates"]
["IMSBC_0000_8423/ /Zinc ore, crude"]
["IMSBC_0000_8424/ /ZINC SINTER"]
["IMSBC_0000_8425/ /ZINC SLUDGE"]
["IMSBC_0000_8426/ /Zinc sulphide"]
["IMSBC_0000_8427/ /Zinc sulphide (blende)"]
["IMSBC_0000_8428/ /ZIRCONSAND"]
["MARPOL_ANNEX1_0000_8021/ /Asphalt solutions  - Blending stocks"]
["MARPOL_ANNEX1_0000_8022/ /Asphalt solutions  - Roofers flux"]
["MARPOL_ANNEX1_0000_8023/ /Asphalt solutions  - Straight run residue"]
["MARPOL_ANNEX1_0000_8024/ /Oils - Clarified"]
["MARPOL_ANNEX1_0000_8025/ /Oils - Crude oil"]
["MARPOL_ANNEX1_0000_8026/ /Oils - Mixtures containing crude oil"]
["MARPOL_ANNEX1_0000_8027/ /Oils - Diesel oil"]
["MARPOL_ANNEX1_0000_8028/ /Oils - Fuel oil no. 4"]
["MARPOL_ANNEX1_0000_8029/ /Oils - Fuel oil no. 5"]
["MARPOL_ANNEX1_0000_8030/ /Oils - Fuel oil no. 6"]
["MARPOL_ANNEX1_0000_8031/ /Oils - Residual fuel oil"]
["MARPOL_ANNEX1_0000_8032/ /Oils - Road oil"]
["MARPOL_ANNEX1_0000_8033/ /Oils - Transformer oil"]
["MARPOL_ANNEX1_0000_8034/ /Oils - Aromatic oil  (excluding vegetable oil)"]
["MARPOL_ANNEX1_0000_8035/ /Oils - Lubricating oils and  blending stocks"]
["MARPOL_ANNEX1_0000_8036/ /Oils - Mineral oil"]
["MARPOL_ANNEX1_0000_8037/ /Oils - Motor oil"]
["MARPOL_ANNEX1_0000_8038/ /Oils - Penetrating oil"]
["MARPOL_ANNEX1_0000_8039/ /Oils - Spindle oil"]
["MARPOL_ANNEX1_0000_8040/ /Oils - Turbine oil"]
["MARPOL_ANNEX1_0000_8041/ /Distillates - Straight run"]
["MARPOL_ANNEX1_0000_8042/ /Distillates - Flashed feed stocks"]
["MARPOL_ANNEX1_0000_8043/ /Gas oil - Cracked"]
["MARPOL_ANNEX1_0000_8044/ /Gasoline blending stocks - Alkylates - fuel"]
["MARPOL_ANNEX1_0000_8045/ /Gasoline blending stocks - Reformates"]
["MARPOL_ANNEX1_0000_8046/ /Gasoline blending stocks - Polymer - fuel"]
["MARPOL_ANNEX1_0000_8047/ /Gasolines - Casinghead (natural)"]
["MARPOL_ANNEX1_0000_8048/ /Gasolines - Automotive"]
["MARPOL_ANNEX1_0000_8049/ /Gasolines - Aviation"]
["MARPOL_ANNEX1_0000_8050/ /Gasolines - Straight run"]
["MARPOL_ANNEX1_0000_8051/ /Gasolines - Fuel oil no. 1  (kerosene)"]
["MARPOL_ANNEX1_0000_8052/ /Gasolines - Fuel oil no. 1-D"]
["MARPOL_ANNEX1_0000_8053/ /Gasolines - Fuel oil no. 2"]
["MARPOL_ANNEX1_0000_8054/ /Gasolines - Fuel oil no. 2-D"]
["MARPOL_ANNEX1_0000_8055/ /Jet fuels - JP-1 (kerosene)"]
["MARPOL_ANNEX1_0000_8056/ /Jet fuels - JP-3"]
["MARPOL_ANNEX1_0000_8057/ /Jet fuels - JP-4"]
["MARPOL_ANNEX1_0000_8058/ /Jet fuels - JP-5 (kerosene, heavy)"]
["MARPOL_ANNEX1_0000_8059/ /Jet fuels - Turbo fuel"]
["MARPOL_ANNEX1_0000_8060/ /Jet fuels - Kerosene"]
["MARPOL_ANNEX1_0000_8061/ /Jet fuels - Mineral spirit"]
["MARPOL_ANNEX1_0000_8062/ /Naphtha - Solvent"]
["MARPOL_ANNEX1_0000_8063/ /Naphtha - Petroleum"]
["MARPOL_ANNEX1_0000_8064/ /Naphtha - Heartcut distillate oil"]

{"sheet":"FuelType","index":4,"n_rows":2,"n_cols":1,"rows_kept":2,"cut":false,"hidden":true,"merged":[]}
["Fuel - Id"]
["MGO - Marine gas oil"]

{"sheet":"DicWaste","index":5,"n_rows":2,"n_cols":1,"rows_kept":2,"cut":false,"hidden":true,"merged":[]}
["Waste - Id"]
["101 - Oily Bilge water"]

{"sheet":"RecProvider","index":6,"n_rows":2,"n_cols":1,"rows_kept":2,"cut":false,"hidden":true,"merged":[]}
["Provider"]
["Aqua-Port Ltd. - Mjr. H. Sucharskiego str. 69;Gdańsk 80-601"]

{"sheet":"Kraje_Countries","index":7,"n_rows":2,"n_cols":2,"rows_kept":2,"cut":false,"hidden":true,"merged":[]}
["Country - Id","Country - Name"]
["AD","Andorra"]

{"sheet":"PackType","index":8,"n_rows":379,"n_cols":1,"rows_kept":379,"cut":false,"hidden":true,"merged":[]}
["Pack - ID"]
["1A - Drum, steel"]
["1B - Drum, aluminium"]
["1D - Drum, plywood"]
["1F - Container, flexible"]
["1G - Drum, fibre"]
["1W - Drum, wooden"]
["2C - Barrel, wooden"]
["3A - Jerrican, steel"]
["3H - Jerrican, plastic"]
["43 - Bag, super bulk"]
["44 - Bag, polybag"]
["4A - Box, steel"]
["4B - Box, aluminium"]
["4C - Box, natural wood"]
["4D - Box, plywood"]
["4F - Box, reconstituted wood"]
["4G - Box, fibreboard"]
["4H - Box, plastic"]
["5H - Bag, woven plastic"]
["5L - Bag, textile "]
["5M - Bag, paper "]
["6H - Composite packaging, plastic receptacle"]
["6P - Composite packaging, glass receptacle"]
["7A - Case, car"]
["7B - Case, wooden"]
["8A - Pallet, wooden"]
["8B - Crate, wooden"]
["8C - Bundle, wooden"]
["AA - Intermediate bulk container, rigid plastic"]
["AB - Receptacle, fibre "]
["AC - Receptacle, paper "]
["AD - Receptacle, wooden "]
["AE - Aerosol"]
["AF - Pallet, modular, collars 80cms * 60cms "]
["AG - Pallet, shrinkwrapped "]
["AH - Pallet, 100cms * 110cms "]
["AI - Clamshell"]
["AJ - Cone"]
["AL - Ball"]
["AM - Ampoule, non-protected "]
["AP - Ampoule, protected "]
["AT - Atomizer "]
["AV - Capsule"]
["B4 - Belt"]
["BA - Barrel "]
["BB - Bobbin "]
["BC - Bottlecrate / bottlerack "]
["BD - Board"]
["BE - Bundle "]
["BF - Balloon, non-protected "]
["BG - Bag"]
["BH - Bunch"]
["BI - Bin"]
["BJ - Bucket "]
["BK - Basket "]
["BL - Bale, compressed "]
["BM - Basin"]
["BN - Bale, non-compressed "]
["BO - Bottle, non-protected, cylindrical "]
["BP - Balloon, protected "]
["BQ - Bottle, protected cylindrical"]
["BR - Bar"]
["BS - Bottle, non-protected, bulbous "]
["BT - Bolt "]
["BU - Butt "]
["BV - Bottle, protected bulbous"]
["BW - Box, for liquids"]
["BX - Box"]
["BY - Board, in bundle/bunch/truss "]
["BZ - Bars, in bundle/bunch/truss"]
["CA - Can, rectangular "]
["CB - Crate, beer"]
["CC - Churn"]
["CD - Can, with handle and spout "]
["CE - Creel"]
["CF - Coffer "]
["CG - Cage "]
["CH - Chest"]
["CI - Canister "]
["CJ - Coffin "]
["CK - Cask "]
["CL - Coil "]
["CM - Card"]
["CN - Container, not otherwise specified as transport equipment"]
["CO - Carboy, non-protected"]
["CP - Carboy, protected"]
["CQ - Cartridge"]
["CR - Crate"]
["CS - Case "]
["CT - Carton "]
["CU - Cup"]
["CV - Cover"]
["CW - Cage, roll "]
["CX - Can, cylindrical "]
["CY - Cylinder "]
["CZ - Canvas "]
["DA - Crate, multiple layer, plastic "]
["DB - Crate, multiple layer, wooden"]
["DC - Crate, multiple layer, cardboard "]
["DG - Cage, Commonwealth Handling Equipment Pool  (CHEP)"]
["DH - Box, Commonwealth Handling Equipment Pool (CHEP), Eurobox"]
["DI - Drum, iron "]
["DJ - Demijohn, non-protected"]
["DK - Crate, bulk, cardboard "]
["DL - Crate, bulk, plastic "]
["DM - Crate, bulk, wooden"]
["DN - Dispenser"]
["DP - Demijohn, protected"]
["DR - Drum "]
["DS - Tray, one layer no cover, plastic"]
["DT - Tray, one layer no cover, wooden "]
["DU - Tray, one layer no cover, polystyrene"]
["DV - Tray, one layer no cover, cardboard"]
["DW - Tray, two layers no cover, plastic tray"]
["DX - Tray, two layers no cover, wooden"]
["DY - Tray, two layers no cover, cardboard "]
["EC - Bag, plastic "]
["ED - Case, with pallet base "]
["EE - Case, with pallet base, wooden "]
["EF - Case, with pallet base, cardboard"]
["EG - Case, with pallet base, plastic"]
["EH - Case, with pallet base, metal"]
["EI - Case, isothermic "]
["EN - Envelope "]
["FB - Flexibag"]
["FC - Crate, fruit "]
["FD - Crate, framed"]
["FE - Flexitank"]
["FI - Firkin "]
["FL - Flask"]
["FO - Footlocker "]
["FP - Filmpack "]
["FR - Frame"]
["FT - Foodtainer"]
["FW - Cart, flatbed"]
["FX - Bag, flexible container"]
["GB - Bottle, gas"]
["GI - Girder "]
["GL - Container, gallon"]
["GR - Receptacle, glass "]
["GU - Tray, containing horizontally stacked flat items"]
["GY - Bag, gunny"]
["GZ - Girders, in bundle/bunch/truss "]
["HA - Basket, with handle, plastic "]
["HB - Basket, with handle, wooden"]
["HC - Basket, with handle, cardboard "]
["HG - Hogshead "]
["HN - Hanger"]
["HR - Hamper "]
["IA - Package, display, wooden "]
["IB - Package, display, cardboard"]
["IC - Package, display, plastic"]
["ID - Package, display, metal"]
["IE - Package, show"]
["IF - Package, flow "]
["IG - Package, paper wrapped"]
["IH - Drum, plastic"]
["IK - Package, cardboard, with bottle grip-holes "]
["IL - Tray, rigid, lidded stackable (CEN TS 14482:2002)"]
["IN - Ingot"]
["IZ - Ingots, in bundle/bunch/truss"]
["JB - Bag, jumbo"]
["JC - Jerrican, rectangular"]
["JG - Jug"]
["JR - Jar"]
["JT - Jutebag"]
["JY - Jerrican, cylindrical"]
["KG - Keg"]
["KI - Kit"]
["LE - Luggage"]
["LG - Log"]
["LT - Lot"]
["LU - Lug"]
["LV - Liftvan"]
["LZ - Logs, in bundle/bunch/truss"]
["MA - Crate, metal"]
["MB - Bag, multiply"]
["MC - Crate, milk"]
["ME - Container, metal"]
["MR - Receptacle, metal "]
["MS - Sack, multi-wall "]
["MT - Mat"]
["MW - Receptacle, plastic wrapped "]
["MX - Matchbox "]
["NA - Not available"]
["NE - Unpacked or unpackaged "]
["NF - Unpacked or unpackaged, single unit"]
["NG - Unpacked or unpackaged, multiple units"]
["NS - Nest "]
["NT - Net"]
["NU - Net, tube, plastic "]
["NV - Net, tube, textile "]
["OA - Pallet, CHEP 40 cm x 60 cm"]
["OB - Pallet, CHEP 80 cm x 120 cm"]
["OC - Pallet, CHEP 100 cm x 120 cm"]
["OD - Pallet, AS 4068-1993"]
["OE - Pallet, ISO T11"]
["OF - Platform, unspecified weight or dimension"]
["OK - Block"]
["OT - Octabin"]
["OU - Container, outer"]
["P2 - Pan"]
["PA - Packet "]
["PB - Pallet, box Combined open-ended box and pallet"]
["PC - Parcel "]
["PD - Pallet, modular, collars 80cms * 100cms "]
["PE - Pallet, modular, collars 80cms * 120cms "]
["PF - Pen "]
["PG - Plate"]
["PH - Pitcher"]
["PI - Pipe "]
["PJ - Punnet"]
["PK - Package"]
["PL - Pail "]
["PN - Plank"]
["PO - Pouch"]
["PP - Piece"]
["PR - Receptacle, plastic "]
["PT - Pot"]
["PU - Tray "]
["PV - Pipes, in bundle/bunch/truss "]
["PX - Pallet "]
["PY - Plates, in bundle/bunch/truss"]
["PZ - Planks, in bundle/bunch/truss"]
["QA - Drum, steel, non-removable head"]
["QB - Drum, steel, removable head"]
["QC - Drum, aluminium, non-removable head"]
["QD - Drum, aluminium, removable head"]
["QF - Drum, plastic, non-removable head"]
["QG - Drum, plastic, removable head"]
["QH - Barrel, wooden, bung type"]
["QJ - Barrel, wooden, removable head "]
["QK - Jerrican, steel, non-removable head"]
["QL - Jerrican, steel, removable head"]
["QM - Jerrican, plastic, non-removable head"]
["QN - Jerrican, plastic, removable head"]
["QP - Box, wooden, natural wood, ordinary"]
["QQ - Box, wooden, natural wood, with sift proof walls"]
["QR - Box, plastic, expanded "]
["QS - Box, plastic, solid"]
["RD - Rod"]
["RG - Ring "]
["RJ - Rack, clothing hanger"]
["RK - Rack "]
["RL - Reel "]
["RO - Roll "]
["RT - Rednet "]
["RZ - Rods, in bundle/bunch/truss"]
["SA - Sack "]
["SB - Slab"]
["SC - Crate, shallow "]
["SD - Spindle"]
["SE - Sea-chest"]
["SH - Sachet "]
["SI - Skid "]
["SK - Case, skeleton "]
["SL - Slipsheet "]
["SM - Sheetmetal "]
["SO - Spool "]
["SP - Sheet, plastic wrapping"]
["SS - Case, steel"]
["ST - Sheet"]
["SU - Suitcase "]
["SV - Envelope, steel"]
["SW - Shrinkwrapped  "]
["SX - Set"]
["SY - Sleeve"]
["SZ - Sheets, in bundle/bunch/truss"]
["T1 - Tablet"]
["TB - Tub"]
["TC - Tea-chest"]
["TD - Tube, collapsible"]
["TE - Tyre"]
["TG - Tank container, generic"]
["TI - Tierce"]
["TK - Tank, rectangular"]
["TL - Tub, with lid"]
["TN - Tin"]
["TO - Tun"]
["TR - Trunk"]
["TS - Truss"]
["TT - Bag, tote"]
["TU - Tube "]
["TV - Tube, with nozzle "]
["TW - Pallet, triwall"]
["TY - Tank, cylindrical"]
["TZ - Tubes, in bundle/bunch/truss "]
["UC - Uncaged "]
["UN - Unit"]
["VA - Vat"]
["VG - Bulk, gas (at 1031 mbar and 15°C)"]
["VI - Vial "]
["VK - Vanpack "]
["VL - Bulk, liquid "]
["VN - Vehicle"]
["VO - Bulk, solid, large particles (“nodules”) "]
["VP - Vacuum-packed"]
["VQ - Bulk, liquefied gas (at abnormal temperature/pressure) "]
["VR - Bulk, solid, granular particles (“grains”) "]
["VS - Bulk, scrap metal"]
["VY - Bulk, solid, fine particles (“powders”)"]
["WA - Intermediate bulk container"]
["WB - Wickerbottle "]
["WC - Intermediate bulk container, steel "]
["WD - Intermediate bulk container, aluminium "]
["WF - Intermediate bulk container, metal "]
["WG - Intermediate bulk container, steel, pressurised > 10 kpa"]
["WH - Intermediate bulk container, aluminium, pressurised > 10 kpa"]
["WJ - Intermediate bulk container, metal, pressure 10 kpa "]
["WK - Intermediate bulk container, steel, liquid "]
["WL - Intermediate bulk container, aluminium, liquid "]
["WM - Intermediate bulk container, metal, liquid "]
["WN - Intermediate bulk container, woven plastic, without coat/liner "]
["WP - Intermediate bulk container, woven plastic, coated "]
["WQ - Intermediate bulk container, woven plastic, with liner "]
["WR - Intermediate bulk container, woven plastic, coated and liner "]
["WS - Intermediate bulk container, plastic film"]
["WT - Intermediate bulk container, textile with out coat/liner "]
["WU - Intermediate bulk container, natural wood, with inner liner"]
["WV - Intermediate bulk container, textile, coated "]
["WW - Intermediate bulk container, textile, with liner "]
["WX - Intermediate bulk container, textile, coated and liner "]
["WY - Intermediate bulk container, plywood, with inner liner "]
["WZ - Intermediate bulk container, reconstituted wood, with inner liner"]
["XA - Bag, woven plastic, without inner coat/liner "]
["XB - Bag, woven plastic, sift proof "]
["XC - Bag, woven plastic, water resistant"]
["XD - Bag, plastics film "]
["XF - Bag, textile, without inner coat/liner "]
["XG - Bag, textile, sift proof "]
["XH - Bag, textile, water resistant"]
["XJ - Bag, paper, multi-wall "]
["XK - Bag, paper, multi-wall, water resistant"]
["YA - Composite packaging, plastic receptacle in steel drum"]
["YB - Composite packaging, plastic receptacle in steel crate box"]
["YC - Composite packaging, plastic receptacle in aluminium drum"]
["YD - Composite packaging, plastic receptacle in aluminium crate"]
["YF - Composite packaging, plastic receptacle in wooden box"]
["YG - Composite packaging, plastic receptacle in plywood drum"]
["YH - Composite packaging, plastic receptacle in plywood box "]
["YJ - Composite packaging, plastic receptacle in fibre drum"]
["YK - Composite packaging, plastic receptacle in fibreboard box"]
["YL - Composite packaging, plastic receptacle in plastic drum"]
["YM - Composite packaging, plastic receptacle in solid plastic box"]
["YN - Composite packaging, glass receptacle in steel drum"]
["YP - Composite packaging, glass receptacle in steel crate box"]
["YQ - Composite packaging, glass receptacle in aluminium drum"]
["YR - Composite packaging, glass receptacle in aluminium crate"]
["YS - Composite packaging, glass receptacle in wooden box"]
["YT - Composite packaging, glass receptacle in plywood drum"]
["YV - Composite packaging, glass receptacle in wickerwork hamper"]
["YW - Composite packaging, glass receptacle in fibre drum"]
["YX - Composite packaging, glass receptacle in fibreboard box "]
["YY - Composite packaging, glass receptacle in expandable plastic pack"]
["YZ - Composite packaging, glass receptacle in solid plastic pack"]
["ZA - Intermediate bulk container, paper, multi-wall "]
["ZB - Bag, large "]
["ZC - Intermediate bulk container, paper, multi-wall, water resistant"]
["ZD - Intermediate bulk container, rigid plastic, with structural equipment, solids"]
["ZF - Intermediate bulk container, rigid plastic, freestanding, solids"]
["ZG - Intermediate bulk container, rigid plastic, with structural equipment, pressurised"]
["ZH - Intermediate bulk container, rigid plastic, freestanding, pressurised"]
["ZJ - Intermediate bulk container, rigid plastic, with structural equipment, liquids "]
["ZK - Intermediate bulk container, rigid plastic, freestanding, liquids"]
["ZL - Intermediate bulk container, composite, rigid plastic, solids"]
["ZM - Intermediate bulk container, composite, flexible plastic, solids"]
["ZN - Intermediate bulk container, composite, rigid plastic, pressurised "]
["ZP - Intermediate bulk container, composite, flexible plastic, pressurised"]
["ZQ - Intermediate bulk container, composite, rigid plastic, liquids"]
["ZR - Intermediate bulk container, composite, flexible plastic, liquids "]
["ZS - Intermediate bulk container, composite"]
["ZT - Intermediate bulk container, fibreboard"]
["ZU - Intermediate bulk container, flexible"]
["ZV - Intermediate bulk container, metal, other than steel"]
["ZW - Intermediate bulk container, natural wood"]
["ZX - Intermediate bulk container, plywood"]
["ZY - Intermediate bulk container, reconstituted wood"]
["ZZ - Mutually defined "]

{"sheet":"Porty_Ports","index":9,"n_rows":18397,"n_cols":4,"rows_kept":18397,"cut":false,"hidden":true,"merged":[]}
["Port - Id","Port - Name","Port_call - Id","Port_call - Name"]
["AE888",null,"PLDAR - Darlowo"]
["AEABU"]
["AEAJM"]
["AEAJP"]
["AEAMF"]
["AEAMU"]
["AEARP"]
["AEAUH"]
["AEDAS"]
["AEDBP"]
["AEDUJ"]
["AEDXB"]
["AEEND"]
["AEFAT"]
["AEFJR"]
["AEFRP"]
["AEHIL"]
["AEHSN"]
["AEHTL"]
["AEHZP"]
["AEJAZ"]
["AEJEA"]
["AEJED"]
["AEKHL"]
["AEKLB"]
["AEKLF"]
["AEMBS"]
["AEMKH"]
["AEMRP"]
["AEMSA"]
["AEMUB"]
["AEMZD"]
["AEOFJ"]
["AEPRA"]
["AEQIW"]
["AEQWE"]
["AERFA"]
["AERKP"]
["AERKT"]
["AERMC"]
["AERUW"]
["AERWP"]
["AESHJ"]
["AESID"]
["AEULR"]
["AEYAS"]
["AEZUR"]
["AFDHD"]
["AFQLT"]
["AFRKH"]
["AG888"]
["AGANU"]
["AGBBQ"]
["AGFAM"]
["AGPHM"]
["AGSJO"]
["AI888"]
["AIBLP"]
["AIFOR"]
["AIMBB"]
["AIROA"]
["AISOM"]
["AIWLL"]
["AL888"]
["ALBUT"]
["ALDRZ"]
["ALHMR"]
["ALROM"]
["ALSAR"]
["ALSHG"]
["ALVOA"]
["AMJER"]
["AO888"]
["AOARO"]
["AOAZZ"]
["AOB15"]
["AOBAB"]
["AOBDD"]
["AOBDT"]
["AOBUG"]
["AOCAB"]
["AOCLV"]
["AOCPO"]
["AOCUI"]
["AODAL"]
["AODGR"]
["AOETN"]
["AOFBY"]
["AOFLT"]
["AOGIM"]
["AOGIR"]
["AOGPO"]
["AOKOT"]
["AOKTI"]
["AOLAA"]
["AOLAD"]
["AOLBT"]
["AOLIE"]
["AOLOB"]
["AOLUC"]
["AOMAL"]
["AOMSZ"]
["AONDD"]
["AONQI"]
["AONTO"]
["AOPAT"]
["AOPAZ"]
["AOPBN"]
["AOPLE"]
["AOPSA"]
["AORSN"]
["AOSBT"]
["AOSOQ"]
["AOSTL"]
["AOSZA"]
["AOTAK"]
["AQ888"]
["AQABA"]
["AQAPT"]
["AQARC"]
["AQART"]
["AQBHN"]
["AQCAS"]
["AQCFZ"]
["AQDAV"]
["AQDDU"]
["AQESC"]
["AQESP"]
["AQGWL"]
["AQHLY"]
["AQJBS"]
["AQJCP"]
["AQJUB"]
["AQKHN"]
["AQKSG"]
["AQLAW"]
["AQMAW"]
["AQMCM"]
["AQMIR"]
["AQMRB"]
["AQMZU"]
["AQOHG"]
["AQORC"]
["AQPFS"]
["AQPLM"]
["AQPRO"]
["AQROT"]
["AQSGN"]
["AQSMT"]
["AQSYW"]
["AQTNB"]
["AQVKY"]
["AQWSA"]
["AQZGN"]
["AR888"]
["ARACF"]
["ARASO"]
["ARBHI"]
["ARBQS"]
["ARBUE"]
["ARBUI"]
["ARBVC"]
["ARCBS"]
["ARCDL"]
["ARCHL"]
["ARCHO"]
["ARCLC"]
["ARCMP"]
["ARCNQ"]
["ARCOL"]
["ARCOU"]
["ARCRD"]
["ARCRY"]
["ARCSA"]
["ARCUA"]
["ARCVI"]
["ARDGU"]
["ARDME"]
["ARDSU"]
["ARFMA"]
["ARGEO"]
["ARGHU"]
["ARIBY"]
["ARINW"]
["ARIQO"]
["ARJLS"]
["ARLAV"]
["ARLCU"]
["ARLPG"]
["ARLPM"]
["ARLPS"]
["ARLUJ"]
["ARLZG"]
["ARMDQ"]
["ARNEC"]
["ARNOS"]
["AROVI"]
["AROYA"]
["AROYO"]
["ARPAL"]
["ARPBG"]
["ARPCO"]
["ARPCY"]
["ARPEL"]
["ARPGV"]
["ARPLA"]
["ARPLO"]
["ARPME"]
["ARPMY"]
["ARPNL"]
["ARPP9"]
["ARPQU"]
["ARPRA"]
["ARPRS"]
["ARPSS"]
["ARPUB"]
["ARPUD"]
["ARPWA"]
["ARQBR"]
["ARQQN"]
["ARRAM"]
["ARRFO"]
["ARRGA"]
["ARRGL"]
["ARRIC"]
["ARRIV"]
["ARROC"]
["ARROS"]
["ARRSF"]
["ARRWO"]
["ARRZA"]
["ARSAE"]
["ARSAL"]
["ARSAN"]
["ARSCA"]
["ARSFE"]
["ARSFN"]
["ARSIG"]
["ARSLO"]
["ARSMA"]
["ARSMR"]
["ARSNS"]
["ARSPD"]
["ARSSJ"]
["ARSSN"]
["ARSTA"]
["ARTUC"]
["ARTUN"]
["ARULA"]
["ARURD"]
["ARUSH"]
["ARVCN"]
["ARVHE"]
["ARVLO"]
["ARVMD"]
["ARVTT"]
["ARXPD"]
["ARZAE"]
["AS888"]
["ASPPG"]
["AT7PZ"]
["ATATK"]
["ATATN"]
["ATAWH"]
["ATBFS"]
["ATBNN"]
["ATBOE"]
["ATBRI"]
["ATBRZ"]
["ATDFC"]
["ATDKZ"]
["ATDOF"]
["ATDRA"]
["ATDRO"]
["ATDUE"]
["ATDWA"]
["ATEBR"]
["ATEIN"]
["ATEPD"]
["ATERL"]
["ATERM"]
["ATERO"]
["ATERR"]
["ATETZ"]
["ATEWD"]
["ATFBZ"]
["ATFG7"]
["ATFHR"]
["ATFNA"]
["ATFPS"]
["ATFSU"]
["ATGA6"]
["ATGDN"]
["ATGFS"]
["ATGGU"]
["ATGHH"]
["ATGHJ"]
["ATGRN"]
["ATGSN"]
["ATHKM"]
["ATIEG"]
["ATITN"]
["ATJDD"]
["ATJPS"]
["ATKAM"]
["ATKFD"]
["ATKMB"]
["ATKTT"]
["ATLKN"]
["ATLTS"]
["ATLTX"]
["ATLUA"]
["ATLZD"]
["ATMAB"]
["ATMAN"]
["ATMBS"]
["ATMKA"]
["ATMKC"]
["ATNAD"]
["ATND2"]
["ATNFN"]
["ATNGG"]
["ATNNN"]
["ATNT9"]
["ATNUZ"]
["ATOBU"]
["ATOSH"]
["ATPAS"]
["ATPBU"]
["ATPET"]
["ATRAD"]
["ATREG"]
["ATRHN"]
["ATRHR"]
["ATRRF"]
["ATRTV"]
["ATSAG"]
["ATSAK"]
["ATSFT"]
["ATSGS"]
["ATSK3"]
["ATSMK"]
["ATSMR"]
["ATSPG"]
["ATSPZ"]
["ATSSS"]
["ATST6"]
["ATSTD"]
["ATSUH"]
["ATSUS"]
["ATSVM"]
["ATSWH"]
["ATSXA"]
["ATTAM"]
["ATTEN"]
["ATTFS"]
["ATTHS"]
["ATTKP"]
["ATTMR"]
["ATTTL"]
["ATVEL"]
["ATWDF"]
["ATWEU"]
["ATWSE"]
["ATWUL"]
["ATXAE"]
["ATXXX"]
["ATZIN"]
["ATZLF"]
["ATZNG"]
["ATZRF"]
["AU5CI"]
["AU888"]
["AUABP"]
["AUADL"]
["AUAGS"]
["AUAIR"]
["AUALD"]
["AUALH"]
["AUALI"]
["AUALP"]
["AUAMR"]
["AUANN"]
["AUAPP"]
["AUARD"]
["AUASB"]
["AUASH"]
["AUATT"]
["AUAUA"]
["AUBAA"]
["AUBAE"]
["AUBAH"]
["AUBAL"]
["AUBAR"]
["AUBBG"]
["AUBBL"]
["AUBBY"]
["AUBCH"]
["AUBDB"]
["AUBDY"]
["AUBE9"]
["AUBEL"]
["AUBFD"]
["AUBIC"]
["AUBKE"]
["AUBLL"]
["AUBLP"]
["AUBME"]
["AUBMW"]
["AUBNE"]
["AUBNK"]
["AUBNN"]
["AUBNY"]
["AUBOB"]
["AUBOD"]
["AUBOL"]
["AUBOO"]
["AUBOT"]
["AUBOU"]
["AUBOV"]
["AUBOY"]
["AUBPO"]
["AUBRR"]
["AUBRT"]
["AUBSA"]
["AUBTB"]
["AUBUC"]
["AUBUL"]
["AUBUS"]
["AUBUV"]
["AUBUY"]
["AUBVD"]
["AUBWB"]
["AUBWI"]
["AUBWT"]
["AUBYP"]
["AUBYY"]
["AUC8R"]
["AUCAL"]
["AUCAP"]
["AUCAR"]
["AUCBA"]
["AUCBO"]
["AUCBR"]
["AUCCU"]
["AUCDE"]
["AUCDN"]
["AUCFS"]
["AUCHA"]
["AUCHB"]
["AUCHE"]
["AUCHT"]
["AUCHV"]
["AUCLF"]
["AUCLL"]
["AUCLM"]
["AUCLN"]
["AUCLR"]
["AUCLT"]
["AUCMB"]
["AUCMO"]
["AUCMP"]
["AUCN6"]
["AUCNS"]
["AUCNW"]
["AUCOO"]
["AUCOP"]
["AUCOU"]
["AUCOW"]
["AUCPN"]
["AUCPR"]
["AUCQP"]
["AUCRE"]
["AUCRF"]
["AUCRL"]
["AUCRS"]
["AUCRU"]
["AUCRV"]
["AUCST"]
["AUCTE"]
["AUCTH"]
["AUCTI"]
["AUCTN"]
["AUCTT"]
["AUCUN"]
["AUCVL"]
["AUCVN"]
["AUCVQ"]
["AUCVS"]
["AUDA5"]
["AUDAA"]
["AUDAL"]
["AUDAM"]
["AUDAR"]
["AUDFE"]
["AUDGA"]
["AUDHI"]
["AUDIA"]
["AUDIL"]
["AUDIT"]
["AUDLP"]
["AUDON"]
["AUDPO"]
["AUDRB"]
["AUDRW"]
["AUDRY"]
["AUDSW"]
["AUEDB"]
["AUEDE"]
["AUELB"]
["AUELE"]
["AUELT"]
["AUEPR"]
["AUEVL"]
["AUEXM"]
["AUFIN"]
["AUFIS"]
["AUFLD"]
["AUFLN"]
["AUFRE"]
["AUFRY"]
["AUFVN"]
["AUFWT"]
["AUGBT"]
["AUGEE"]
["AUGEM"]
["AUGET"]
["AUGEX"]
["AUGLL"]
["AUGLT"]
["AUGOA"]
["AUGOH"]
["AUGOI"]
["AUGOR"]
["AUGOV"]
["AUGRB"]
["AUGRH"]
["AUGRK"]
["AUGRU"]
["AUGRV"]
["AUGTE"]
["AUGTH"]
["AUGTW"]
["AUGTY"]
["AUGUM"]
["AUGUR"]
["AUHAH"]
["AUHAM"]
["AUHAS"]
["AUHBA"]
["AUHBE"]
["AUHDD"]
["AUHFR"]
["AUHNK"]
["AUHOT"]
["AUHPP"]
["AUHPT"]
["AUHTH"]
["AUHTT"]
["AUHWD"]
["AUHYI"]
["AUIGF"]
["AUIPS"]
["AUIRY"]
["AUITH"]
["AUJAR"]
["AUJML"]
["AUJOV"]
["AUKAN"]
["AUKAY"]
["AUKEI"]
["AUKEY"]
["AUKGC"]
["AUKIB"]
["AUKIT"]
["AUKJH"]
["AUKLL"]
["AUKLP"]
["AUKNG"]
["AUKOI"]
["AUKRB"]
["AUKTN"]
["AUKTR"]
["AUKUR"]
["AUKWI"]
["AULAB"]
["AULAN"]
["AULDH"]
["AULEN"]
["AULGT"]
["AULKU"]
["AULME"]
["AULMQ"]
["AULOW"]
["AULST"]
["AULUB"]
["AULUC"]
["AULYD"]
["AUMAR"]
["AUMBH"]
["AUMBY"]
["AUMDC"]
["AUMEL"]
["AUMGE"]
["AUMHW"]
["AUMIB"]
["AUMID"]
["AUMIL"]
["AUMKY"]
["AUMLI"]
["AUMLL"]
["AUMOD"]
["AUMOK"]
["AUMON"]
["AUMOU"]
["AUMOW"]
["AUMQI"]
["AUMRK"]
["AUMRS"]
["AUMUT"]
["AUMWA"]
["AUNB2"]
["AUNEQ"]
["AUNGH"]
["AUNHU"]
["AUNIV"]
["AUNLK"]
["AUNSB"]
["AUNTE"]
["AUNTL"]
["AUOKF"]
["AUOKH"]
["AUONS"]
["AUOSB"]
["AUP6D"]
["AUPAE"]
["AUPAG"]
["AUPAL"]
["AUPAU"]
["AUPBN"]
["AUPBT"]
["AUPBY"]
["AUPCT"]
["AUPDI"]
["AUPEL"]
["AUPEN"]
["AUPER"]
["AUPEX"]
["AUPGI"]
["AUPHE"]
["AUPHP"]
["AUPHR"]
["AUPHU"]
["AUPIC"]
["AUPIS"]
["AUPJK"]
["AUPKL"]
["AUPKY"]
["AUPLA"]
["AUPLO"]
["AUPMK"]
["AUPOR"]
["AUPPI"]
["AUPQQ"]
["AUPRB"]
["AUPRC"]
["AUPRL"]
["AUPSM"]
["AUPST"]
["AUPSY"]
["AUPTD"]
["AUPTI"]
["AUPTJ"]
["AUPTL"]
["AUPTW"]
["AUPUF"]
["AUPUG"]
["AUPWI"]
["AUPWL"]
["AUPWR"]
["AUPYE"]
["AUPYR"]
["AUPYT"]
["AUQDN"]
["AURAB"]
["AURAF"]
["AURBU"]
["AURCM"]
["AURDN"]
["AURDS"]
["AUREV"]
["AURLL"]
["AURNB"]
["AUROB"]
["AUROK"]
["AUROZ"]
["AURTS"]
["AURYP"]
["AUSAD"]
["AUSBN"]
["AUSCL"]
["AUSCY"]
["AUSGT"]
["AUSHB"]
["AUSKA"]
["AUSKV"]
["AUSKY"]
["AUSMR"]
["AUSMT"]
["AUSOL"]
["AUSPB"]
["AUSPO"]
["AUSRN"]
["AUSSH"]
["AUSTA"]
["AUSTG"]
["AUSTR"]
["AUSTY"]
["AUSUH"]
["AUSWR"]
["AUSYD"]
["AUSYL"]
["AUT3P"]
["AUTHE"]
["AUTHS"]
["AUTIS"]
["AUTOB"]
["AUTOL"]
["AUTOR"]
["AUTRB"]
["AUTRD"]
["AUTRI"]
["AUTSV"]
["AUTTS"]
["AUULA"]
["AUULT"]
["AUUMB"]
["AUURN"]
["AUUSL"]
["AUVAR"]
["AUVGH"]
["AUVIB"]
["AUVIC"]
["AUVIT"]
["AUWAL"]
["AUWAZ"]
["AUWBT"]
["AUWEI"]
["AUWEP"]
["AUWHL"]
["AUWIH"]
["AUWMB"]
["AUWNB"]
["AUWNT"]
["AUWOO"]
["AUWOT"]
["AUWRB"]
["AUWSI"]
["AUWSN"]
["AUWTN"]
["AUWTW"]
["AUWWP"]
["AUWYA"]
["AUWYN"]
["AUYAM"]
["AUYBA"]
["AUYRR"]
["AUZBO"]
["AW888"]
["AWAUA"]
["AWBAR"]
["AWBUS"]
["AWDEU"]
["AWORJ"]
["AWSNL"]
["AXMHQ"]
["AZ888"]
["AZBAK"]
["AZKMZ"]
["AZQDG"]
["AZSHI"]
["AZSUQ"]
["BA4CA"]
["BA888"]
["BABIR"]
["BADOJ"]
["BAFOJ"]
["BAJBA"]
["BAMAG"]
["BANEM"]
["BASMT"]
["BAVGS"]
["BAZNK"]
["BB888"]
["BBBGI"]
["BBSTM"]
["BD888"]
["BDASJ"]
["BDBNP"]
["BDBZL"]
["BDCGP"]
["BDCHL"]
["BDKHL"]
["BDMGL"]
["BDMUN"]
["BDNAR"]
["BDPAY"]
["BDPGN"]
["BE7PD"]
["BE888"]
["BE88P"]
["BE88R"]
["BE9IR"]
["BEAAB"]
["BEAAL"]
["BEABK"]
["BEADK"]
["BEAEJ"]
["BEAFN"]
["BEAGT"]
["BEAHE"]
["BEAMY"]
["BEANB"]
["BEAND"]
["BEANH"]
["BEANL"]
["BEANR"]
["BEAPL"]
["BEAPS"]
["BEAPT"]
["BEASP"]
["BEASR"]
["BEAST"]
["BEATH"]
["BEATO"]
["BEAVE"]
["BEAVG"]
["BEAVL"]
["BEAVS"]
["BEBAI"]
["BEBAN"]
["BEBAT"]
["BEBAZ"]
["BEBBG"]
["BEBCM"]
["BEBCR"]
["BEBDU"]
["BEBER"]
["BEBEZ"]
["BEBGK"]
["BEBGN"]
["BEBGS"]
["BEBHE"]
["BEBHR"]
["BEBHU"]
["BEBLE"]
["BEBLO"]
["BEBLT"]
["BEBLZ"]
["BEBMB"]
["BEBNU"]
["BEBO2"]
["BEBOA"]
["BEBOC"]
["BEBOM"]
["BEBON"]
["BEBOO"]
["BEBRC"]
["BEBRE"]
["BEBRM"]
["BEBRT"]
["BEBRU"]
["BEBRY"]
["BEBSE"]
["BEBSI"]
["BEBSR"]
["BEBSU"]
["BEBTX"]
["BEBUD"]
["BEBVE"]
["BEBVM"]
["BEBVO"]
["BEBWN"]
["BECBQ"]
["BECCS"]
["BECHA"]
["BECHE"]
["BECHI"]
["BECLN"]
["BECOM"]
["BECOU"]
["BECRA"]
["BECRL"]
["BECRQ"]
["BECTA"]
["BECTL"]
["BEDDR"]
["BEDEG"]
["BEDEL"]
["BEDEZ"]
["BEDGN"]
["BEDIA"]
["BEDIK"]
["BEDKN"]
["BEDLS"]
["BEDNB"]
["BEDPE"]
["BEDPK"]
["BEDPY"]
["BEDRW"]
["BEDSE"]
["BEDSL"]
["BEDUF"]
["BEDXN"]
["BEEAM"]
["BEEBM"]
["BEEBZ"]
["BEECH"]
["BEEEK"]
["BEEET"]
["BEEFS"]
["BEEHT"]
["BEEIN"]
["BEEKE"]
["BEEKS"]
["BEELA"]
["BEELS"]
["BEEMP"]
["BEENG"]
["BEEQE"]
["BEEQM"]
["BEERE"]
["BEESD"]
["BEEVM"]
["BEFCS"]
["BEFEY"]
["BEFFX"]
["BEFLN"]
["BEFLO"]
["BEFMA"]
["BEFNR"]
["BEFRM"]
["BEFVT"]
["BEFWI"]
["BEGBB"]
["BEGBH"]
["BEGBU"]
["BEGDE"]
["BEGDN"]
["BEGEA"]
["BEGEL"]
["BEGGM"]
["BEGHI"]
["BEGHL"]
["BEGIS"]
["BEGLK"]
["BEGNE"]
["BEGNK"]
["BEGOS"]
["BEGRB"]
["BEGRO"]
["BEGVR"]
["BEGZE"]
["BEHAM"]
["BEHAR"]
["BEHBE"]
["BEHBN"]
["BEHCS"]
["BEHCT"]
["BEHDK"]
["BEHEE"]
["BEHEJ"]
["BEHER"]
["BEHET"]
["BEHEX"]
["BEHFB"]
["BEHGA"]
["BEHGG"]
["BEHKN"]
["BEHLU"]
["BEHMB"]
["BEHMH"]
["BEHMM"]
["BEHNA"]
["BEHNS"]
["BEHOL"]
["BEHPD"]
["BEHRE"]
["BEHRP"]
["BEHRS"]
["BEHSD"]
["BEHSL"]
["BEHSS"]
["BEHTE"]
["BEHTJ"]
["BEHTM"]
["BEHUM"]
["BEHUX"]
["BEHUY"]
["BEHVE"]
["BEHYB"]
["BEHZO"]
["BEIAI"]
["BEIDG"]
["BEIGE"]
["BEIPR"]
["BEISR"]
["BEITR"]
["BEIZG"]
["BEJAK"]
["BEJAM"]
["BEJAV"]
["BEJBE"]
["BEJKP"]
["BEJPS"]
["BEKAI"]
["BEKAN"]
["BEKCT"]
["BEKDE"]
["BEKEK"]
["BEKHN"]
["BEKJK"]
["BEKLE"]
["BEKMH"]
["BEKNS"]
["BEKOU"]
["BEKPB"]
["BEKRN"]
["BEKRO"]
["BEKSN"]
["BEKSR"]
["BEKUU"]
["BEKVE"]
["BEKWA"]
["BEKWB"]
["BELAN"]
["BELAW"]
["BELBE"]
["BELBS"]
["BELDA"]
["BELDS"]
["BELES"]
["BELEU"]
["BELFE"]
["BELGB"]
["BELGG"]
["BELGM"]
["BELGO"]
["BELHK"]
["BELIE"]
["BELIL"]
["BELIX"]
["BELLO"]
["BELML"]
["BELNK"]
["BELNY"]
["BELOK"]
["BELOT"]
["BELOZ"]
["BELPG"]
["BELPI"]
["BELQA"]
["BELRG"]
["BELSG"]
["BELUI"]
["BELUM"]
["BELUZ"]
["BELVO"]
["BEMAN"]
["BEMAP"]
["BEMBY"]
["BEMCA"]
["BEMCN"]
["BEMEE"]
["BEMEG"]
["BEMEH"]
["BEMEL"]
["BEMEN"]
["BEMEW"]
["BEMFF"]
["BEMGM"]
["BEMGN"]
["BEMGS"]
["BEMHN"]
["BEMLD"]
["BEMLO"]
["BEMLY"]
["BEMMN"]
["BEMNO"]
["BEMQS"]
["BEMRB"]
["BEMRD"]
["BEMRG"]
["BEMRI"]
["BEMRK"]
["BEMRL"]
["BEMRM"]
["BEMRO"]
["BEMSI"]
["BEMSJ"]
["BEMSK"]
["BEMSP"]
["BEMSR"]
["BEMSS"]
["BEMUI"]
["BEMZK"]
["BENAM"]
["BENBA"]
["BENFE"]
["BENHA"]
["BENHY"]
["BENIE"]
["BENIL"]
["BENMC"]
["BENNV"]
["BENRP"]
["BENRT"]
["BENRY"]
["BENVH"]
["BENVL"]
["BENVN"]
["BENYL"]
["BEOBG"]
["BEOBR"]
["BEOBT"]
["BEODE"]
["BEOEL"]
["BEOEV"]
["BEOGS"]
["BEOHN"]
["BEOKG"]
["BEOKP"]
["BEOLE"]
["BEOLN"]
["BEOOG"]
["BEOPI"]
["BEOPY"]
["BEOQC"]
["BEORR"]
["BEOSG"]
["BEOSH"]
["BEOST"]
["BEOTH"]
["BEOTK"]
["BEOTL"]
["BEOUD"]
["BEOUG"]
["BEOVE"]
["BEOZL"]
["BEPAL"]
["BEPCL"]
["BEPCQ"]
["BEPES"]
["BEPFE"]
["BEPKH"]
["BEPLB"]
["BEPLO"]
["BEPLY"]
["BEPME"]
["BEPML"]
["BEPTP"]
["BEPTS"]
["BEPUU"]
["BEPWZ"]
["BERAR"]
["BERAS"]
["BERBE"]
["BERBX"]
["BERCI"]
["BERCL"]
["BERCT"]
["BEREK"]
["BEREQ"]
["BERGE"]
["BERHA"]
["BERIE"]
["BERIJ"]
["BERIN"]
["BERIS"]
["BERJT"]
["BEROE"]
["BEROS"]
["BEROU"]
["BEROX"]
["BERPM"]
["BERQS"]
["BERTI"]
["BERUE"]
["BERUI"]
["BERUS"]
["BERVE"]
["BERVS"]
["BESAN"]
["BESAS"]
["BESBE"]
["BESBG"]
["BESCE"]
["BESCT"]
["BESDP"]
["BESDT"]
["BESEA"]
["BESEN"]
["BESES"]
["BESEV"]
["BESGM"]
["BESGS"]
["BESGX"]
["BESHB"]
["BESHL"]
["BESHR"]
["BESJG"]
["BESJO"]
["BESJR"]
["BESKA"]
["BESKE"]
["BESKR"]
["BESLJ"]
["BESLN"]
["BESLS"]
["BESLY"]
["BESML"]
["BESNE"]
["BESPE"]
["BESPI"]
["BESPT"]
["BESSB"]
["BESSK"]
["BESSN"]
["BESSO"]
["BESTB"]
["BESTT"]
["BESTV"]
["BESVG"]
["BESVN"]
["BETBE"]
["BETDK"]
["BETER"]
["BETES"]
["BETET"]
["BETFN"]
["BETGE"]
["BETGL"]
["BETGN"]
["BETHE"]
["BETHG"]
["BETHU"]
["BETIL"]
["BETIS"]
["BETLK"]
["BETLR"]
["BETMS"]
["BETOB"]
["BETRG"]
["BETRN"]
["BETSE"]
["BETSL"]
["BETTJ"]
["BETUR"]
["BEUIT"]
["BEVBG"]
["BEVEU"]
["BEVGL"]
["BEVHN"]
["BEVIL"]
["BEVIS"]
["BEVIT"]
["BEVLX"]
["BEVSB"]
["BEVSH"]
["BEVSL"]
["BEVVI"]
["BEVWZ"]
["BEVZI"]
["BEW5R"]
["BEWAA"]
["BEWAH"]
["BEWAN"]
["BEWAR"]
["BEWAS"]
["BEWBR"]
["BEWCG"]
["BEWDG"]
["BEWDM"]
["BEWEE"]
["BEWEL"]
["BEWER"]
["BEWES"]
["BEWET"]
["BEWEV"]
["BEWGL"]
["BEWHT"]
["BEWIH"]
["BEWIP"]
["BEWIR"]
["BEWJG"]
["BEWLB"]
["BEWLM"]
["BEWLP"]
["BEWLT"]
["BEWND"]
["BEWSL"]
["BEWTH"]
["BEXXX"]
["BEYRT"]
["BEYVO"]
["BEZAN"]
["BEZBR"]
["BEZEE"]
["BEZEL"]
["BEZER"]
["BEZET"]
["BEZGM"]
["BEZLE"]
["BEZOD"]
["BEZRM"]
["BEZTL"]
["BEZUL"]
["BEZUN"]
["BEZVD"]
["BEZVT"]
["BEZWE"]
["BEZWL"]
["BEZWN"]
["BFOB2"]
["BG4IG"]
["BG888"]
["BG88P"]
["BG88R"]
["BGAKH"]
["BGBAL"]
["BGBOJ"]
["BGBSL"]
["BGGUR"]
["BGKUK"]
["BGMAB"]
["BGNES"]
["BGNPO"]
["BGOKH"]
["BGPOD"]
["BGPOR"]
["BGRDU"]
["BGS3W"]
["BGSLS"]
["BGSOM"]
["BGSOZ"]
["BGSVI"]
["BGVAR"]
["BGVAZ"]
["BGVID"]
["BGVT4"]
["BGXXX"]
["BH888"]
["BHAHD"]
["BHGBQ"]
["BHKBS"]
["BHMIN"]
["BHSIT"]
["BI888"]
["BICBK"]
["BJ888"]
["BJCOO"]
["BJPTN"]
["BJSEM"]
["BLSBH"]
["BM888"]
["BMBDA"]
["BMFPT"]
["BMHBI"]
["BMKWF"]
["BMSAN"]
["BMSEV"]
["BMSGE"]
["BMSOU"]
["BN888"]
["BNBWN"]
["BNKUB"]
["BNLUM"]
["BNMUA"]
["BNSER"]
["BNTAS"]
["BOCPB"]
["BOGUQ"]
["BOHTJ"]
["BOPBU"]
["BOPPR"]
["BOPSZ"]
["BOPTC"]
["BOPUR"]
["BOQJR"]
["BORBQ"]
["BORIB"]
["BOTDD"]
["BQ888"]
["BQBON"]
["BQEUX"]
["BQGOT"]
["BQKRA"]
["BQRIN"]
["BQSAB"]
["BR888"]
["BRABT"]
["BRACX"]
["BRADL"]
["BRADR"]
["BRAGS"]
["BRAJU"]
["BRALH"]
["BRALP"]
["BRALU"]
["BRANF"]
["BRANT"]
["BRARB"]
["BRARE"]
["BRATB"]
["BRBAR"]
["BRBEL"]
["BRBNU"]
["BRBPS"]
["BRBUN"]
["BRBVS"]
["BRCAV"]
["BRCBU"]
["BRCDA"]
["BRCDM"]
["BRCDO"]
["BRCEA"]
["BRCMC"]
["BRCMG"]
["BRCPI"]
["BRCUA"]
["BRCXF"]
["BRDIA"]
["BRESA"]
["BRESF"]
["BRFEN"]
["BRFLN"]
["BRFLU"]
["BRFNO"]
["BRFOR"]
["BRGTB"]
["BRGUA"]
["BRHAR"]
["BRIAR"]
["BRIBB"]
["BRIOA"]
["BRIOS"]
["BRIPO"]
["BRIQI"]
["BRIRO"]
["BRITA"]
["BRITJ"]
["BRITQ"]
["BRITZ"]
["BRJPA"]
["BRJRV"]
["BRJUR"]
["BRLDF"]
["BRLGA"]
["BRMAI"]
["BRMAO"]
["BRMCP"]
["BRMCU"]
["BRMCZ"]
["BRMGU"]
["BRNAT"]
["BRNTR"]
["BRNVT"]
["BRNVU"]
["BROUT"]
["BROX3"]
["BRP35"]
["BRP58"]
["BRP69"]
["BRPEC"]
["BRPEN"]
["BRPET"]
["BRPHB"]
["BRPJL"]
["BRPMA"]
["BRPNG"]
["BRPNN"]
["BRPOA"]
["BRPOI"]
["BRPOM"]
["BRPOU"]
["BRPRJ"]
["BRPVH"]
["BRQRZ"]
["BRRCH"]
["BRREC"]
["BRREL"]
["BRRIG"]
["BRRIO"]
["BRROA"]
["BRSAL"]
["BRSBJ"]
["BRSFS"]
["BRSLV"]
["BRSLZ"]
["BRSOM"]
["BRSPB"]
["BRSPF"]
["BRSSA"]
["BRSSO"]
["BRSSZ"]
["BRSTA"]
["BRSTM"]
["BRSTS"]
["BRSUA"]
["BRSVT"]
["BRTFO"]
["BRTMO"]
["BRTMT"]
["BRTPR"]
["BRTRM"]
["BRTUB"]
["BRTUT"]
["BRVDC"]
["BRVIX"]
["BRVZC"]
["BS888"]
["BSASD"]
["BSBKC"]
["BSCBT"]
["BSCCZ"]
["BSCEL"]
["BSCLP"]
["BSCOC"]
["BSCOX"]
["BSCRI"]
["BSELE"]
["BSEXU"]
["BSFPO"]
["BSGGT"]
["BSGHB"]
["BSGHC"]
["BSGOC"]
["BSGSC"]
["BSGTC"]
["BSHBI"]
["BSHMC"]
["BSIGA"]
["BSLUC"]
["BSMAT"]
["BSMHH"]
["BSMYG"]
["BSNAS"]
["BSOCE"]
["BSRSD"]
["BSSAQ"]
["BSSML"]
["BSSRP"]
["BSTBI"]
["BSTCB"]
["BSWKR"]
["BSWTD"]
["BSZSA"]
["BV888"]
["BWDUK"]
["BWMAH"]
["BYKLK"]
["BYKYC"]
["BYPIK"]
["BYRYA"]
["BYSNM"]
["BYVAW"]
["BZ888"]
["BZBAR"]
["BZBGK"]
["BZBZE"]
["BZCOL"]
["BZDGA"]
["CA888"]
["CAAAB"]
["CAAAL"]
["CAABL"]
["CAABR"]
["CAAGU"]
["CAAHL"]
["CAALK"]
["CAALO"]
["CAALV"]
["CAAMH"]
["CAANB"]
["CAANZ"]
["CAARB"]
["CAARC"]
["CAARI"]
["CAASQ"]
["CAAVO"]
["CAAVP"]
["CABAA"]
["CABAD"]
["CABAM"]
["CABAN"]
["CABAT"]
["CABAY"]
["CABBB"]
["CABBU"]
["CABBY"]
["CABC2"]
["CABCK"]
["CABCO"]
["CABCT"]
["CABCV"]
["CABDF"]
["CABDR"]
["CABEA"]
["CABEC"]
["CABEH"]
["CABEL"]
["CABFR"]
["CABGT"]
["CABIN"]
["CABJO"]
["CABKA"]
["CABKN"]
["CABLC"]
["CABLD"]
["CABLH"]
["CABLK"]
["CABLL"]
["CABLR"]
["CABLV"]
["CABNI"]
["CABOB"]
["CABOJ"]
["CABOR"]
["CABPO"]
["CABRD"]
["CABRI"]
["CABRL"]
["CABRT"]
["CABRW"]
["CABSK"]
["CABST"]
["CABTF"]
["CABTH"]
["CABTT"]
["CABUA"]
["CABUE"]
["CABUI"]
["CABUK"]
["CABUO"]
["CABUS"]
["CABVE"]
["CABWD"]
["CABWV"]
["CABYR"]
["CACAC"]
["CACAH"]
["CACAM"]
["CACAQ"]
["CACAT"]
["CACAU"]
["CACBC"]
["CACBF"]
["CACBG"]
["CACBK"]
["CACBY"]
["CACCB"]
["CACCI"]
["CACCV"]
["CACDN"]
["CACDO"]
["CACFL"]
["CACHA"]
["CACHI"]
["CACHM"]
["CACHN"]
["CACHR"]
["CACHS"]
["CACHT"]
["CACHV"]
["CACIL"]
["CACLB"]
["CACLC"]
["CACLE"]
["CACLH"]
["CACLR"]
["CACLT"]
["CACMS"]
["CACMV"]
["CACOC"]
["CACOH"]
["CACOL"]
["CACOM"]
["CACOP"]
["CACOR"]
["CACOU"]
["CACOX"]
["CACPB"]
["CACPT"]
["CACPY"]
["CACQ5"]
["CACQA"]
["CACQT"]
["CACRA"]
["CACRB"]
["CACRO"]
["CACRR"]
["CACSC"]
["CACSI"]
["CACSJ"]
["CACSN"]
["CACST"]
["CACTR"]
["CACUM"]
["CACVA"]
["CACWH"]
["CACWI"]
["CACWL"]
["CACWT"]
["CACYP"]
["CADCS"]
["CADDS"]
["CADEB"]
["CADEI"]
["CADEL"]
["CADHS"]
["CADIG"]
["CADIL"]
["CADLN"]
["CADSA"]
["CADWL"]
["CAEBY"]
["CAEDC"]
["CAEDI"]
["CAEEK"]
["CAEIW"]
["CAEND"]
["CAENE"]
["CAESQ"]
["CAESX"]
["CAETA"]
["CAETN"]
["CAETZ"]
["CAEWT"]
["CAFAL"]
["CAFAP"]
["CAFCM"]
["CAFFS"]
["CAFKN"]
["CAFLR"]
["CAFLY"]
["CAFMA"]
["CAFOG"]
["CAFOR"]
["CAFRE"]
["CAFRR"]
["CAFRV"]
["CAFSD"]
["CAFSI"]
["CAFSM"]
["CAFWL"]
["CAFWS"]
["CAGAN"]
["CAGBT"]
["CAGCA"]
["CAGGS"]
["CAGLB"]
["CAGLT"]
["CAGMA"]
["CAGNN"]
["CAGOH"]
["CAGOO"]
["CAGOR"]
["CAGPD"]
["CAGPE"]
["CAGRB"]
["CAGRS"]
["CAHAB"]
["CAHAL"]
["CAHAM"]
["CAHAR"]
["CAHBN"]
["CAHBR"]
["CAHCC"]
["CAHEB"]
["CAHHB"]
["CAHIB"]
["CAHID"]
["CAHLI"]
["CAHMM"]
["CAHMP"]
["CAHOD"]
["CAHON"]
["CAHOP"]
["CAHPT"]
["CAHRE"]
["CAHRF"]
["CAHSP"]
["CAHVR"]
["CAHWS"]
["CAIAM"]
["CAIGL"]
["CAIKM"]
["CAILS"]
["CAIOC"]
["CAION"]
["CAIQL"]
["CAISL"]
["CAIVM"]
["CAIVN"]
["CAJAC"]
["CAJEG"]
["CAJEI"]
["CAKEE"]
["CAKHO"]
["CAKIN"]
["CAKKR"]
["CAKLO"]
["CAKLY"]
["CAKNE"]
["CAKOV"]
["CAKTM"]
["CAKVL"]
["CAKWI"]
["CALAC"]
["CALAD"]
["CALAH"]
["CALAW"]
["CALB3"]
["CALCH"]
["CALCO"]
["CALCP"]
["CALCV"]
["CALDN"]
["CALDS"]
["CALDT"]
["CALEV"]
["CALIC"]
["CALIN"]
["CALIV"]
["CALLF"]
["CALMD"]
["CALMN"]
["CALMW"]
["CALNG"]
["CALOB"]
["CALOH"]
["CALOP"]
["CALOU"]
["CALSE"]
["CALUN"]
["CALVH"]
["CALWB"]
["CALWH"]
["CALWP"]
["CALZV"]
["CAMAB"]
["CAMAG"]
["CAMAR"]
["CAMBR"]
["CAMDB"]
["CAMEB"]
["CAMET"]
["CAMFD"]
["CAMGD"]
["CAMGH"]
["CAMGT"]
["CAMHB"]
["CAMHN"]
["CAMIB"]
["CAMID"]
["CAMIH"]
["CAMIR"]
["CAMLK"]
["CAMNE"]
["CAMNI"]
["CAMNT"]
["CAMOB"]
["CAMOL"]
["CAMOU"]
["CAMRE"]
["CAMRI"]
["CAMSS"]
["CAMSV"]
["CAMSW"]
["CAMTI"]
["CAMTN"]
["CAMTO"]
["CAMTQ"]
["CAMTR"]
["CAMUL"]
["CAMUS"]
["CAMYO"]
["CANAF"]
["CANAI"]
["CANAK"]
["CANAN"]
["CANBC"]
["CANCT"]
["CANCV"]
["CANDL"]
["CANGL"]
["CANIA"]
["CANLS"]
["CANMT"]
["CANNE"]
["CANNO"]
["CANOL"]
["CANON"]
["CANRB"]
["CANRC"]
["CANS3"]
["CANSY"]
["CANTR"]
["CANVK"]
["CANWE"]
["CANWP"]
["CAOAJ"]
["CAOAK"]
["CAODE"]
["CAOFA"]
["CAOLS"]
["CAOON"]
["CAOPE"]
["CAOSH"]
["CAOTT"]
["CAOVR"]
["CAOWS"]
["CAPAB"]
["CAPAC"]
["CAPAF"]
["CAPAP"]
["CAPAQ"]
["CAPAR"]
["CAPAS"]
["CAPBQ"]
["CAPCA"]
["CAPCO"]
["CAPCR"]
["CAPDI"]
["CAPDL"]
["CAPDO"]
["CAPDV"]
["CAPEH"]
["CAPEL"]
["CAPEW"]
["CAPFT"]
["CAPHL"]
["CAPHM"]
["CAPHW"]
["CAPHY"]
["CAPIC"]
["CAPMA"]
["CAPME"]
["CAPML"]
["CAPMO"]
["CAPNE"]
["CAPNO"]
["CAPNT"]
["CAPOA"]
["CAPOI"]
["CAPOP"]
["CAPOU"]
["CAPOW"]
["CAPPC"]
["CAPPT"]
["CAPRE"]
["CAPRG"]
["CAPRP"]
["CAPRR"]
["CAPRS"]
["CAPSI"]
["CAPST"]
["CAPSV"]
["CAPTA"]
["CAPTB"]
["CAPTE"]
["CAPTH"]
["CAPTN"]
["CAPTO"]
["CAPTU"]
["CAPUG"]
["CAPWE"]
["CAPXT"]
["CAQCH"]
["CAQCS"]
["CAQLE"]
["CAQTS"]
["CAQUE"]
["CARAM"]
["CARBN"]
["CARCD"]
["CARDL"]
["CAREB"]
["CAREL"]
["CARIM"]
["CARIT"]
["CAROA"]
["CAROD"]
["CARPO"]
["CARRC"]
["CARRE"]
["CARSV"]
["CARTB"]
["CARUI"]
["CARUS"]
["CAS8A"]
["CASAD"]
["CASAG"]
["CASAT"]
["CASAU"]
["CASBD"]
["CASBH"]
["CASBU"]
["CASCA"]
["CASCP"]
["CASCT"]
["CASDM"]
["CASDN"]
["CASDY"]
["CASEB"]
["CASED"]
["CASEI"]
["CASEL"]
["CASEM"]
["CASEU"]
["CASF2"]
["CASFI"]
["CASFR"]
["CASFX"]
["CASHE"]
["CASHH"]
["CASHP"]
["CASHV"]
["CASIC"]
["CASID"]
["CASIM"]
["CASIO"]
["CASJB"]
["CASJF"]
["CASKE"]
["CASKI"]
["CASKL"]
["CASLB"]
["CASLK"]
["CASLT"]
["CASLW"]
["CASMS"]
["CASMT"]
["CASNI"]
["CASNV"]
["CASOM"]
["CASOO"]
["CASOR"]
["CASOU"]
["CASPA"]
["CASPD"]
["CASPI"]
["CASPN"]
["CASPR"]
["CASQA"]
["CASRA"]
["CASRO"]
["CASRS"]
["CASSM"]
["CASSP"]
["CASST"]
["CAST3"]
["CAST6"]
["CASTC"]
["CASTD"]
["CASTH"]
["CASTK"]
["CASTS"]
["CASTV"]
["CASTW"]
["CASUD"]
["CASUM"]
["CASUY"]
["CASVD"]
["CASYD"]
["CASYI"]
["CASYL"]
["CASYW"]
["CASZT"]
["CATAD"]
["CATAS"]
["CATBY"]
["CATCV"]
["CATEX"]
["CATHA"]
["CATHD"]
["CATHH"]
["CATHL"]
["CATHU"]
["CATJN"]
["CATLB"]
["CATNG"]
["CATOR"]
["CATRB"]
["CATRC"]
["CATRO"]
["CATRR"]
["CATTC"]
["CATTL"]
["CATUK"]
["CATWI"]
["CATWN"]
["CAUCL"]
["CAUPT"]
["CAVAN"]
["CAVCH"]
["CAVIC"]
["CAVIH"]
["CAVLF"]
["CAVND"]
["CAVOB"]
["CAVOS"]
["CAW4C"]
["CAWAI"]
["CAWAL"]
["CAWDR"]
["CAWEL"]
["CAWEP"]
["CAWEY"]
["CAWHF"]
["CAWHH"]
["CAWHI"]
["CAWIG"]
["CAWND"]
["CAWNP"]
["CAWOO"]
["CAWRF"]
["CAWTN"]
["CAWTO"]
["CAWVR"]
["CAWWO"]
["CAXJH"]
["CAXVX"]
["CAXZC"]
["CAYCB"]
["CAYCS"]
["CAYDH"]
["CAYEK"]
["CAYGZ"]
["CAYHK"]
["CAYKT"]
["CAYMD"]
["CAYMH"]
["CAYRH"]
["CAYWM"]
["CAYXN"]
["CAYZS"]
["CAZCR"]
["CAZEB"]
["CAZFT"]
["CAZTI"]
["CAZYE"]
["CC888"]
["CCCCK"]
["CD888"]
["CDBNW"]
["CDBOA"]
["CDFIH"]
["CDMAT"]
["CDMHB"]
["CDMKL"]
["CFTOG"]
["CG888"]
["CGAZR"]
["CGDJE"]
["CGMOS"]
["CGNKO"]
["CGOUE"]
["CGOYO"]
["CGPNR"]
["CGYOM"]
["CHBA8"]
["CHBIB"]
["CHBIR"]
["CHBLY"]
["CHBRU"]
["CHBRZ"]
["CHBSL"]
["CHBSM"]
["CHBTT"]
["CHBUR"]
["CHCBL"]
["CHCHE"]
["CHCHS"]
["CHCOP"]
["CHCVT"]
["CHDOT"]
["CHDSF"]
["CHEPS"]
["CHERB"]
["CHFEM"]
["CHFLA"]
["CHGEL"]
["CHGRG"]
["CHGTT"]
["CHHBG"]
["CHHHM"]
["CHHTE"]
["CHJJO"]
["CHK3L"]
["CHKPP"]
["CHKRZ"]
["CHKSS"]
["CHLDO"]
["CHLLU"]
["CHMAU"]
["CHMDF"]
["CHMIG"]
["CHMLN"]
["CHMWA"]
["CHN66"]
["CHNDB"]
["CHNEF"]
["CHODB"]
["CHPOR"]
["CHRGT"]
["CHRGU"]
["CHRMH"]
["CHRNB"]
["CHRRN"]
["CHSAS"]
["CHSEN"]
["CHSMK"]
["CHSSV"]
["CHSTA"]
["CHSTI"]
["CHTAN"]
["CHTTG"]
["CHTZE"]
["CHUKS"]
["CHVAU"]
["CHVS5"]
["CHVSX"]
["CHVZU"]
["CHWCW"]
["CHWLO"]
["CHXRE"]
["CHXXX"]
["CHXZX"]
["CI888"]
["CIABJ"]
["CIASS"]
["CIBAO"]
["CIDAB"]
["CIESP"]
["CIFRE"]
["CIGBA"]
["CIGLU"]
["CIJAC"]
["CIKOS"]
["CIPBT"]
["CISPY"]
["CIZSS"]
["CK888"]
["CKAIT"]
["CKAIU"]
["CKARU"]
["CKMGS"]
["CKMOI"]
["CKRAR"]
["CL888"]
["CLACH"]
["CLANF"]
["CLARA"]
["CLARI"]
["CLAYA"]
["CLBAG"]
["CLBAR"]
["CLBLR"]
["CLCAA"]
["CLCAL"]
["CLCBC"]
["CLCCA"]
["CLCCP"]
["CLCDV"]
["CLCGR"]
["CLCHB"]
["CLCHI"]
["CLCHO"]
["CLCHR"]
["CLCIS"]
["CLCLD"]
["CLCLR"]
["CLCNL"]
["CLCNR"]
["CLCNX"]
["CLCOL"]
["CLCPO"]
["CLCQQ"]
["CLCRH"]
["CLCRR"]
["CLCST"]
["CLDCH"]
["CLEDE"]
["CLGUA"]
["CLGYC"]
["CLHSO"]
["CLHUH"]
["CLIPC"]
["CLIQQ"]
["CLISG"]
["CLJFZ"]
["CLKNA"]
["CLLEB"]
["CLLIA"]
["CLLLI"]
["CLLOH"]
["CLLOS"]
["CLLQN"]
["CLLSC"]
["CLLTA"]
["CLLVT"]
["CLMIC"]
["CLMJS"]
["CLMLI"]
["CLMLL"]
["CLNAL"]
["CLOHI"]
["CLOVL"]
["CLPAG"]
["CLPAN"]
["CLPAT"]
["CLPCH"]
["CLPCK"]
["CLPEO"]
["CLPGA"]
["CLPIS"]
["CLPMC"]
["CLPNT"]
["CLPOC"]
["CLPOS"]
["CLPPD"]
["CLPPY"]
["CLPQD"]
["CLPTC"]
["CLPTE"]
["CLPTI"]
["CLPUQ"]
["CLPVS"]
["CLQCO"]
["CLQLN"]
["CLQMC"]
["CLQTV"]
["CLQUV"]
["CLRAF"]
["CLSAA"]
["CLSAI"]
["CLSVE"]
["CLTAL"]
["CLTLX"]
["CLTOM"]
["CLTON"]
["CLTOQ"]
["CLTOR"]
["CLTPT"]
["CLTTC"]
["CLVAP"]
["CLVIL"]
["CLVNT"]
["CLWCA"]
["CLWCH"]
["CLWPA"]
["CLWPU"]
["CLZAL"]
["CLZOS"]
["CLZUD"]
["CM888"]
["CMDLA"]
["CMGOU"]
["CMKBI"]
["CMKOL"]
["CMKUM"]
["CMLIM"]
["CMLIT"]
["CMMOU"]
["CMMSG"]
["CMTKC"]
["CN888"]
["CNAIN"]
["CNAJG"]
["CNANG"]
["CNANQ"]
["CNANT"]
["CNAPP"]
["CNAQG"]
["CNASW"]
["CNBAH"]
["CNBAU"]
["CNBCG"]
["CNBCO"]
["CNBDG"]
["CNBEI"]
["CNBHE"]
["CNBHT"]
["CNBHX"]
["CNBIC"]
["CNBIH"]
["CNBIJ"]
["CNBIY"]
["CNBLG"]
["CNBLI"]
["CNBLO"]
["CNBLX"]
["CNBMJ"]
["CNBOA"]
["CNBSD"]
["CNBSE"]
["CNBSI"]
["CNBSP"]
["CNBYA"]
["CNBYG"]
["CNBYN"]
["CNBYQ"]
["CNBZG"]
["CNCAH"]
["CNCBG"]
["CNCBI"]
["CNCDH"]
["CNCFD"]
["CNCFF"]
["CNCGJ"]
["CNCGM"]
["CNCGS"]
["CNCGW"]
["CNCGZ"]
["CNCHE"]
["CNCHI"]
["CNCHQ"]
["CNCHS"]
["CNCHU"]
["CNCHX"]
["CNCHY"]
["CNCHZ"]
["CNCIG"]
["CNCIV"]
["CNCIX"]
["CNCJA"]
["CNCJG"]
["CNCJI"]
["CNCLJ"]
["CNCNG"]
["CNCNX"]
["CNCOZ"]
["CNCQI"]
["CNCSH"]
["CNCSJ"]
["CNCSL"]
["CNCSO"]
["CNCUM"]
["CNCUN"]
["CNCWN"]
["CNCYH"]
["CNCZX"]
["CNDAA"]
["CNDAG"]
["CNDAL"]
["CNDAN"]
["CNDAS"]
["CNDAX"]
["CNDAY"]
["CNDBG"]
["CNDBX"]
["CNDCB"]
["CNDCG"]
["CNDDD"]
["CNDDG"]
["CNDDK"]
["CNDDP"]
["CNDDW"]
["CNDDZ"]
["CNDEF"]
["CNDEZ"]
["CNDFA"]
["CNDFG"]
["CNDFN"]
["CNDGG"]
["CNDGN"]
["CNDGP"]
["CNDGU"]
["CNDHD"]
["CNDHP"]
["CNDHU"]
["CNDIA"]
["CNDIZ"]
["CNDJG"]
["CNDJI"]
["CNDJK"]
["CNDJO"]
["CNDJT"]
["CNDLD"]
["CNDLI"]
["CNDMJ"]
["CNDMX"]
["CNDMY"]
["CNDNG"]
["CNDNT"]
["CNDOP"]
["CNDOU"]
["CNDOX"]
["CNDOZ"]
["CNDPG"]
["CNDQD"]
["CNDSA"]
["CNDSB"]
["CNDSH"]
["CNDSI"]
["CNDSN"]
["CNDSO"]
["CNDTZ"]
["CNDWN"]
["CNDXU"]
["CNDYI"]
["CNDYN"]
["CNDYW"]
["CNDZM"]
["CNEBA"]
["CNECG"]
["CNEGN"]
["CNENP"]
["CNETK"]
["CNEZH"]
["CNFAG"]
["CNFAN"]
["CNFCH"]
["CNFDU"]
["CNFJE"]
["CNFKI"]
["CNFKJ"]
["CNFLG"]
["CNFNG"]
["CNFQX"]
["CNFRT"]
["CNFSA"]
["CNFSI"]
["CNFUC"]
["CNFUJ"]
["CNFUY"]
["CNFWN"]
["CNFXG"]
["CNFZG"]
["CNFZH"]
["CNFZL"]
["CNFZX"]
["CNGAO"]
["CNGBG"]
["CNGBT"]
["CNGCH"]
["CNGDI"]
["CNGGK"]
["CNGGN"]
["CNGGU"]
["CNGGZ"]
["CNGHI"]
["CNGIS"]
["CNGLG"]
["CNGLI"]
["CNGLN"]
["CNGNG"]
["CNGNI"]
["CNGOG"]
["CNGOM"]
["CNGON"]
["CNGPG"]
["CNGSA"]
["CNGSH"]
["CNGUG"]
["CNGUI"]
["CNGUL"]
["CNGUT"]
["CNGYN"]
["CNGYO"]
["CNGZC"]
["CNGZE"]
["CNGZG"]
["CNHAQ"]
["CNHAS"]
["CNHBG"]
["CNHCN"]
["CNHDG"]
["CNHDN"]
["CNHEB"]
["CNHEK"]
["CNHGA"]
["CNHGG"]
["CNHGJ"]
["CNHGN"]
["CNHHT"]
["CNHID"]
["CNHIG"]
["CNHIJ"]
["CNHIK"]
["CNHIM"]
["CNHJI"]
["CNHKO"]
["CNHKU"]
["CNHLE"]
["CNHLI"]
["CNHLJ"]
["CNHLW"]
["CNHME"]
["CNHMN"]
["CNHNH"]
["CNHNI"]
["CNHNS"]
["CNHOD"]
["CNHOH"]
["CNHOQ"]
["CNHOU"]
["CNHRN"]
["CNHSC"]
["CNHSI"]
["CNHSK"]
["CNHSN"]
["CNHST"]
["CNHTG"]
["CNHTO"]
["CNHUA"]
["CNHUD"]
["CNHUE"]
["CNHUH"]
["CNHUI"]
["CNHUL"]
["CNHUM"]
["CNHUN"]
["CNHUP"]
["CNHUS"]
["CNHUY"]
["CNHXA"]
["CNHXE"]
["CNHXG"]
["CNHYN"]
["CNHZH"]
["CNHZO"]
["CNHZU"]
["CNIMA"]
["CNING"]
["CNJAA"]
["CNJAX"]
["CNJAY"]
["CNJBI"]
["CNJCH"]
["CNJCN"]
["CNJDR"]
["CNJES"]
["CNJGJ"]
["CNJGU"]
["CNJGY"]
["CNJHK"]
["CNJIA"]
["CNJIJ"]
["CNJIP"]
["CNJIS"]
["CNJIU"]
["CNJIZ"]
["CNJKO"]
["CNJLI"]
["CNJLP"]
["CNJMN"]
["CNJMS"]
["CNJMY"]
["CNJNH"]
["CNJNL"]
["CNJNZ"]
["CNJOG"]
["CNJOK"]
["CNJPI"]
["CNJPU"]
["CNJRG"]
["CNJSG"]
["CNJTG"]
["CNJTO"]
["CNJUJ"]
["CNJUL"]
["CNJUZ"]
["CNJXN"]
["CNJZK"]
["CNJZU"]
["CNKFG"]
["CNKMN"]
["CNKZG"]
["CNLAL"]
["CNLCP"]
["CNLDK"]
["CNLFN"]
["CNLGA"]
["CNLGI"]
["CNLGU"]
["CNLGW"]
["CNLGY"]
["CNLID"]
["CNLIH"]
["CNLIJ"]
["CNLIU"]
["CNLIZ"]
["CNLJD"]
["CNLJK"]
["CNLJN"]
["CNLJP"]
["CNLJQ"]
["CNLJT"]
["CNLJY"]
["CNLKP"]
["CNLKU"]
["CNLLI"]
["CNLMG"]
["CNLMN"]
["CNLNH"]
["CNLNN"]
["CNLNS"]
["CNLOH"]
["CNLOZ"]
["CNLPG"]
["CNLPP"]
["CNLQI"]
["CNLSH"]
["CNLSN"]
["CNLSX"]
["CNLTP"]
["CNLUB"]
["CNLUD"]
["CNLUH"]
["CNLUI"]
["CNLUN"]
["CNLUS"]
["CNLUZ"]
["CNLXH"]
["CNLXI"]
["CNLXP"]
["CNLYG"]
["CNLYP"]
["CNLZH"]
["CNLZI"]
["CNLZL"]
["CNLZO"]
["CNLZP"]
["CNMAA"]
["CNMAC"]
["CNMAJ"]
["CNMAW"]
["CNMAY"]
["CNMBI"]
["CNMGG"]
["CNMHG"]
["CNMIO"]
["CNMIY"]
["CNMJD"]
["CNMJS"]
["CNMLG"]
["CNMLI"]
["CNMOG"]
["CNMOH"]
["CNMOT"]
["CNMPP"]
["CNMSA"]
["CNMSG"]
["CNMSN"]
["CNMSP"]
["CNMTZ"]
["CNMWN"]
["CNMYM"]
["CNMZU"]
["CNMZW"]
["CNNAD"]
["CNNAH"]
["CNNAN"]
["CNNBG"]
["CNNBO"]
["CNNCA"]
["CNNDE"]
["CNNDS"]
["CNNEG"]
["CNNHN"]
["CNNHS"]
["CNNIG"]
["CNNIN"]
["CNNJG"]
["CNNJI"]
["CNNJK"]
["CNNKL"]
["CNNMI"]
["CNNNX"]
["CNNSA"]
["CNNSY"]
["CNNTG"]
["CNNTN"]
["CNNUD"]
["CNNXI"]
["CNPAJ"]
["CNPDG"]
["CNPDX"]
["CNPGN"]
["CNPGZ"]
["CNPHB"]
["CNPIL"]
["CNPJO"]
["CNPJS"]
["CNPKO"]
["CNPLI"]
["CNPNT"]
["CNPNY"]
["CNPQA"]
["CNPQI"]
["CNPSH"]
["CNPTJ"]
["CNPTS"]
["CNPUT"]
["CNPXI"]
["CNPXM"]
["CNPYG"]
["CNPZE"]
["CNPZO"]
["CNQAW"]
["CNQDG"]
["CNQDL"]
["CNQGG"]
["CNQGS"]
["CNQGY"]
["CNQHE"]
["CNQIG"]
["CNQIN"]
["CNQJG"]
["CNQJI"]
["CNQJO"]
["CNQKE"]
["CNQKU"]
["CNQLN"]
["CNQMN"]
["CNQNH"]
["CNQSA"]
["CNQSE"]
["CNQSN"]
["CNQXT"]
["CNQYA"]
["CNQZC"]
["CNQZH"]
["CNQZJ"]
["CNQZL"]
["CNQZO"]
["CNRAG"]
["CNRCG"]
["CNRCH"]
["CNRGA"]
["CNRGC"]
["CNRIA"]
["CNRJG"]
["CNRJN"]
["CNROH"]
["CNROQ"]
["CNRPG"]
["CNRSI"]
["CNRSN"]
["CNRUG"]
["CNRZH"]
["CNSAA"]
["CNSAJ"]
["CNSAM"]
["CNSAN"]
["CNSAP"]
["CNSAT"]
["CNSAW"]
["CNSBH"]
["CNSBM"]
["CNSBN"]
["CNSBU"]
["CNSDG"]
["CNSDP"]
["CNSEY"]
["CNSEZ"]
["CNSGH"]
["CNSGJ"]
["CNSGU"]
["CNSHD"]
["CNSHG"]
["CNSHH"]
["CNSHK"]
["CNSHL"]
["CNSHM"]
["CNSHO"]
["CNSHP"]
["CNSHQ"]
["CNSHT"]
["CNSHX"]
["CNSIG"]
["CNSIJ"]
["CNSIK"]
["CNSIP"]
["CNSIQ"]
["CNSIU"]
["CNSIZ"]
["CNSJJ"]
["CNSJO"]
["CNSJQ"]
["CNSJT"]
["CNSJU"]
["CNSKS"]
["CNSLG"]
["CNSLO"]
["CNSMN"]
["CNSNA"]
["CNSNH"]
["CNSNN"]
["CNSNS"]
["CNSNW"]
["CNSNZ"]
["CNSOG"]
["CNSON"]
["CNSPA"]
["CNSPI"]
["CNSQN"]
["CNSRG"]
["CNSSG"]
["CNSSN"]
["CNSSP"]
["CNSTB"]
["CNSTG"]
["CNSTI"]
["CNSUD"]
["CNSUW"]
["CNSWE"]
["CNSWI"]
["CNSXB"]
["CNSXJ"]
["CNSYA"]
["CNSYC"]
["CNSYG"]
["CNSYM"]
["CNSZA"]
["CNSZG"]
["CNSZH"]
["CNSZK"]
["CNSZO"]
["CNSZP"]
["CNTAC"]
["CNTAP"]
["CNTAX"]
["CNTAZ"]
["CNTBS"]
["CNTFG"]
["CNTGG"]
["CNTGS"]
["CNTID"]
["CNTIS"]
["CNTIY"]
["CNTJA"]
["CNTJD"]
["CNTJG"]
["CNTNC"]
["CNTNG"]
["CNTNJ"]
["CNTNO"]
["CNTOH"]
["CNTOJ"]
["CNTOL"]
["CNTOX"]
["CNTOZ"]
["CNTPK"]
["CNTPW"]
["CNTQO"]
["CNTSG"]
["CNTXG"]
["CNTXI"]
["CNTXZ"]
["CNTZE"]
["CNTZO"]
["CNTZU"]
["CNUBU"]
["CNWAS"]
["CNWAX"]
["CNWAZ"]
["CNWCH"]
["CNWEF"]
["CNWEG"]
["CNWEH"]
["CNWEI"]
["CNWGQ"]
["CNWHE"]
["CNWHG"]
["CNWHI"]
["CNWHR"]
["CNWHU"]
["CNWHZ"]
["CNWIG"]
["CNWIH"]
["CNWIT"]
["CNWJG"]
["CNWJI"]
["CNWSA"]
["CNWSH"]
["CNWSN"]
["CNWUC"]
["CNWUG"]
["CNWUK"]
["CNWUZ"]
["CNWXA"]
["CNWXP"]
["CNWXS"]
["CNWYK"]
["CNWYP"]
["CNWZH"]
["CNWZO"]
["CNXAG"]
["CNXAM"]
["CNXAO"]
["CNXAS"]
["CNXCE"]
["CNXCG"]
["CNXCI"]
["CNXCU"]
["CNXDI"]
["CNXDJ"]
["CNXDU"]
["CNXEO"]
["CNXEX"]
["CNXGA"]
["CNXGD"]
["CNXGK"]
["CNXGZ"]
["CNXHH"]
["CNXHK"]
["CNXHO"]
["CNXHT"]
["CNXIA"]
["CNXID"]
["CNXIH"]
["CNXIJ"]
["CNXIK"]
["CNXIN"]
["CNXIP"]
["CNXIT"]
["CNXJB"]
["CNXJD"]
["CNXLS"]
["CNXMG"]
["CNXMH"]
["CNXML"]
["CNXNA"]
["CNXNG"]
["CNXNI"]
["CNXOT"]
["CNXSI"]
["CNXSP"]
["CNXTA"]
["CNXTI"]
["CNXTN"]
["CNXTO"]
["CNXTZ"]
["CNXUA"]
["CNXUK"]
["CNXUL"]
["CNXUM"]
["CNXWH"]
["CNXXY"]
["CNXYG"]
["CNXYI"]
["CNXYN"]
["CNXZI"]
["CNXZU"]
["CNYAT"]
["CNYBG"]
["CNYCA"]
["CNYCG"]
["CNYFU"]
["CNYGD"]
["CNYGK"]
["CNYGN"]
["CNYGO"]
["CNYGX"]
["CNYHG"]
["CNYIB"]
["CNYIK"]
["CNYIZ"]
["CNYJA"]
["CNYJC"]
["CNYJI"]
["CNYJP"]
["CNYKG"]
["CNYKU"]
["CNYLA"]
["CNYLI"]
["CNYLO"]
["CNYMD"]
["CNYNG"]
["CNYNN"]
["CNYPE"]
["CNYPG"]
["CNYSA"]
["CNYSH"]
["CNYSN"]
["CNYSO"]
["CNYTG"]
["CNYTI"]
["CNYTN"]
["CNYUH"]
["CNYXS"]
["CNYXT"]
["CNYYA"]
["CNYYP"]
["CNYZH"]
["CNYZU"]
["CNZAG"]
["CNZCG"]
["CNZDO"]
["CNZEL"]
["CNZGS"]
["CNZGT"]
["CNZGW"]
["CNZHE"]
["CNZHG"]
["CNZHH"]
["CNZHI"]
["CNZHY"]
["CNZIY"]
["CNZJB"]
["CNZJG"]
["CNZLO"]
["CNZNG"]
["CNZNZ"]
["CNZOS"]
["CNZPG"]
["CNZPI"]
["CNZPK"]
["CNZPO"]
["CNZPU"]
["CNZQG"]
["CNZQJ"]
["CNZSM"]
["CNZSN"]
["CNZUH"]
["CNZUS"]
["CNZUY"]
["CNZXI"]
["CNZXN"]
["CNZXZ"]
["CNZYG"]
["CNZYO"]
["CNZZG"]
["CNZZU"]
["CO888"]
["COACM"]
["COBAL"]
["COBAQ"]
["COBUN"]
["COCIE"]
["COCNR"]
["COCOV"]
["COCRC"]
["COCTG"]
["COEBQ"]
["COEJA"]
["COENV"]
["COLET"]
["COMAM"]
["COMAU"]
["COMIN"]
["COPBE"]
["COPBO"]
["COPCR"]
["COPNM"]
["COPOC"]
["COPSB"]
["COPUC"]
["COPUL"]
["COPUU"]
["COPYA"]
["CORCH"]
["CORCO"]
["COSMR"]
["COSPC"]
["COTCO"]
["COTLU"]
["COTRB"]
["COYMB"]
["CR888"]
["CRABG"]
["CRBAT"]
["CRCAB"]
["CRCAI"]
["CRCAL"]
["CRCDN"]
["CRCIR"]
["CRCOM"]
["CRCRR"]
["CRCTC"]
["CRCUT"]
["CRCYL"]
["CRFIL"]
["CRFPN"]
["CRGDA"]
["CRGDP"]
["CRGLF"]
["CRGUA"]
["CRHSA"]
["CRJIC"]
["CRLAF"]
["CRLIO"]
["CRMAT"]
["CRMOB"]
["CRMTZ"]
["CRMUE"]
["CRNAN"]
["CRNAR"]
["CRORO"]
["CRPAN"]
["CRPAR"]
["CRPAS"]
["CRPEN"]
["CRPIT"]
["CRPMN"]
["CRPOA"]
["CRPTC"]
["CRPUM"]
["CRQGG"]
["CRRCD"]
["CRRIO"]
["CRRJI"]
["CRROX"]
["CRSAB"]
["CRSAM"]
["CRSAN"]
["CRSIX"]
["CRSJO"]
["CRSMP"]
["CRSPI"]
["CRSRG"]
["CRSRI"]
["CRSRP"]
["CRSSP"]
["CRTIG"]
["CRTRE"]
["CRTUA"]
["CRVDT"]
["CRXQP"]
["CRZAR"]
["CU888"]
["CUBAN"]
["CUBCA"]
["CUBHO"]
["CUBOG"]
["CUBUF"]
["CUCAB"]
["CUCAI"]
["CUCAR"]
["CUCAS"]
["CUCEI"]
["CUCFG"]
["CUCMW"]
["CUGER"]
["CUGIB"]
["CUGUB"]
["CUGYB"]
["CUHAV"]
["CUICR"]
["CUIDS"]
["CUJUC"]
["CUMAR"]
["CUMEL"]
["CUMNT"]
["CUMOA"]
["CUMZO"]
["CUNIQ"]
["CUNVT"]
["CUPAL"]
["CUPAS"]
["CUPPA"]
["CUPTA"]
["CUQCO"]
["CUQMA"]
["CURSL"]
["CUSCS"]
["CUSCU"]
["CUSDT"]
["CUSNU"]
["CUTDZ"]
["CUVIT"]
["CV888"]
["CVGRA"]
["CVMIN"]
["CVPAL"]
["CVPOI"]
["CVPON"]
["CVRAI"]
["CVSAR"]
["CVTAR"]
["CVVXE"]
["CW888"]
["CWBUB"]
["CWCRB"]
["CWCUR"]
["CWFUI"]
["CWSMB"]
["CWWIL"]
["CX888"]
["CXFFC"]
["CY888"]
["CY88P"]
["CY88R"]
["CYAKT"]
["CYDHK"]
["CYFMG"]
["CYKAR"]
["CYKYR"]
["CYLAT"]
["CYLCA"]
["CYLMS"]
["CYMOI"]
["CYNIC"]
["CYPFO"]
["CYVAS"]
["CYVTE"]
["CYZYY"]
["CZBAR"]
["CZBBC"]
["CZBBE"]
["CZBDC"]
["CZBLN"]
["CZBOL"]
["CZBRA"]
["CZBTC"]
["CZBUB"]
["CZBYS"]
["CZC7V"]
["CZCCN"]
["CZCEP"]
["CZCEV"]
["CZCHU"]
["CZCHZ"]
["CZCRS"]
["CZCUL"]
["CZDCB"]
["CZDDD"]
["CZDEK"]
["CZDIS"]
["CZDIV"]
["CZDKV"]
["CZDOB"]
["CZDOH"]
["CZDOL"]
["CZDRN"]
["CZDRO"]
["CZDRS"]
["CZG44"]
["CZHLP"]
["CZHLU"]
["CZHOT"]
["CZHRN"]
["CZHRU"]
["CZHSA"]
["CZHST"]
["CZHTV"]
["CZJAB"]
["CZJEN"]
["CZJIE"]
["CZJK6"]
["CZKAD"]
["CZKKA"]
["CZKNV"]
["CZKOQ"]
["CZKOR"]
["CZKRB"]
["CZKSL"]
["CZKUV"]
["CZLBC"]
["CZLCC"]
["CZLEC"]
["CZLOB"]
["CZLOD"]
["CZLOE"]
["CZLUK"]
["CZMCE"]
["CZMIB"]
["CZMNV"]
["CZMOR"]
["CZMRA"]
["CZMYT"]
["CZNEH"]
["CZNET"]
["CZNKN"]
["CZNRT"]
["CZNVV"]
["CZOCX"]
["CZODO"]
["CZOSI"]
["CZOVK"]
["CZOVV"]
["CZPAO"]
["CZPAU"]
["CZPNA"]
["CZPNJ"]
["CZPOP"]
["CZPRG"]
["CZRAJ"]
["CZRAU"]
["CZRDN"]
["CZRNH"]
["CZSDO"]
["CZSEM"]
["CZSK5"]
["CZSKJ"]
["CZSMO"]
["CZSPC"]
["CZSTA"]
["CZSTE"]
["CZSTT"]
["CZTIS"]
["CZTNN"]
["CZTOM"]
["CZTUC"]
["CZTVA"]
["CZULN"]
["CZVAA"]
["CZVES"]
["CZVKA"]
["CZVRY"]
["CZXUY"]
["CZXXX"]
["CZZLY"]
["DE23A"]
["DE2RO"]
["DE3L4"]
["DE6NK"]
["DE73A"]
["DE888"]
["DE88P"]
["DE88R"]
["DEAAD"]
["DEAAH"]
["DEABF"]
["DEABH"]
["DEABL"]
["DEABO"]
["DEABR"]
["DEADT"]
["DEAEB"]
["DEAGB"]
["DEAGE"]
["DEAHC"]
["DEAHH"]
["DEAHO"]
["DEAHU"]
["DEAIT"]
["DEALF"]
["DEALT"]
["DEAMB"]
["DEAML"]
["DEAMR"]
["DEAND"]
["DEANE"]
["DEANK"]
["DEANR"]
["DEAPE"]
["DEAPN"]
["DEAQ2"]
["DEAQF"]
["DEARL"]
["DEARN"]
["DEASC"]
["DEASE"]
["DEASR"]
["DEASS"]
["DEATL"]
["DEAUG"]
["DEAUL"]
["DEAUO"]
["DEAUR"]
["DEAWI"]
["DEAWR"]
["DEAXB"]
["DEB85"]
["DEBAM"]
["DEBAS"]
["DEBBG"]
["DEBBH"]
["DEBBI"]
["DEBBV"]
["DEBCO"]
["DEBCT"]
["DEBCW"]
["DEBDA"]
["DEBDF"]
["DEBDS"]
["DEBEI"]
["DEBEK"]
["DEBEN"]
["DEBER"]
["DEBES"]
["DEBEU"]
["DEBEV"]
["DEBEZ"]
["DEBFF"]
["DEBFH"]
["DEBFL"]
["DEBGL"]
["DEBGO"]
["DEBHE"]
["DEBIN"]
["DEBIW"]
["DEBKE"]
["DEBKF"]
["DEBKW"]
["DEBLD"]
["DEBLM"]
["DEBMK"]
["DEBMN"]
["DEBMO"]
["DEBMR"]
["DEBMV"]
["DEBNK"]
["DEBOC"]
["DEBOE"]
["DEBOF"]
["DEBOI"]
["DEBOK"]
["DEBON"]
["DEBOT"]
["DEBOY"]
["DEBQ2"]
["DEBRA"]
["DEBRB"]
["DEBRE"]
["DEBRG"]
["DEBRI"]
["DEBRK"]
["DEBRM"]
["DEBRN"]
["DEBRO"]
["DEBRT"]
["DEBRV"]
["DEBSA"]
["DEBSH"]
["DEBSI"]
["DEBSK"]
["DEBTA"]
["DEBTC"]
["DEBTF"]
["DEBTI"]
["DEBUL"]
["DEBUM"]
["DEBUT"]
["DEBUX"]
["DEBUZ"]
["DEBWE"]
["DEBWJ"]
["DEBWQ"]
["DEBXB"]
["DEBXN"]
["DEBYT"]
["DEBYW"]
["DEBZQ"]
["DEBZR"]
["DEBZS"]
["DECAR"]
["DECCC"]
["DECGN"]
["DECH5"]
["DECHI"]
["DECHL"]
["DECKH"]
["DECKK"]
["DECKL"]
["DECOC"]
["DECPZ"]
["DECRL"]
["DECRR"]
["DECUM"]
["DECUX"]
["DECWN"]
["DECYN"]
["DEDAD"]
["DEDAG"]
["DEDAN"]
["DEDAP"]
["DEDAT"]
["DEDCH"]
["DEDDD"]
["DEDE3"]
["DEDE8"]
["DEDEB"]
["DEDEE"]
["DEDEG"]
["DEDEO"]
["DEDEU"]
["DEDFN"]
["DEDFX"]
["DEDGA"]
["DEDHM"]
["DEDIA"]
["DEDIN"]
["DEDIT"]
["DEDMG"]
["DEDMN"]
["DEDNR"]
["DEDNT"]
["DEDOB"]
["DEDON"]
["DEDOW"]
["DEDR5"]
["DEDRA"]
["DEDRO"]
["DEDRP"]
["DEDRS"]
["DEDSB"]
["DEDSC"]
["DEDSU"]
["DEDT8"]
["DEDTM"]
["DEDUI"]
["DEDUL"]
["DEDUS"]
["DEDVE"]
["DEDWD"]
["DEDYK"]
["DEEAM"]
["DEEAU"]
["DEEAX"]
["DEEBB"]
["DEEBI"]
["DEECK"]
["DEEDD"]
["DEEDI"]
["DEEEM"]
["DEEFE"]
["DEEGC"]
["DEEGJ"]
["DEEGL"]
["DEEHI"]
["DEEHM"]
["DEEHS"]
["DEELB"]
["DEELF"]
["DEELG"]
["DEELM"]
["DEELS"]
["DEEM4"]
["DEEME"]
["DEEMM"]
["DEEOM"]
["DEERA"]
["DEERX"]
["DEERY"]
["DEESF"]
["DEESS"]
["DEESU"]
["DEETN"]
["DEETY"]
["DEEUT"]
["DEEZH"]
["DEEZN"]
["DEFBR"]
["DEFDH"]
["DEFER"]
["DEFES"]
["DEFFO"]
["DEFHE"]
["DEFHL"]
["DEFHM"]
["DEFLF"]
["DEFNW"]
["DEFRA"]
["DEFRE"]
["DEFRI"]
["DEFRR"]
["DEFSH"]
["DEFWH"]
["DEFYE"]
["DEGAO"]
["DEGBX"]
["DEGDO"]
["DEGDZ"]
["DEGEK"]
["DEGEL"]
["DEGEM"]
["DEGER"]
["DEGEV"]
["DEGFD"]
["DEGFF"]
["DEGHM"]
["DEGHZ"]
["DEGIG"]
["DEGIT"]
["DEGJ9"]
["DEGKG"]
["DEGKR"]
["DEGL3"]
["DEGLK"]
["DEGLU"]
["DEGMN"]
["DEGMR"]
["DEGMV"]
["DEGNL"]
["DEGNP"]
["DEGNR"]
["DEGNU"]
["DEGNX"]
["DEGO4"]
["DEGPR"]
["DEGRD"]
["DEGRE"]
["DEGRO"]
["DEGS5"]
["DEGSA"]
["DEGSI"]
["DEGST"]
["DEGTR"]
["DEGUE"]
["DEGUG"]
["DEGUZ"]
["DEGXG"]
["DEGXN"]
["DEGXR"]
["DEGXS"]
["DEGYM"]
["DEGZG"]
["DEH54"]
["DEHAF"]
["DEHAJ"]
["DEHAM"]
["DEHAN"]
["DEHAO"]
["DEHAS"]
["DEHAU"]
["DEHBO"]
["DEHBR"]
["DEHBU"]
["DEHCS"]
["DEHD8"]
["DEHDI"]
["DEHE5"]
["DEHED"]
["DEHEE"]
["DEHEI"]
["DEHEN"]
["DEHGE"]
["DEHGL"]
["DEHGZ"]
["DEHH7"]
["DEHHF"]
["DEHHL"]
["DEHHO"]
["DEHHS"]
["DEHHV"]
["DEHIE"]
["DEHJK"]
["DEHLH"]
["DEHLN"]
["DEHLO"]
["DEHLP"]
["DEHME"]
["DEHML"]
["DEHMM"]
["DEHMO"]
["DEHNF"]
["DEHO4"]
["DEHOB"]
["DEHOD"]
["DEHOJ"]
["DEHOO"]
["DEHOS"]
["DEHOX"]
["DEHPE"]
["DEHRB"]
["DEHRC"]
["DEHRE"]
["DEHRM"]
["DEHRN"]
["DEHRO"]
["DEHRT"]
["DEHRX"]
["DEHSA"]
["DEHSB"]
["DEHSI"]
["DEHSJ"]
["DEHSU"]
["DEHSX"]
["DEHTJ"]
["DEHTU"]
["DEHUB"]
["DEHUS"]
["DEHUX"]
["DEHZN"]
["DEHZZ"]
["DEIAM"]
["DEIEN"]
["DEIEW"]
["DEIGH"]
["DEIHL"]
["DEILE"]
["DEILH"]
["DEING"]
["DEINM"]
["DEISP"]
["DEISU"]
["DEITH"]
["DEITN"]
["DEITZ"]
["DEIWN"]
["DEJEM"]
["DEJIV"]
["DEJSN"]
["DEJTN"]
["DEJUI"]
["DEJUY"]
["DEKAE"]
["DEKAM"]
["DEKAP"]
["DEKAR"]
["DEKB6"]
["DEKBN"]
["DEKBR"]
["DEKCO"]
["DEKDT"]
["DEKEB"]
["DEKEH"]
["DEKEL"]
["DEKEM"]
["DEKEZ"]
["DEKFT"]
["DEKGM"]
["DEKGU"]
["DEKHN"]
["DEKHO"]
["DEKHU"]
["DEKIE"]
["DEKIT"]
["DEKKU"]
["DEKLS"]
["DEKLX"]
["DEKMT"]
["DEKNT"]
["DEKOB"]
["DEKOF"]
["DEKOL"]
["DEKON"]
["DEKOP"]
["DEKOW"]
["DEKPE"]
["DEKPF"]
["DEKR9"]
["DEKRA"]
["DEKRE"]
["DEKRV"]
["DEKTN"]
["DEKUP"]
["DEKUT"]
["DEKVG"]
["DEKWH"]
["DEKZB"]
["DELAB"]
["DELAD"]
["DELAE"]
["DELAM"]
["DELAT"]
["DELAW"]
["DELBC"]
["DELBM"]
["DELCW"]
["DELDH"]
["DELDM"]
["DELEE"]
["DELER"]
["DELEV"]
["DELEW"]
["DELGB"]
["DELGO"]
["DELGX"]
["DELHD"]
["DELIA"]
["DELIB"]
["DELIG"]
["DELIN"]
["DELIS"]
["DELIU"]
["DELIZ"]
["DELKI"]
["DELLI"]
["DELLS"]
["DELNH"]
["DELNU"]
["DELON"]
["DELOW"]
["DELPH"]
["DELPQ"]
["DELRC"]
["DELRN"]
["DELS4"]
["DELSA"]
["DELSH"]
["DELSR"]
["DELSU"]
["DELT9"]
["DELTF"]
["DELUH"]
["DELYY"]
["DELZ6"]
["DELZG"]
["DEM5B"]
["DEMAG"]
["DEMAI"]
["DEMAM"]
["DEMDI"]
["DEME8"]
["DEMEI"]
["DEMEL"]
["DEMEM"]
["DEMFL"]
["DEMGW"]
["DEMHA"]
["DEMHG"]
["DEMHM"]
["DEMHR"]
["DEMIB"]
["DEMID"]
["DEMIL"]
["DEMIM"]
["DEMIN"]
["DEMLO"]
["DEMMF"]
["DEMMI"]
["DEMMM"]
["DEMMO"]
["DEMNF"]
["DEMNM"]
["DEMNQ"]
["DEMOE"]
["DEMOZ"]
["DEMRM"]
["DEMRS"]
["DEMRU"]
["DEMSB"]
["DEMSH"]
["DEMSK"]
["DEMSR"]
["DEMTD"]
["DEMUH"]
["DEMUK"]
["DEMUN"]
["DEMV5"]
["DEMVD"]
["DEMWF"]
["DEMWW"]
["DEMXA"]
["DEMXB"]
["DEMXM"]
["DEMZE"]
["DENBD"]
["DENCA"]
["DENCZ"]
["DENDQ"]
["DENED"]
["DENEF"]
["DENEH"]
["DENEL"]
["DENES"]
["DENFE"]
["DENGH"]
["DENGL"]
["DENHA"]
["DENHE"]
["DENHL"]
["DENHN"]
["DENHO"]
["DENHS"]
["DENIE"]
["DENIH"]
["DENMN"]
["DENN4"]
["DENNH"]
["DENNP"]
["DENO9"]
["DENOD"]
["DENOE"]
["DENOR"]
["DENRD"]
["DENSC"]
["DENSE"]
["DENSS"]
["DENST"]
["DENSV"]
["DENSY"]
["DENTA"]
["DENUE"]
["DENWC"]
["DENZE"]
["DENZM"]
["DEOAB"]
["DEOAN"]
["DEOBE"]
["DEOEE"]
["DEOEX"]
["DEOFF"]
["DEOHE"]
["DEOHL"]
["DEOIN"]
["DEOKE"]
["DEOKG"]
["DEOKY"]
["DEOLB"]
["DEOLD"]
["DEOLK"]
["DEOLM"]
["DEOLO"]
["DEOLP"]
["DEOLU"]
["DEONG"]
["DEOPP"]
["DEORM"]
["DEORS"]
["DEORT"]
["DEOSB"]
["DEOSL"]
["DEOSN"]
["DEOSR"]
["DEOSW"]
["DEOTK"]
["DEOTT"]
["DEOWH"]
["DEOWT"]
["DEPAH"]
["DEPAP"]
["DEPAS"]
["DEPCE"]
["DEPEF"]
["DEPEI"]
["DEPEL"]
["DEPEN"]
["DEPFR"]
["DEPIN"]
["DEPJQ"]
["DEPKU"]
["DEPLL"]
["DEPLS"]
["DEPOT"]
["DEPPT"]
["DEPRA"]
["DEPRC"]
["DEPRN"]
["DEPRW"]
["DEPRY"]
["DEPSA"]
["DEPSB"]
["DEPSH"]
["DEPSR"]
["DEPSW"]
["DEPTD"]
["DEPTN"]
["DEPUT"]
["DEPYK"]
["DEPZI"]
["DERAD"]
["DERAR"]
["DERBF"]
["DERBI"]
["DERBK"]
["DERCI"]
["DERCK"]
["DERDL"]
["DERDT"]
["DERDU"]
["DERDW"]
["DERE5"]
["DEREE"]
["DEREG"]
["DEREM"]
["DEREN"]
["DERET"]
["DERFI"]
["DERFT"]
["DERHB"]
["DERHE"]
["DERHL"]
["DERHX"]
["DERIC"]
["DERIK"]
["DERIZ"]
["DERKQ"]
["DERLB"]
["DERLZ"]
["DERNT"]
["DEROS"]
["DERP7"]
["DERPD"]
["DERPL"]
["DERRG"]
["DERRP"]
["DERRT"]
["DERSK"]
["DERTJ"]
["DERU7"]
["DERUB"]
["DERUE"]
["DERUM"]
["DERZB"]
["DERZE"]
["DES3B"]
["DESAA"]
["DESAG"]
["DESAR"]
["DESAS"]
["DESAU"]
["DESCJ"]
["DESCN"]
["DESCV"]
["DESCW"]
["DESDD"]
["DESDE"]
["DESDI"]
["DESDT"]
["DESE8"]
["DESEF"]
["DESEH"]
["DESEP"]
["DESFL"]
["DESGW"]
["DESH4"]
["DESKN"]
["DESKS"]
["DESL5"]
["DESLS"]
["DESLZ"]
["DESMA"]
["DESN2"]
["DESNC"]
["DESNE"]
["DESNP"]
["DESNR"]
["DESOC"]
["DESPD"]
["DESPE"]
["DESPI"]
["DESPS"]
["DESQJ"]
["DESRA"]
["DESRI"]
["DESRP"]
["DESSL"]
["DESTA"]
["DESTB"]
["DESTD"]
["DESTL"]
["DESTS"]
["DESUD"]
["DESWF"]
["DESWQ"]
["DESWS"]
["DESWT"]
["DESWW"]
["DESWZ"]
["DESXD"]
["DESXE"]
["DESZ8"]
["DETAE"]
["DETAR"]
["DETBN"]
["DETCH"]
["DETCN"]
["DETEJ"]
["DETER"]
["DETGM"]
["DETHR"]
["DETHU"]
["DETJE"]
["DETKD"]
["DETLB"]
["DETLD"]
["DETLT"]
["DETMH"]
["DETMM"]
["DETNR"]
["DETOE"]
["DETOS"]
["DETOY"]
["DETRD"]
["DETRF"]
["DETRH"]
["DETRI"]
["DETRT"]
["DETRV"]
["DETSH"]
["DETSU"]
["DETTP"]
["DETTR"]
["DETWZ"]
["DETYN"]
["DEUBG"]
["DEUBT"]
["DEUCK"]
["DEUDF"]
["DEUEB"]
["DEUEL"]
["DEUES"]
["DEUET"]
["DEUH7"]
["DEUHF"]
["DEUKI"]
["DEULM"]
["DEULS"]
["DEUND"]
["DEUPS"]
["DEURR"]
["DEUSF"]
["DEUTA"]
["DEUTT"]
["DEV44"]
["DEVAR"]
["DEVBS"]
["DEVEJ"]
["DEVEN"]
["DEVGF"]
["DEVIU"]
["DEVIW"]
["DEVNA"]
["DEVOC"]
["DEVOE"]
["DEVOL"]
["DEVRD"]
["DEVRW"]
["DEVTT"]
["DEVTZ"]
["DEVVH"]
["DEWAC"]
["DEWAR"]
["DEWAZ"]
["DEWB2"]
["DEWE5"]
["DEWED"]
["DEWEE"]
["DEWES"]
["DEWEW"]
["DEWFA"]
["DEWGQ"]
["DEWHP"]
["DEWHV"]
["DEWIB"]
["DEWIE"]
["DEWIF"]
["DEWIH"]
["DEWIK"]
["DEWIL"]
["DEWIM"]
["DEWIS"]
["DEWIT"]
["DEWKE"]
["DEWKK"]
["DEWKZ"]
["DEWLE"]
["DEWLM"]
["DEWMM"]
["DEWNG"]
["DEWNH"]
["DEWNI"]
["DEWNL"]
["DEWNT"]
["DEWNU"]
["DEWOB"]
["DEWOE"]
["DEWOG"]
["DEWOL"]
["DEWOR"]
["DEWRI"]
["DEWRY"]
["DEWTA"]
["DEWTG"]
["DEWTM"]
["DEWTP"]
["DEWTU"]
["DEWUE"]
["DEWVN"]
["DEWWH"]
["DEWWI"]
["DEWYK"]
["DEXAX"]
["DEXFW"]
["DEXMP"]
["DEXRT"]
["DEXXX"]
["DEXZS"]
["DEYSF"]
["DEYWX"]
["DEZ4Z"]
["DEZAI"]
["DEZB4"]
["DEZH8"]
["DEZHA"]
["DEZHD"]
["DEZIN"]
["DEZIS"]
["DEZIZ"]
["DEZLT"]
["DEZMU"]
["DEZOR"]
["DEZRH"]
["DEZTH"]
["DEZVE"]
["DEZZH"]
["DEZZL"]
["DJ888"]
["DJDCT"]
["DJJIB"]
["DJPOD"]
["DK888"]
["DK88F"]
["DK88K"]
["DK88P"]
["DK88R"]
["DK88S"]
["DK88U"]
["DK8SN"]
["DKAAB"]
["DKAAL"]
["DKAAR"]
["DKAGE"]
["DKAGH"]
["DKAGO"]
["DKAK3"]
["DKANH"]
["DKARD"]
["DKARK"]
["DKARO"]
["DKASA"]
["DKASH"]
["DKASK"]
["DKASN"]
["DKASV"]
["DKAUB"]
["DKAVE"]
["DKAVK"]
["DKAVN"]
["DKAZS"]
["DKBAG"]
["DKBAL"]
["DKBBG"]
["DKBDX"]
["DKBGO"]
["DKBGZ"]
["DKBLA"]
["DKBLB"]
["DKBLU"]
["DKBOG"]
["DKBOS"]
["DKBRB"]
["DKBRH"]
["DKCPH"]
["DKCSO"]
["DKDAN"]
["DKDAS"]
["DKDN6"]
["DKDRA"]
["DKDYS"]
["DKEBJ"]
["DKEBT"]
["DKEDL"]
["DKEGN"]
["DKEK4"]
["DKEND"]
["DKENS"]
["DKEOT"]
["DKFAA"]
["DKFAK"]
["DKFDH"]
["DKFDS"]
["DKFDV"]
["DKFEJ"]
["DKFER"]
["DKFGS"]
["DKFMO"]
["DKFRC"]
["DKFRK"]
["DKFUH"]
["DKFYH"]
["DKGDM"]
["DKGED"]
["DKGFH"]
["DKGLE"]
["DKGLY"]
["DKGRA"]
["DKGRE"]
["DKGTS"]
["DKHAD"]
["DKHAN"]
["DKHAS"]
["DKHBA"]
["DKHBK"]
["DKHBO"]
["DKHDH"]
["DKHEJ"]
["DKHER"]
["DKHES"]
["DKHHV"]
["DKHIR"]
["DKHJ3"]
["DKHJR"]
["DKHJT"]
["DKHLS"]
["DKHNB"]
["DKHOH"]
["DKHOR"]
["DKHRP"]
["DKHSB"]
["DKHSL"]
["DKHSU"]
["DKHUN"]
["DKHVA"]
["DKHVN"]
["DKHVS"]
["DKHVT"]
["DKHWO"]
["DKJEL"]
["DKJUE"]
["DKKAL"]
["DKKAR"]
["DKKAV"]
["DKKBG"]
["DKKBK"]
["DKKBY"]
["DKKDM"]
["DKKGL"]
["DKKHV"]
["DKKII"]
["DKKK4"]
["DKKLH"]
["DKKLP"]
["DKKOG"]
["DKKOK"]
["DKKOL"]
["DKKON"]
["DKKRA"]
["DKKRR"]
["DKKT4"]
["DKKTD"]
["DKKTP"]
["DKKVR"]
["DKLGR"]
["DKLHH"]
["DKLIN"]
["DKLIP"]
["DKLNR"]
["DKLOH"]
["DKLUN"]
["DKLVG"]
["DKLYO"]
["DKLYQ"]
["DKMAS"]
["DKMID"]
["DKMKH"]
["DKMNS"]
["DKMOM"]
["DKMRB"]
["DKMRR"]
["DKMRS"]
["DKN3S"]
["DKNAK"]
["DKNBG"]
["DKNBR"]
["DKNDB"]
["DKNEX"]
["DKNGB"]
["DKNHN"]
["DKNR4"]
["DKNRE"]
["DKNRS"]
["DKNSD"]
["DKNTD"]
["DKNUD"]
["DKNVD"]
["DKNYB"]
["DKNYF"]
["DKNYM"]
["DKNYS"]
["DKODE"]
["DKOMO"]
["DKOOT"]
["DKORE"]
["DKORO"]
["DKPRS"]
["DKRAN"]
["DKRD4"]
["DKRDH"]
["DKRDK"]
["DKRIS"]
["DKRKB"]
["DKRKE"]
["DKRMO"]
["DKRNN"]
["DKROD"]
["DKROF"]
["DKROR"]
["DKRRV"]
["DKRYS"]
["DKSAE"]
["DKSAX"]
["DKSB2"]
["DKSBK"]
["DKSD7"]
["DKSDA"]
["DKSDO"]
["DKSEO"]
["DKSF2"]
["DKSGD"]
["DKSH6"]
["DKSIT"]
["DKSJO"]
["DKSK3"]
["DKSKA"]
["DKSKB"]
["DKSKH"]
["DKSKV"]
["DKSL2"]
["DKSLB"]
["DKSLV"]
["DKSM6"]
["DKSN2"]
["DKSN7"]
["DKSNA"]
["DKSNE"]
["DKSNO"]
["DKSNY"]
["DKSOB"]
["DKSPB"]
["DKSPR"]
["DKSSK"]
["DKSSV"]
["DKSTA"]
["DKSTB"]
["DKSTD"]
["DKSTE"]
["DKSTG"]
["DKSTN"]
["DKSTP"]
["DKSTR"]
["DKSTT"]
["DKSUE"]
["DKSVA"]
["DKSVE"]
["DKSVG"]
["DKSVV"]
["DKTB4"]
["DKTED"]
["DKTJL"]
["DKTKB"]
["DKTMD"]
["DKTN3"]
["DKTNO"]
["DKTRG"]
["DKTRO"]
["DKTRS"]
["DKTUB"]
["DKTYB"]
["DKUNX"]
["DKVAE"]
["DKVB2"]
["DKVBN"]
["DKVBS"]
["DKVEJ"]
["DKVEN"]
["DKVES"]
["DKVG4"]
["DKVK7"]
["DKVM2"]
["DKVNG"]
["DKVOR"]
["DKVRE"]
["DKVSV"]
["DKVT2"]
["DM888"]
["DMADM"]
["DMBEL"]
["DMPOR"]
["DMRSU"]
["DO888"]
["DOAZU"]
["DOBAN"]
["DOBAV"]
["DOBCC"]
["DOBQL"]
["DOBRX"]
["DOCAI"]
["DOCAL"]
["DOCAU"]
["DOCBJ"]
["DOCDC"]
["DOHAI"]
["DOHIG"]
["DOINA"]
["DOLRM"]
["DOMAN"]
["DOOCO"]
["DOPAL"]
["DOPDR"]
["DOPOP"]
["DOPUO"]
["DOPVA"]
["DOSDQ"]
["DOSFN"]
["DOSNX"]
["DOSNZ"]
["DOSPM"]
["DOSTI"]
["DOVAL"]
["DZ2ON"]
["DZ888"]
["DZAAE"]
["DZALG"]
["DZAZW"]
["DZBHA"]
["DZBIU"]
["DZBJA"]
["DZBSF"]
["DZBTA"]
["DZCHE"]
["DZCOL"]
["DZDEL"]
["DZDJE"]
["DZDJI"]
["DZGHA"]
["DZGHZ"]
["DZKHE"]
["DZMOS"]
["DZORN"]
["DZROU"]
["DZSKI"]
["DZTBS"]
["DZTEN"]
["DZTLM"]
["EC888"]
["ECAYO"]
["ECBAQ"]
["ECBHA"]
["ECBLI"]
["ECCAR"]
["ECCAT"]
["ECDUN"]
["ECEBL"]
["ECESM"]
["ECESP"]
["ECFLO"]
["ECGUA"]
["ECGYE"]
["ECLLD"]
["ECLPT"]
["ECMEC"]
["ECOCC"]
["ECPBG"]
["ECPBO"]
["ECPEG"]
["ECPEV"]
["ECPSJ"]
["ECPUN"]
["ECRAB"]
["ECSLR"]
["ECSNC"]
["ECSYM"]
["ECTEP"]
["ECVIL"]
["ECZTL"]
["EE888"]
["EE88P"]
["EE88R"]
["EEABJ"]
["EEABR"]
["EEADV"]
["EEAEN"]
["EEAHO"]
["EEAJS"]
["EEAKS"]
["EEASE"]
["EEASV"]
["EEATL"]
["EEAUD"]
["EEBEK"]
["EEDIR"]
["EEEIS"]
["EEHAA"]
["EEHII"]
["EEHLD"]
["EEHLT"]
["EEHRA"]
["EEHRS"]
["EEHUN"]
["EEHVV"]
["EEJAP"]
["EEJEP"]
["EEJGP"]
["EEJHT"]
["EEJKR"]
["EEJOS"]
["EEKAB"]
["EEKAK"]
["EEKAL"]
["EEKAM"]
["EEKAP"]
["EEKAS"]
["EEKBN"]
["EEKDL"]
["EEKDR"]
["EEKEJ"]
["EEKEL"]
["EEKGS"]
["EEKGV"]
["EEKHN"]
["EEKII"]
["EEKJK"]
["EEKKE"]
["EEKKS"]
["EEKLD"]
["EEKLE"]
["EEKLK"]
["EEKLL"]
["EEKLN"]
["EEKLP"]
["EEKLR"]
["EEKND"]
["EEKNG"]
["EEKOL"]
["EEKPA"]
["EEKRG"]
["EEKSA"]
["EEKSN"]
["EEKSP"]
["EEKUG"]
["EEKUI"]
["EEKUR"]
["EEKVI"]
["EEKVR"]
["EELAN"]
["EELAO"]
["EELAT"]
["EELAU"]
["EELEN"]
["EELEP"]
["EELHK"]
["EELHS"]
["EELHT"]
["EELIN"]
["EELIU"]
["EELKS"]
["EELMA"]
["EELNR"]
["EELPN"]
["EELPS"]
["EELSA"]
["EELSL"]
["EELUI"]
["EEMAH"]
["EEMAN"]
["EEMDR"]
["EEMEH"]
["EEMIH"]
["EEMNI"]
["EEMNT"]
["EEMNV"]
["EEMRL"]
["EEMRS"]
["EEMTV"]
["EEMUG"]
["EEMUN"]
["EEMUR"]
["EENAI"]
["EENAS"]
["EENJD"]
["EENJS"]
["EENME"]
["EENOB"]
["EENRM"]
["EENST"]
["EENVA"]
["EEOIU"]
["EEOMR"]
["EEORI"]
["EEORJ"]
["EEOSM"]
["EEOST"]
["EEOTI"]
["EEOTS"]
["EEPAA"]
["EEPAP"]
["EEPAR"]
["EEPAS"]
["EEPHL"]
["EEPIR"]
["EEPLN"]
["EEPLS"]
["EEPRE"]
["EEPRI"]
["EEPRJ"]
["EEPRK"]
["EEPRL"]
["EEPRN"]
["EEPRV"]
["EEPSM"]
["EEPSV"]
["EEPUR"]
["EEPUS"]
["EEPVS"]
["EERAJ"]
["EERBS"]
["EERGR"]
["EERHK"]
["EERJS"]
["EERLB"]
["EERLS"]
["EERMS"]
["EERNG"]
["EERNM"]
["EERNV"]
["EERON"]
["EEROO"]
["EERPI"]
["EERST"]
["EERUV"]
["EERVS"]
["EESAM"]
["EESAS"]
["EESGS"]
["EESHL"]
["EESIG"]
["EESLE"]
["EESLM"]
["EESLN"]
["EESMA"]
["EESNK"]
["EESNP"]
["EESOE"]
["EESRA"]
["EESRU"]
["EESRV"]
["EESSO"]
["EESUA"]
["EESUK"]
["EESUL"]
["EESUR"]
["EESUS"]
["EESVI"]
["EESVS"]
["EETAL"]
["EETGI"]
["EETIL"]
["EETJA"]
["EETJS"]
["EETLL"]
["EETLT"]
["EETLV"]
["EETMA"]
["EETMN"]
["EETOI"]
["EETPL"]
["EETRE"]
["EETRU"]
["EETRV"]
["EEUIS"]
["EEURE"]
["EEURG"]
["EEVAN"]
["EEVAR"]
["EEVDU"]
["EEVEB"]
["EEVEE"]
["EEVER"]
["EEVIK"]
["EEVIN"]
["EEVIR"]
["EEVIS"]
["EEVKS"]
["EEVLR"]
["EEVNA"]
["EEVNJ"]
["EEVOI"]
["EEVOK"]
["EEVOP"]
["EEVOS"]
["EEVPA"]
["EEVPS"]
["EEVRA"]
["EEVRI"]
["EEVRK"]
["EEVRS"]
["EEVSG"]
["EEVSK"]
["EEVTR"]
["EEVUS"]
["EEVVM"]
["EEVVN"]
["EEVVS"]
["EEWJS"]
["EEWST"]
["EG888"]
["EGAAC"]
["EGADA"]
["EGAGZ"]
["EGAIS"]
["EGAKI"]
["EGALY"]
["EGAQU"]
["EGAST"]
["EGASW"]
["EGAUE"]
["EGAZA"]
["EGBEH"]
["EGBEN"]
["EGBGB"]
["EGCA7"]
["EGCAI"]
["EGDAM"]
["EGEDK"]
["EGEEG"]
["EGEOB"]
["EGFAD"]
["EGFAN"]
["EGGEI"]
["EGGUA"]
["EGHAL"]
["EGHAM"]
["EGHEL"]
["EGHRG"]
["EGIKU"]
["EGISM"]
["EGKEH"]
["EGKEN"]
["EGMAH"]
["EGMIN"]
["EGMUH"]
["EGNUW"]
["EGPIB"]
["EGPRA"]
["EGPSD"]
["EGPSE"]
["EGPTK"]
["EGQAH"]
["EGQUB"]
["EGRAB"]
["EGRAG"]
["EGRSH"]
["EGRSU"]
["EGSBA"]
["EGSCN"]
["EGSGA"]
["EGSHG"]
["EGSIN"]
["EGSKR"]
["EGSKT"]
["EGSOK"]
["EGSOS"]
["EGSSH"]
["EGSUZ"]
["EGTOR"]
["EGWAF"]
["EGZTB"]
["EH888"]
["EHEAI"]
["ER888"]
["ERASA"]
["ERMSW"]
["ES2BL"]
["ES2TT"]
["ES4SS"]
["ES888"]
["ES88P"]
["ES88R"]
["ES8TC"]
["ESAAQ"]
["ESAAW"]
["ESABH"]
["ESACA"]
["ESACE"]
["ESACH"]
["ESAD6"]
["ESADR"]
["ESADS"]
["ESADT"]
["ESAGA"]
["ESAGD"]
["ESAGG"]
["ESAGP"]
["ESAGU"]
["ESALA"]
["ESALC"]
["ESALD"]
["ESALG"]
["ESALT"]
["ESALX"]
["ESAMP"]
["ESAMX"]
["ESARI"]
["ESARN"]
["ESARZ"]
["ESAS8"]
["ESASL"]
["ESATO"]
["ESATQ"]
["ESAVS"]
["ESAXO"]
["ESAYA"]
["ESAYR"]
["ESB8C"]
["ESBAT"]
["ESBBJ"]
["ESBCN"]
["ESBDA"]
["ESBDF"]
["ESBDP"]
["ESBEM"]
["ESBGG"]
["ESBGJ"]
["ESBIO"]
["ESBLA"]
["ESBLR"]
["ESBMO"]
["ESBOA"]
["ESBOS"]
["ESBPM"]
["ESBRB"]
["ESBRL"]
["ESBRM"]
["ESBRX"]
["ESBS3"]
["ESBSL"]
["ESBU3"]
["ESBVN"]
["ESC9A"]
["ESCAA"]
["ESCAD"]
["ESCAQ"]
["ESCAR"]
["ESCAS"]
["ESCBD"]
["ESCBL"]
["ESCBP"]
["ESCBS"]
["ESCBZ"]
["ESCC7"]
["ESCCN"]
["ESCCX"]
["ESCDI"]
["ESCDK"]
["ESCDR"]
["ESCED"]
["ESCEE"]
["ESCEL"]
["ESCES"]
["ESCEU"]
["ESCFL"]
["ESCGE"]
["ESCGG"]
["ESCGR"]
["ESCHR"]
["ESCHZ"]
["ESCIV"]
["ESCJE"]
["ESCNO"]
["ESCOI"]
["ESCPA"]
["ESCPL"]
["ESCQU"]
["ESCRG"]
["ESCRI"]
["ESCRP"]
["ESCRS"]
["ESCSA"]
["ESCSN"]
["ESCSO"]
["ESCSV"]
["ESCUD"]
["ESCUR"]
["ESCUT"]
["ESCVJ"]
["ESCZT"]
["ESDAG"]
["ESDBA"]
["ESDBO"]
["ESDEJ"]
["ESDGS"]
["ESDNA"]
["ESDRI"]
["ESEAS"]
["ESEBO"]
["ESECT"]
["ESEDL"]
["ESEGR"]
["ESEJC"]
["ESEKZ"]
["ESELV"]
["ESEMP"]
["ESENG"]
["ESENT"]
["ESEOO"]
["ESESC"]
["ESETH"]
["ESEUG"]
["ESEWE"]
["ESEZC"]
["ESFAL"]
["ESFLD"]
["ESFNC"]
["ESFRA"]
["ESFRM"]
["ESFRO"]
["ESFSL"]
["ESFUE"]
["ESGAN"]
["ESGAR"]
["ESGCR"]
["ESGCS"]
["ESGDL"]
["ESGDM"]
["ESGDR"]
["ESGGA"]
["ESGIJ"]
["ESGLE"]
["ESGND"]
["ESGRC"]
["ESGRT"]
["ESGRY"]
["ESGTL"]
["ESGTX"]
["ESGU6"]
["ESGVA"]
["ESGYA"]
["ESHDA"]
["ESHDD"]
["ESHHU"]
["ESHIE"]
["ESHIG"]
["ESHLL"]
["ESHSN"]
["ESHTY"]
["ESHUR"]
["ESHUV"]
["ESHVC"]
["ESIAS"]
["ESIBZ"]
["ESITE"]
["ESITR"]
["ESIUA"]
["ESJAV"]
["ESJON"]
["ESJRM"]
["ESJUE"]
["ESKLL"]
["ESL4O"]
["ESLAN"]
["ESLAP"]
["ESLAX"]
["ESLCG"]
["ESLCR"]
["ESLE6"]
["ESLEC"]
["ESLEI"]
["ESLEK"]
["ESLEL"]
["ESLES"]
["ESLGC"]
["ESLGU"]
["ESLIT"]
["ESLIU"]
["ESLJO"]
["ESLLO"]
["ESLMN"]
["ESLOJ"]
["ESLPA"]
["ESLPC"]
["ESLPF"]
["ESLPL"]
["ESLRT"]
["ESLSD"]
["ESLSI"]
["ESLSL"]
["ESLTV"]
["ESLUQ"]
["ESLZR"]
["ESM8M"]
["ESM8U"]
["ESMAD"]
["ESMAH"]
["ESMAI"]
["ESMAT"]
["ESMBY"]
["ESMCZ"]
["ESMEC"]
["ESMED"]
["ESMET"]
["ESMGA"]
["ESMGN"]
["ESMGR"]
["ESMIA"]
["ESMIC"]
["ESMIR"]
["ESMIX"]
["ESMJB"]
["ESMLJ"]
["ESMLL"]
["ESMLN"]
["ESMLO"]
["ESMMA"]
["ESMNF"]
["ESMOA"]
["ESMOG"]
["ESMOI"]
["ESMOJ"]
["ESMOT"]
["ESMPG"]
["ESMQU"]
["ESMRJ"]
["ESMRN"]
["ESMRS"]
["ESMSN"]
["ESMTC"]
["ESMTQ"]
["ESMTU"]
["ESMUN"]
["ESMUS"]
["ESMZA"]
["ESNAA"]
["ESNBL"]
["ESNCA"]
["ESNCO"]
["ESNDD"]
["ESNJE"]
["ESNLL"]
["ESNNN"]
["ESNRA"]
["ESNRT"]
["ESNTR"]
["ESNVS"]
["ESOEJ"]
["ESOLY"]
["ESOLZ"]
["ESOMR"]
["ESOND"]
["ESONS"]
["ESOOP"]
["ESORJ"]
["ESOSR"]
["ESOTG"]
["ESOTO"]
["ESOUT"]
["ESOZL"]
["ESPAF"]
["ESPAL"]
["ESPAN"]
["ESPAS"]
["ESPAZ"]
["ESPBU"]
["ESPCN"]
["ESPCO"]
["ESPD3"]
["ESPDQ"]
["ESPDS"]
["ESPET"]
["ESPEV"]
["ESPGU"]
["ESPIT"]
["ESPJC"]
["ESPLC"]
["ESPLI"]
["ESPLL"]
["ESPMI"]
["ESPNY"]
["ESPOR"]
["ESPPS"]
["ESPRE"]
["ESPRG"]
["ESPRO"]
["ESPRT"]
["ESPSJ"]
["ESPSL"]
["ESPSM"]
["ESPSO"]
["ESPTM"]
["ESPTN"]
["ESPUC"]
["ESPUS"]
["ESPVA"]
["ESPVG"]
["ESQFU"]
["ESQIS"]
["ESQIU"]
["ESQLY"]
["ESRA5"]
["ESRAL"]
["ESRBI"]
["ESRBS"]
["ESRDA"]
["ESRDE"]
["ESRDP"]
["ESREG"]
["ESRES"]
["ESRGA"]
["ESRIB"]
["ESROM"]
["ESRON"]
["ESROS"]
["ESROT"]
["ESRPL"]
["ESRRS"]
["ESRTA"]
["ESRUE"]
["ESRUM"]
["ESRUZ"]
["ESS8C"]
["ESS9S"]
["ESSAA"]
["ESSAD"]
["ESSAG"]
["ESSAP"]
["ESSAS"]
["ESSAT"]
["ESSBT"]
["ESSCI"]
["ESSCR"]
["ESSCT"]
["ESSDG"]
["ESSDR"]
["ESSEO"]
["ESSER"]
["ESSEW"]
["ESSFL"]
["ESSFO"]
["ESSFU"]
["ESSGD"]
["ESSGT"]
["ESSID"]
["ESSIO"]
["ESSIS"]
["ESSIT"]
["ESSJN"]
["ESSJO"]
["ESSL4"]
["ESSL8"]
["ESSMD"]
["ESSNR"]
["ESSO8"]
["ESSOL"]
["ESSOV"]
["ESSP4"]
["ESSPC"]
["ESSPO"]
["ESSPP"]
["ESSPQ"]
["ESSRH"]
["ESSSG"]
["ESSST"]
["ESSTE"]
["ESSTG"]
["ESSUM"]
["ESSUR"]
["ESSVB"]
["ESSVI"]
["ESSVQ"]
["ESSXX"]
["ESTAL"]
["ESTAR"]
["ESTAZ"]
["ESTBR"]
["ESTBZ"]
["ESTCI"]
["ESTDC"]
["ESTDY"]
["ESTEM"]
["ESTG2"]
["ESTHO"]
["ESTJF"]
["ESTJI"]
["ESTJQ"]
["ESTKG"]
["ESTMS"]
["ESTO9"]
["ESTOR"]
["ESTOT"]
["ESTRE"]
["ESTRF"]
["ESTRR"]
["ESTRU"]
["ESTRY"]
["ESTT2"]
["ESTTO"]
["ESTVC"]
["ESUCC"]
["ESUIS"]
["ESUNY"]
["ESURI"]
["ESURZ"]
["ESV7N"]
["ESV8C"]
["ESV8M"]
["ESVBN"]
["ESVCC"]
["ESVEZ"]
["ESVGO"]
["ESVGR"]
["ESVIL"]
["ESVIT"]
["ESVIV"]
["ESVJO"]
["ESVLC"]
["ESVLG"]
["ESVVC"]
["ESVVR"]
["ESVZM"]
["ESVZO"]
["ESVZR"]
["ESZ8N"]
["ESZ8R"]
["ESZAZ"]
["ESZFR"]
["ESZMF"]
["ESZUE"]
["ESZZ4"]
["ET888"]
["EUCOM"]
["FI888"]
["FI88P"]
["FI88R"]
["FIAHL"]
["FIAJO"]
["FIAKK"]
["FIANK"]
["FIBAR"]
["FIBRA"]
["FIBRO"]
["FIDEG"]
["FIDLS"]
["FIDRA"]
["FIECK"]
["FIEJO"]
["FIEM2"]
["FIENK"]
["FIESP"]
["FIFAR"]
["FIFOG"]
["FIFOR"]
["FIGDB"]
["FIGUL"]
["FIHAK"]
["FIHAL"]
["FIHAO"]
["FIHAR"]
["FIHAU"]
["FIHEL"]
["FIHIM"]
["FIHIT"]
["FIHKO"]
["FIHMA"]
["FIHMN"]
["FIHOG"]
["FIHOU"]
["FIHVM"]
["FIIIS"]
["FIIMA"]
["FIINI"]
["FIINK"]
["FIISN"]
["FIJAN"]
["FIJOE"]
["FIJOU"]
["FIJUK"]
["FIJUS"]
["FIJYV"]
["FIKAN"]
["FIKAS"]
["FIKEM"]
["FIKES"]
["FIKIM"]
["FIKIR"]
["FIKJO"]
["FIKK5"]
["FIKKR"]
["FIKKV"]
["FIKLA"]
["FIKLV"]
["FIKNT"]
["FIKOJ"]
["FIKOK"]
["FIKOR"]
["FIKPL"]
["FIKRO"]
["FIKRS"]
["FIKSN"]
["FIKTK"]
["FIKTQ"]
["FIKUM"]
["FIKUO"]
["FIKUR"]
["FIKUS"]
["FIKVH"]
["FILAK"]
["FILAN"]
["FILAP"]
["FILDS"]
["FILHO"]
["FILLO"]
["FILLX"]
["FILOV"]
["FILPJ"]
["FILPP"]
["FILSK"]
["FILUA"]
["FILUK"]
["FILUV"]
["FILVB"]
["FIMAA"]
["FIMER"]
["FIMHQ"]
["FIMIK"]
["FIMJO"]
["FIMRS"]
["FIMTY"]
["FIMUL"]
["FIMUN"]
["FIMUS"]
["FINAU"]
["FINCA"]
["FINLI"]
["FINLS"]
["FINOU"]
["FINUR"]
["FIOLK"]
["FIOUL"]
["FIPAA"]
["FIPAH"]
["FIPAR"]
["FIPER"]
["FIPK9"]
["FIPNL"]
["FIPOH"]
["FIPOR"]
["FIPRK"]
["FIPRS"]
["FIPRV"]
["FIPSI"]
["FIPT2"]
["FIPUH"]
["FIPUU"]
["FIRAA"]
["FIRAU"]
["FIREP"]
["FIRHU"]
["FIRIS"]
["FIROY"]
["FIRTR"]
["FIRUI"]
["FIRUO"]
["FIRVN"]
["FIRYM"]
["FISAL"]
["FISAN"]
["FISAR"]
["FISBG"]
["FISII"]
["FISIP"]
["FISKB"]
["FISKI"]
["FISKU"]
["FISKV"]
["FISLY"]
["FISMA"]
["FISNA"]
["FISPE"]
["FISSI"]
["FISTR"]
["FISUL"]
["FISVK"]
["FISVL"]
["FITAI"]
["FITEI"]
["FITES"]
["FITHK"]
["FITJO"]
["FITKU"]
["FITMP"]
["FITOJ"]
["FITOK"]
["FITOR"]
["FITOT"]
["FITSD"]
["FITVA"]
["FITVS"]
["FIUIM"]
["FIUKI"]
["FIUKP"]
["FIULV"]
["FIUSK"]
["FIUUS"]
["FIVAA"]
["FIVAR"]
["FIVAS"]
["FIVEI"]
["FIVEL"]
["FIVIR"]
["FIVJK"]
["FIVKO"]
["FIVKT"]
["FIVRA"]
["FIVRK"]
["FIVSS"]
["FIVTF"]
["FIWAS"]
["FIYXP"]
["FIZBQ"]
["FJ888"]
["FJDEN"]
["FJELL"]
["FJLBS"]
["FJLTK"]
["FJMAL"]
["FJMOM"]
["FJNAM"]
["FJRTA"]
["FJSIN"]
["FJSUV"]
["FJSVU"]
["FJVAT"]
["FJVUD"]
["FJWAI"]
["FK888"]
["FKFBE"]
["FKPSY"]
["FM888"]
["FMEAU"]
["FMFSI"]
["FMGAF"]
["FMIFA"]
["FMKSA"]
["FMLUK"]
["FMNGA"]
["FMPLW"]
["FMPNI"]
["FMPUL"]
["FMSAT"]
["FMSOR"]
["FMTKK"]
["FMWOL"]
["FMYAP"]
["FO888"]
["FOEDI"]
["FOFUG"]
["FOHUS"]
["FOHYV"]
["FOKOL"]
["FOKVI"]
["FOLOP"]
["FONLS"]
["FONSK"]
["FORVK"]
["FOSJO"]
["FOSKA"]
["FOSMJ"]
["FOSRV"]
["FOSTR"]
["FOSYN"]
["FOTHO"]
["FOTOF"]
["FOTOR"]
["FOTVO"]
["FOVAG"]
["FOVES"]
["FOVID"]
["FR33G"]
["FR3CG"]
["FR43H"]
["FR49M"]
["FR4PS"]
["FR4S4"]
["FR4VA"]
["FR5EP"]
["FR66F"]
["FR69R"]
["FR888"]
["FR88P"]
["FR88R"]
["FR8AY"]
["FR9DS"]
["FR9SS"]
["FRA84"]
["FRA86"]
["FRAAH"]
["FRAAI"]
["FRAAO"]
["FRABA"]
["FRABB"]
["FRAD5"]
["FRADB"]
["FRAEO"]
["FRAGF"]
["FRAGK"]
["FRAHH"]
["FRAIQ"]
["FRAJA"]
["FRAJK"]
["FRAJR"]
["FRAMI"]
["FRAMS"]
["FRANO"]
["FRANT"]
["FRAO7"]
["FRAQS"]
["FRAQX"]
["FRAR5"]
["FRARC"]
["FRARD"]
["FRARJ"]
["FRARL"]
["FRARR"]
["FRAS8"]
["FRAUD"]
["FRAUF"]
["FRAVN"]
["FRAWS"]
["FRAXM"]
["FRAXY"]
["FRAYR"]
["FRAYT"]
["FRAYW"]
["FRB2T"]
["FRB6P"]
["FRBAI"]
["FRBAS"]
["FRBAU"]
["FRBAV"]
["FRBAY"]
["FRBBB"]
["FRBBQ"]
["FRBCA"]
["FRBCJ"]
["FRBCQ"]
["FRBDD"]
["FRBEC"]
["FRBEE"]
["FRBEP"]
["FRBES"]
["FRBET"]
["FRBEV"]
["FRBFT"]
["FRBG2"]
["FRBG3"]
["FRBH4"]
["FRBHC"]
["FRBHR"]
["FRBIA"]
["FRBIQ"]
["FRBKD"]
["FRBLD"]
["FRBLF"]
["FRBM3"]
["FRBMT"]
["FRBN4"]
["FRBNI"]
["FRBNV"]
["FRBOD"]
["FRBOI"]
["FRBOL"]
["FRBON"]
["FRBPS"]
["FRBQA"]
["FRBQH"]
["FRBQT"]
["FRBR5"]
["FRBRQ"]
["FRBSC"]
["FRBSD"]
["FRBSG"]
["FRBSM"]
["FRBSN"]
["FRBTU"]
["FRBXE"]
["FRBXO"]
["FRBXU"]
["FRBYB"]
["FRBYE"]
["FRC26"]
["FRC2H"]
["FRC2P"]
["FRC69"]
["FRCA2"]
["FRCAW"]
["FRCBT"]
["FRCC4"]
["FRCCK"]
["FRCCN"]
["FRCCP"]
["FRCDH"]
["FRCDX"]
["FRCEQ"]
["FRCER"]
["FRCFG"]
["FRCFR"]
["FRCGF"]
["FRCGZ"]
["FRCHM"]
["FRCIJ"]
["FRCJO"]
["FRCKT"]
["FRCKY"]
["FRCL2"]
["FRCLY"]
["FRCM4"]
["FRCMC"]
["FRCMP"]
["FRCMR"]
["FRCMT"]
["FRCN6"]
["FRCNG"]
["FRCOC"]
["FRCOS"]
["FRCOZ"]
["FRCP3"]
["FRCQD"]
["FRCQF"]
["FRCQG"]
["FRCQN"]
["FRCQQ"]
["FRCQR"]
["FRCR4"]
["FRCRL"]
["FRCS2"]
["FRCS5"]
["FRCSD"]
["FRCSH"]
["FRCSM"]
["FRCSS"]
["FRCT2"]
["FRCTX"]
["FRCXA"]
["FRCXS"]
["FRCXY"]
["FRCYI"]
["FRDAD"]
["FRDAL"]
["FRDAS"]
["FRDBE"]
["FRDC2"]
["FRDCG"]
["FRDCJ"]
["FRDDR"]
["FRDEN"]
["FRDF9"]
["FRDIJ"]
["FRDIL"]
["FRDKK"]
["FRDLJ"]
["FRDML"]
["FRDMS"]
["FRDMV"]
["FRDNJ"]
["FRDNZ"]
["FRDOL"]
["FRDON"]
["FRDPE"]
["FRDRZ"]
["FRDUT"]
["FRDVT"]
["FRDXG"]
["FRDXZ"]
["FRDYJ"]
["FRE7M"]
["FREBF"]
["FRECI"]
["FREDT"]
["FREDU"]
["FREEX"]
["FREFG"]
["FREFR"]
["FREG5"]
["FREGE"]
["FREGG"]
["FREGR"]
["FREHA"]
["FREHN"]
["FREHU"]
["FREHY"]
["FREIO"]
["FREM2"]
["FREMR"]
["FRENB"]
["FRENC"]
["FREP5"]
["FREQN"]
["FRER4"]
["FRER5"]
["FRESB"]
["FRESM"]
["FRETA"]
["FRETB"]
["FRETL"]
["FRETN"]
["FREUA"]
["FREUE"]
["FREUI"]
["FREUY"]
["FREVR"]
["FREXS"]
["FREYZ"]
["FREZR"]
["FREZX"]
["FRF29"]
["FRF2V"]
["FRF3M"]
["FRFA3"]
["FRFAU"]
["FRFAX"]
["FRFBG"]
["FRFBH"]
["FRFBI"]
["FRFBL"]
["FRFDR"]
["FRFEC"]
["FRFEY"]
["FRFIE"]
["FRFMA"]
["FRFNS"]
["FRFOC"]
["FRFOP"]
["FRFOS"]
["FRFS4"]
["FRFTB"]
["FRFTJ"]
["FRFUC"]
["FRFUL"]
["FRFUS"]
["FRG2X"]
["FRG33"]
["FRG63"]
["FRG8R"]
["FRG8V"]
["FRGAO"]
["FRGBQ"]
["FRGCH"]
["FRGDM"]
["FRGDS"]
["FRGDT"]
["FRGEW"]
["FRGFR"]
["FRGFV"]
["FRGH7"]
["FRGHD"]
["FRGHT"]
["FRGID"]
["FRGJN"]
["FRGJU"]
["FRGLA"]
["FRGLO"]
["FRGMS"]
["FRGNY"]
["FRGOA"]
["FRGON"]
["FRGPI"]
["FRGRC"]
["FRGRV"]
["FRGSU"]
["FRGT3"]
["FRGUR"]
["FRGUZ"]
["FRGV6"]
["FRGVL"]
["FRGXE"]
["FRGXY"]
["FRGYO"]
["FRH57"]
["FRH67"]
["FRH99"]
["FRHAO"]
["FRHBV"]
["FRHEJ"]
["FRHET"]
["FRHEY"]
["FRHIY"]
["FRHJK"]
["FRHOB"]
["FRHOG"]
["FRHON"]
["FRHPY"]
["FRHRA"]
["FRHRF"]
["FRHRN"]
["FRHS2"]
["FRHSG"]
["FRHSN"]
["FRHTI"]
["FRHUN"]
["FRHV2"]
["FRHY9"]
["FRHYD"]
["FRHYJ"]
["FRHYR"]
["FRHZK"]
["FRIAV"]
["FRIBA"]
["FRICN"]
["FRIDY"]
["FRIEC"]
["FRIGS"]
["FRIHS"]
["FRIHT"]
["FRIKR"]
["FRILR"]
["FRILS"]
["FRIOU"]
["FRIRT"]
["FRISG"]
["FRISM"]
["FRIST"]
["FRIUS"]
["FRIXY"]
["FRIY8"]
["FRIZO"]
["FRJAV"]
["FRJFM"]
["FRJK9"]
["FRJKI"]
["FRJLP"]
["FRJMQ"]
["FRJOB"]
["FRJPL"]
["FRJUT"]
["FRJUU"]
["FRJYS"]
["FRKAQ"]
["FRKJ9"]
["FRKLO"]
["FRKLU"]
["FRKLY"]
["FRKRZ"]
["FRL49"]
["FRL5T"]
["FRL83"]
["FRLA4"]
["FRLA5"]
["FRLA6"]
["FRLAD"]
["FRLAI"]
["FRLAV"]
["FRLBD"]
["FRLC4"]
["FRLCR"]
["FRLCT"]
["FRLDN"]
["FRLEH"]
["FRLEZ"]
["FRLF2"]
["FRLFR"]
["FRLGM"]
["FRLGQ"]
["FRLGR"]
["FRLGU"]
["FRLIB"]
["FRLIO"]
["FRLIS"]
["FRLJG"]
["FRLKJ"]
["FRLKL"]
["FRLKR"]
["FRLKZ"]
["FRLLE"]
["FRLLG"]
["FRLLW"]
["FRLMD"]
["FRLMW"]
["FRLMY"]
["FRLMZ"]
["FRLNE"]
["FRLO7"]
["FRLO9"]
["FRLOA"]
["FRLOC"]
["FRLOW"]
["FRLP7"]
["FRLPA"]
["FRLPE"]
["FRLQA"]
["FRLQD"]
["FRLQG"]
["FRLQT"]
["FRLRH"]
["FRLRT"]
["FRLSB"]
["FRLSO"]
["FRLTF"]
["FRLTR"]
["FRLUQ"]
["FRLVE"]
["FRLWM"]
["FRLXA"]
["FRLZF"]
["FRM2S"]
["FRM52"]
["FRM56"]
["FRM57"]
["FRM75"]
["FRM89"]
["FRMAC"]
["FRMAN"]
["FRMAU"]
["FRMBT"]
["FRMC9"]
["FRMCC"]
["FRMCQ"]
["FRMDA"]
["FRMDW"]
["FRME4"]
["FRMEA"]
["FRMEL"]
["FRMGU"]
["FRMHB"]
["FRMHJ"]
["FRMHT"]
["FRMJU"]
["FRMJY"]
["FRMKX"]
["FRML9"]
["FRMLH"]
["FRMMJ"]
["FRMMV"]
["FRMOS"]
["FRMQA"]
["FRMQP"]
["FRMQY"]
["FRMR6"]
["FRMR7"]
["FRMRN"]
["FRMRS"]
["FRMRW"]
["FRMSI"]
["FRMT6"]
["FRMT8"]
["FRMTD"]
["FRMTX"]
["FRMV2"]
["FRMVG"]
["FRMWF"]
["FRMWR"]
["FRMXN"]
["FRMYK"]
["FRMYW"]
["FRMZK"]
["FRMZM"]
["FRMZS"]
["FRN25"]
["FRN7E"]
["FRNAC"]
["FRNCB"]
["FRNCE"]
["FRNEF"]
["FRNEG"]
["FRNEH"]
["FRNGI"]
["FRNLA"]
["FRNLJ"]
["FRNMS"]
["FRNNH"]
["FRNOP"]
["FRNOU"]
["FRNRH"]
["FRNSD"]
["FRNTE"]
["FRNTZ"]
["FRNUS"]
["FRNVS"]
["FRNYI"]
["FRNYY"]
["FRNZ3"]
["FROEI"]
["FROFF"]
["FROGB"]
["FROHP"]
["FROJA"]
["FRONY"]
["FROOZ"]
["FROQL"]
["FROSH"]
["FROTM"]
["FROTY"]
["FROUI"]
["FROUQ"]
["FROYI"]
["FROYY"]
["FRP5C"]
["FRP62"]
["FRPAB"]
["FRPAD"]
["FRPAI"]
["FRPAJ"]
["FRPAP"]
["FRPAR"]
["FRPBF"]
["FRPC6"]
["FRPD2"]
["FRPDB"]
["FRPDF"]
["FRPDU"]
["FRPET"]
["FRPF4"]
["FRPG5"]
["FRPGQ"]
["FRPH2"]
["FRPH4"]
["FRPHG"]
["FRPHN"]
["FRPHT"]
["FRPI9"]
["FRPJE"]
["FRPJH"]
["FRPJU"]
["FRPJY"]
["FRPKL"]
["FRPKM"]
["FRPKS"]
["FRPLW"]
["FRPM6"]
["FRPNF"]
["FRPNH"]
["FRPNU"]
["FRPOV"]
["FRPOX"]
["FRPQC"]
["FRPQE"]
["FRPQR"]
["FRPRC"]
["FRPRJ"]
["FRPRP"]
["FRPS9"]
["FRPSL"]
["FRPSX"]
["FRPTI"]
["FRPTV"]
["FRPUM"]
["FRPVF"]
["FRPVO"]
["FRPVX"]
["FRPWA"]
["FRPXZ"]
["FRPYX"]
["FRQBR"]
["FRQDF"]
["FRQEN"]
["FRQEY"]
["FRQGS"]
["FRQLC"]
["FRQLK"]
["FRQMM"]
["FRQPL"]
["FRQQQ"]
["FRQSC"]
["FRQSM"]
["FRQSO"]
["FRQTS"]
["FRQUI"]
["FRQUO"]
["FRQVP"]
["FRQWC"]
["FRQWM"]
["FRQXA"]
["FRQXC"]
["FRQYR"]
["FRQYV"]
["FRQZX"]
["FRR26"]
["FRRAD"]
["FRRAV"]
["FRRCO"]
["FRRDM"]
["FRRDN"]
["FRRDT"]
["FRREI"]
["FRRF3"]
["FRRFA"]
["FRRGU"]
["FRRH7"]
["FRRHE"]
["FRRHP"]
["FRRLI"]
["FRRME"]
["FRRN3"]
["FRRNY"]
["FRRON"]
["FRROS"]
["FRROU"]
["FRRQE"]
["FRRRB"]
["FRRSA"]
["FRRSQ"]
["FRRTB"]
["FRRTE"]
["FRRTV"]
["FRRUN"]
["FRRUR"]
["FRRVC"]
["FRRXL"]
["FRRYG"]
["FRRYN"]
["FRRYY"]
["FRRZT"]
["FRRZW"]
["FRRZX"]
["FRS5M"]
["FRS8C"]
["FRSAR"]
["FRSBK"]
["FRSDG"]
["FRSET"]
["FRSGT"]
["FRSIR"]
["FRSIT"]
["FRSLP"]
["FRSLV"]
["FRSML"]
["FRSMW"]
["FRSNM"]
["FRSNQ"]
["FRSNR"]
["FRSP5"]
["FRSPK"]
["FRSQG"]
["FRSQR"]
["FRSQS"]
["FRSQV"]
["FRSRL"]
["FRSS2"]
["FRSSK"]
["FRSTP"]
["FRSTQ"]
["FRSUP"]
["FRSVS"]
["FRSWD"]
["FRSXB"]
["FRSYQ"]
["FRSYY"]
["FRTBE"]
["FRTCJ"]
["FRTEW"]
["FRTGH"]
["FRTIG"]
["FRTIM"]
["FRTIN"]
["FRTJE"]
["FRTJX"]
["FRTKU"]
["FRTLN"]
["FRTMG"]
["FRTMN"]
["FRTON"]
["FRTOV"]
["FRTPO"]
["FRTQJ"]
["FRTR9"]
["FRTRE"]
["FRTRI"]
["FRTTG"]
["FRTU9"]
["FRTUA"]
["FRTUJ"]
["FRTUU"]
["FRTVL"]
["FRTWA"]
["FRTXM"]
["FRTZZ"]
["FRUBS"]
["FRUCL"]
["FRUCM"]
["FRUCS"]
["FRUDP"]
["FRUEU"]
["FRUEV"]
["FRUFF"]
["FRUFN"]
["FRUGV"]
["FRUIM"]
["FRUIP"]
["FRUJA"]
["FRUJI"]
["FRUJJ"]
["FRUJK"]
["FRUJQ"]
["FRUJY"]
["FRULP"]
["FRUML"]
["FRUMX"]
["FRUNL"]
["FRUNS"]
["FRUQJ"]
["FRURO"]
["FRUSJ"]
["FRUSU"]
["FRUTE"]
["FRUTI"]
["FRUUC"]
["FRUUL"]
["FRUUO"]
["FRUVI"]
["FRUVJ"]
["FRUVV"]
["FRUXE"]
["FRUXL"]
["FRUYO"]
["FRV33"]
["FRV88"]
["FRVA5"]
["FRVAF"]
["FRVAL"]
["FRVC4"]
["FRVCS"]
["FRVEJ"]
["FRVEO"]
["FRVEY"]
["FRVFG"]
["FRVGE"]
["FRVH4"]
["FRVHM"]
["FRVIG"]
["FRVIM"]
["FRVIY"]
["FRVJE"]
["FRVL4"]
["FRVM5"]
["FRVM6"]
["FRVNE"]
["FRVNH"]
["FRVNR"]
["FRVNZ"]
["FRVQR"]
["FRVRD"]
["FRVSQ"]
["FRVSS"]
["FRVTI"]
["FRVTM"]
["FRVUX"]
["FRVVL"]
["FRW2C"]
["FRWBY"]
["FRWIK"]
["FRWMN"]
["FRWNT"]
["FRWQA"]
["FRWTT"]
["FRWWW"]
["FRX28"]
["FRXAN"]
["FRXBA"]
["FRXCB"]
["FRXCS"]
["FRXDH"]
["FRXER"]
["FRXET"]
["FRXEU"]
["FRXGL"]
["FRXGN"]
["FRXGV"]
["FRXLG"]
["FRXLZ"]
["FRXRG"]
["FRXRY"]
["FRXSW"]
["FRXVF"]
["FRXVY"]
["FRXXD"]
["FRXXX"]
["FRXYR"]
["FRY78"]
["FRYAN"]
["FRYEN"]
["FRYF2"]
["FRYGO"]
["FRYGP"]
["FRYJK"]
["FRYMS"]
["FRYNE"]
["FRYNR"]
["FRYOG"]
["FRYSM"]
["FRYSO"]
["FRYSU"]
["FRYUJ"]
["FRYUP"]
["FRYUS"]
["FRYVG"]
["FRYXA"]
["FRZAN"]
["FRZCY"]
["FRZEF"]
["FRZEV"]
["FRZHA"]
["FRZIC"]
["FRZLE"]
["FRZLJ"]
["FRZLL"]
["FRZMB"]
["FRZMM"]
["FRZMY"]
["FRZNN"]
["FRZOG"]
["FRZPP"]
["FRZT7"]
["FRZTW"]
["FRZUI"]
["FRZXC"]
["FRZXD"]
["FRZXH"]
["FRZXN"]
["FRZYL"]
["FRZZU"]
["GA888"]
["GACCB"]
["GACLZ"]
["GAEKU"]
["GAETA"]
["GAGAX"]
["GALBV"]
["GALUC"]
["GAMBY"]
["GANYA"]
["GAOGU"]
["GAOWE"]
["GAPOG"]
["GATCT"]
["GB7TR"]
["GB888"]
["GB88P"]
["GB88R"]
["GBABA"]
["GBABD"]
["GBABF"]
["GBABJ"]
["GBABS"]
["GBABV"]
["GBABW"]
["GBACA"]
["GBACB"]
["GBACE"]
["GBACV"]
["GBADF"]
["GBADK"]
["GBADM"]
["GBADR"]
["GBAEE"]
["GBAEN"]
["GBAET"]
["GBAEW"]
["GBAFW"]
["GBAGL"]
["GBAGO"]
["GBAGU"]
["GBAHH"]
["GBAHN"]
["GBAIS"]
["GBAIT"]
["GBAKL"]
["GBALB"]
["GBALI"]
["GBALL"]
["GBALM"]
["GBALP"]
["GBAMB"]
["GBAMD"]
["GBAMH"]
["GBAML"]
["GBAMN"]
["GBAMR"]
["GBAMW"]
["GBANA"]
["GBANG"]
["GBANN"]
["GBANO"]
["GBANS"]
["GBAOF"]
["GBAOL"]
["GBAOT"]
["GBAPI"]
["GBAPP"]
["GBAPS"]
["GBAQW"]
["GBARB"]
["GBARC"]
["GBARD"]
["GBARG"]
["GBARP"]
["GBARR"]
["GBARV"]
["GBASA"]
["GBASG"]
["GBASW"]
["GBATA"]
["GBATS"]
["GBAUL"]
["GBAVC"]
["GBAVL"]
["GBAVO"]
["GBAXN"]
["GBAXO"]
["GBAYD"]
["GBAYF"]
["GBAYR"]
["GBAYW"]
["GBBAB"]
["GBBAD"]
["GBBAN"]
["GBBAT"]
["GBBAW"]
["GBBAZ"]
["GBBBB"]
["GBBBE"]
["GBBBK"]
["GBBBN"]
["GBBBP"]
["GBBBX"]
["GBBCE"]
["GBBCH"]
["GBBCR"]
["GBBCS"]
["GBBD2"]
["GBBDA"]
["GBBDB"]
["GBBDF"]
["GBBDI"]
["GBBDT"]
["GBBDX"]
["GBBDZ"]
["GBBE2"]
["GBBEC"]
["GBBEH"]
["GBBEL"]
["GBBFB"]
["GBBFE"]
["GBBFF"]
["GBBFO"]
["GBBFP"]
["GBBFU"]
["GBBFY"]
["GBBGY"]
["GBBHB"]
["GBBHJ"]
["GBBHK"]
["GBBHR"]
["GBBHW"]
["GBBID"]
["GBBIF"]
["GBBIK"]
["GBBIP"]
["GBBKC"]
["GBBKD"]
["GBBKG"]
["GBBKS"]
["GBBLB"]
["GBBLC"]
["GBBLI"]
["GBBLJ"]
["GBBLK"]
["GBBLR"]
["GBBLS"]
["GBBLT"]
["GBBLU"]
["GBBLY"]
["GBBLZ"]
["GBBMC"]
["GBBMO"]
["GBBMR"]
["GBBMT"]
["GBBMU"]
["GBBMX"]
["GBBNB"]
["GBBND"]
["GBBNG"]
["GBBNH"]
["GBBNM"]
["GBBNR"]
["GBBNX"]
["GBBOC"]
["GBBOE"]
["GBBOF"]
["GBBOH"]
["GBBOL"]
["GBBON"]
["GBBOS"]
["GBBOT"]
["GBBOW"]
["GBBPE"]
["GBBPF"]
["GBBPT"]
["GBBQQ"]
["GBBQX"]
["GBBRF"]
["GBBRJ"]
["GBBRK"]
["GBBRN"]
["GBBRP"]
["GBBRR"]
["GBBRS"]
["GBBRT"]
["GBBRU"]
["GBBRW"]
["GBBRX"]
["GBBSC"]
["GBBSH"]
["GBBSI"]
["GBBSL"]
["GBBSM"]
["GBBSN"]
["GBBSS"]
["GBBSX"]
["GBBSY"]
["GBBTK"]
["GBBTL"]
["GBBTZ"]
["GBBUA"]
["GBBUC"]
["GBBUD"]
["GBBUF"]
["GBBUH"]
["GBBUO"]
["GBBUS"]
["GBBUY"]
["GBBVO"]
["GBBVR"]
["GBBWC"]
["GBBWK"]
["GBBWM"]
["GBBWR"]
["GBBWU"]
["GBBWV"]
["GBBWX"]
["GBBXB"]
["GBBXF"]
["GBBXS"]
["GBBXT"]
["GBBXX"]
["GBBY2"]
["GBBYC"]
["GBBYI"]
["GBBYN"]
["GBBYP"]
["GBBZR"]
["GBBZT"]
["GBC5T"]
["GBCAA"]
["GBCAB"]
["GBCAF"]
["GBCAG"]
["GBCAH"]
["GBCAN"]
["GBCAR"]
["GBCAU"]
["GBCAX"]
["GBCBA"]
["GBCBE"]
["GBCBL"]
["GBCBM"]
["GBCBO"]
["GBCBT"]
["GBCBX"]
["GBCCC"]
["GBCCE"]
["GBCCH"]
["GBCCL"]
["GBCDF"]
["GBCDK"]
["GBCEB"]
["GBCEG"]
["GBCEI"]
["GBCEL"]
["GBCET"]
["GBCFE"]
["GBCFG"]
["GBCFM"]
["GBCGB"]
["GBCGJ"]
["GBCGP"]
["GBCGT"]
["GBCGY"]
["GBCGZ"]
["GBCHD"]
["GBCHE"]
["GBCHF"]
["GBCHJ"]
["GBCHR"]
["GBCHT"]
["GBCII"]
["GBCIS"]
["GBCIT"]
["GBCKK"]
["GBCKM"]
["GBCKN"]
["GBCKR"]
["GBCKS"]
["GBCLF"]
["GBCLJ"]
["GBCLM"]
["GBCLR"]
["GBCLS"]
["GBCLY"]
["GBCMA"]
["GBCMD"]
["GBCMP"]
["GBCMS"]
["GBCNA"]
["GBCNC"]
["GBCNM"]
["GBCNP"]
["GBCNU"]
["GBCNV"]
["GBCNX"]
["GBCNZ"]
["GBCOL"]
["GBCOQ"]
["GBCOR"]
["GBCOV"]
["GBCOW"]
["GBCOY"]
["GBCPD"]
["GBCPF"]
["GBCQQ"]
["GBCQY"]
["GBCR5"]
["GBCRA"]
["GBCRJ"]
["GBCRN"]
["GBCRR"]
["GBCRT"]
["GBCRV"]
["GBCRX"]
["GBCSC"]
["GBCSN"]
["GBCSR"]
["GBCST"]
["GBCSU"]
["GBCSW"]
["GBCTF"]
["GBCTM"]
["GBCTP"]
["GBCU8"]
["GBCUA"]
["GBCUB"]
["GBCUE"]
["GBCUJ"]
["GBCUM"]
["GBCUN"]
["GBCUR"]
["GBCUS"]
["GBCUV"]
["GBCVA"]
["GBCVE"]
["GBCVI"]
["GBCVL"]
["GBCVT"]
["GBCVW"]
["GBCWA"]
["GBCWH"]
["GBCWN"]
["GBCYD"]
["GBCYG"]
["GBCYN"]
["GBCYP"]
["GBCYY"]
["GBCZV"]
["GBCZZ"]
["GBDAG"]
["GBDAL"]
["GBDBG"]
["GBDBR"]
["GBDBY"]
["GBDDT"]
["GBDEB"]
["GBDER"]
["GBDET"]
["GBDEX"]
["GBDFD"]
["GBDFN"]
["GBDHD"]
["GBDIG"]
["GBDIN"]
["GBDIW"]
["GBDMB"]
["GBDMO"]
["GBDNE"]
["GBDNF"]
["GBDNQ"]
["GBDNU"]
["GBDNW"]
["GBDOR"]
["GBDOS"]
["GBDRE"]
["GBDRH"]
["GBDRL"]
["GBDRX"]
["GBDS2"]
["GBDSK"]
["GBDSS"]
["GBDTE"]
["GBDTF"]
["GBDTM"]
["GBDTN"]
["GBDUC"]
["GBDUE"]
["GBDUM"]
["GBDUN"]
["GBDUT"]
["GBDVN"]
["GBDVP"]
["GBDVR"]
["GBDWI"]
["GBDWL"]
["GBDWY"]
["GBDXY"]
["GBDYB"]
["GBDYN"]
["GBDYS"]
["GBEAA"]
["GBEAM"]
["GBEBO"]
["GBECO"]
["GBECS"]
["GBEDI"]
["GBEEN"]
["GBEER"]
["GBEGI"]
["GBEGO"]
["GBEHY"]
["GBEIL"]
["GBEIN"]
["GBEKN"]
["GBELB"]
["GBELI"]
["GBELL"]
["GBELS"]
["GBEME"]
["GBEMN"]
["GBENB"]
["GBENH"]
["GBENN"]
["GBENT"]
["GBEON"]
["GBERE"]
["GBERI"]
["GBESD"]
["GBESG"]
["GBESH"]
["GBESK"]
["GBESS"]
["GBESW"]
["GBETT"]
["GBEVT"]
["GBEWL"]
["GBEWT"]
["GBEXE"]
["GBEXM"]
["GBEYM"]
["GBFAI"]
["GBFAL"]
["GBFAS"]
["GBFAV"]
["GBFAW"]
["GBFBH"]
["GBFBU"]
["GBFDK"]
["GBFEB"]
["GBFEE"]
["GBFEI"]
["GBFEO"]
["GBFID"]
["GBFIH"]
["GBFIN"]
["GBFIO"]
["GBFIS"]
["GBFLE"]
["GBFLH"]
["GBFLK"]
["GBFLN"]
["GBFLT"]
["GBFLU"]
["GBFLW"]
["GBFMF"]
["GBFNH"]
["GBFNT"]
["GBFNV"]
["GBFOI"]
["GBFOL"]
["GBFOR"]
["GBFOW"]
["GBFOY"]
["GBFRB"]
["GBFRD"]
["GBFRH"]
["GBFRI"]
["GBFRM"]
["GBFRW"]
["GBFRX"]
["GBFTI"]
["GBFTR"]
["GBFUC"]
["GBFUR"]
["GBFUU"]
["GBFWE"]
["GBFWM"]
["GBFXT"]
["GBFYD"]
["GBGAD"]
["GBGAE"]
["GBGAI"]
["GBGAR"]
["GBGAS"]
["GBGAT"]
["GBGAW"]
["GBGBS"]
["GBGDB"]
["GBGDN"]
["GBGIG"]
["GBGIL"]
["GBGIR"]
["GBGIS"]
["GBGIV"]
["GBGL9"]
["GBGLA"]
["GBGLC"]
["GBGLD"]
["GBGLG"]
["GBGLH"]
["GBGLO"]
["GBGLP"]
["GBGLW"]
["GBGMA"]
["GBGMY"]
["GBGNC"]
["GBGNL"]
["GBGNQ"]
["GBGOA"]
["GBGOO"]
["GBGOR"]
["GBGOS"]
["GBGOX"]
["GBGRG"]
["GBGRH"]
["GBGRJ"]
["GBGRK"]
["GBGRN"]
["GBGRO"]
["GBGRU"]
["GBGRW"]
["GBGSA"]
["GBGSR"]
["GBGSY"]
["GBGTN"]
["GBGTY"]
["GBGUD"]
["GBGUR"]
["GBGUT"]
["GBGUW"]
["GBGVL"]
["GBGVS"]
["GBGWG"]
["GBGWK"]
["GBGYL"]
["GBGYS"]
["GBHA2"]
["GBHAA"]
["GBHAM"]
["GBHAY"]
["GBHBK"]
["GBHDB"]
["GBHDD"]
["GBHDF"]
["GBHDN"]
["GBHDR"]
["GBHDS"]
["GBHEB"]
["GBHEQ"]
["GBHGW"]
["GBHGY"]
["GBHHN"]
["GBHKI"]
["GBHLN"]
["GBHLO"]
["GBHLU"]
["GBHLY"]
["GBHMA"]
["GBHMV"]
["GBHMY"]
["GBHNS"]
["GBHNT"]
["GBHNU"]
["GBHOJ"]
["GBHOM"]
["GBHOP"]
["GBHOS"]
["GBHOV"]
["GBHP2"]
["GBHPC"]
["GBHPT"]
["GBHRF"]
["GBHRL"]
["GBHRN"]
["GBHRW"]
["GBHSE"]
["GBHST"]
["GBHTA"]
["GBHTG"]
["GBHTH"]
["GBHTP"]
["GBHTS"]
["GBHTT"]
["GBHUL"]
["GBHUT"]
["GBHUX"]
["GBHVO"]
["GBHWV"]
["GBHWZ"]
["GBHXL"]
["GBHXX"]
["GBHYG"]
["GBHYI"]
["GBHYM"]
["GBHYR"]
["GBIAY"]
["GBICH"]
["GBIFN"]
["GBIGG"]
["GBIGM"]
["GBIGT"]
["GBILF"]
["GBILL"]
["GBIMG"]
["GBIMM"]
["GBINK"]
["GBINR"]
["GBINS"]
["GBINT"]
["GBINV"]
["GBIOG"]
["GBION"]
["GBIOS"]
["GBIPS"]
["GBIRB"]
["GBIRE"]
["GBIRV"]
["GBISA"]
["GBISY"]
["GBITC"]
["GBIVG"]
["GBIVK"]
["GBIVR"]
["GBJAR"]
["GBJHV"]
["GBJHW"]
["GBJOG"]
["GBJTB"]
["GBJUR"]
["GBKAL"]
["GBKBE"]
["GBKBK"]
["GBKBT"]
["GBKCG"]
["GBKCN"]
["GBKDE"]
["GBKEA"]
["GBKEI"]
["GBKES"]
["GBKET"]
["GBKEV"]
["GBKGH"]
["GBKHA"]
["GBKHN"]
["GBKIB"]
["GBKIC"]
["GBKIH"]
["GBKIM"]
["GBKIO"]
["GBKIP"]
["GBKIS"]
["GBKKD"]
["GBKKH"]
["GBKKL"]
["GBKKN"]
["GBKLK"]
["GBKLN"]
["GBKLR"]
["GBKLY"]
["GBKMI"]
["GBKNC"]
["GBKNK"]
["GBKOA"]
["GBKOH"]
["GBKPS"]
["GBKRM"]
["GBKSF"]
["GBKTT"]
["GBKWE"]
["GBKWH"]
["GBKWL"]
["GBKYE"]
["GBKYH"]
["GBKYL"]
["GBKYN"]
["GBKYU"]
["GBLAB"]
["GBLAH"]
["GBLAN"]
["GBLAO"]
["GBLAR"]
["GBLAV"]
["GBLAX"]
["GBLBA"]
["GBLBD"]
["GBLBE"]
["GBLBH"]
["GBLCA"]
["GBLCC"]
["GBLCD"]
["GBLCG"]
["GBLCM"]
["GBLCN"]
["GBLCR"]
["GBLCS"]
["GBLDA"]
["GBLDC"]
["GBLDO"]
["GBLDS"]
["GBLDV"]
["GBLDY"]
["GBLEA"]
["GBLEI"]
["GBLEQ"]
["GBLER"]
["GBLES"]
["GBLEW"]
["GBLFF"]
["GBLGO"]
["GBLGP"]
["GBLGS"]
["GBLHO"]
["GBLHP"]
["GBLHS"]
["GBLHT"]
["GBLHV"]
["GBLIB"]
["GBLIF"]
["GBLIT"]
["GBLIV"]
["GBLL3"]
["GBLLD"]
["GBLLN"]
["GBLLO"]
["GBLLS"]
["GBLLU"]
["GBLLZ"]
["GBLMA"]
["GBLMK"]
["GBLMN"]
["GBLMT"]
["GBLNA"]
["GBLND"]
["GBLNG"]
["GBLNL"]
["GBLNM"]
["GBLOE"]
["GBLOK"]
["GBLOL"]
["GBLON"]
["GBLOS"]
["GBLOU"]
["GBLOV"]
["GBLOW"]
["GBLOY"]
["GBLOZ"]
["GBLRG"]
["GBLRP"]
["GBLRZ"]
["GBLSC"]
["GBLSH"]
["GBLSM"]
["GBLSS"]
["GBLTD"]
["GBLTL"]
["GBLTP"]
["GBLTS"]
["GBLUG"]
["GBLUI"]
["GBLUL"]
["GBLUX"]
["GBLVK"]
["GBLVR"]
["GBLWC"]
["GBLWL"]
["GBLWT"]
["GBLXG"]
["GBLXY"]
["GBLYB"]
["GBLYD"]
["GBLYL"]
["GBLYM"]
["GBLYR"]
["GBLYS"]
["GBLYT"]
["GBLYW"]
["GBM89"]
["GBMAI"]
["GBMAL"]
["GBMAW"]
["GBMBT"]
["GBMCD"]
["GBMCL"]
["GBMDE"]
["GBMDI"]
["GBMDL"]
["GBMDW"]
["GBMEB"]
["GBMED"]
["GBMES"]
["GBMFN"]
["GBMFS"]
["GBMFY"]
["GBMGH"]
["GBMGO"]
["GBMGP"]
["GBMGT"]
["GBMHD"]
["GBMHJ"]
["GBMHT"]
["GBMID"]
["GBMIS"]
["GBMLF"]
["GBMLG"]
["GBMLI"]
["GBMLM"]
["GBMLP"]
["GBMML"]
["GBMMR"]
["GBMNC"]
["GBMNS"]
["GBMON"]
["GBMRB"]
["GBMRR"]
["GBMRS"]
["GBMRY"]
["GBMSC"]
["GBMSD"]
["GBMSH"]
["GBMSI"]
["GBMTH"]
["GBMTP"]
["GBMUA"]
["GBMVC"]
["GBMVG"]
["GBMYE"]
["GBMYL"]
["GBMYN"]
["GBMYS"]
["GBMYW"]
["GBNAI"]
["GBNAR"]
["GBNBC"]
["GBNBI"]
["GBNBS"]
["GBNBU"]
["GBNBW"]
["GBNCL"]
["GBNCN"]
["GBNCS"]
["GBNCY"]
["GBNDY"]
["GBNEA"]
["GBNEF"]
["GBNEH"]
["GBNFC"]
["GBNFK"]
["GBNFR"]
["GBNFT"]
["GBNGG"]
["GBNGI"]
["GBNHC"]
["GBNHO"]
["GBNHS"]
["GBNHV"]
["GBNLE"]
["GBNLN"]
["GBNME"]
["GBNMT"]
["GBNMY"]
["GBNNR"]
["GBNO2"]
["GBNOH"]
["GBNOQ"]
["GBNOT"]
["GBNPO"]
["GBNPT"]
["GBNRB"]
["GBNRF"]
["GBNRM"]
["GBNRO"]
["GBNRR"]
["GBNRW"]
["GBNRY"]
["GBNSA"]
["GBNSD"]
["GBNSH"]
["GBNSN"]
["GBNSS"]
["GBNTF"]
["GBNTG"]
["GBNTH"]
["GBNTL"]
["GBNTW"]
["GBNTZ"]
["GBNUI"]
["GBNWF"]
["GBNWK"]
["GBNWN"]
["GBNY2"]
["GBNYD"]
["GBNYL"]
["GBOAK"]
["GBOBA"]
["GBOBR"]
["GBOCH"]
["GBODD"]
["GBODH"]
["GBODL"]
["GBODO"]
["GBOGH"]
["GBOHM"]
["GBOHT"]
["GBOKK"]
["GBOLL"]
["GBOOR"]
["GBOOT"]
["GBORH"]
["GBORK"]
["GBORR"]
["GBOTC"]
["GBOTR"]
["GBOWW"]
["GBOYL"]
["GBPAD"]
["GBPAE"]
["GBPAG"]
["GBPAK"]
["GBPAL"]
["GBPAP"]
["GBPAR"]
["GBPAT"]
["GBPBA"]
["GBPBD"]
["GBPBM"]
["GBPCO"]
["GBPCW"]
["GBPDD"]
["GBPDI"]
["GBPDL"]
["GBPED"]
["GBPEG"]
["GBPEM"]
["GBPEN"]
["GBPER"]
["GBPFT"]
["GBPFY"]
["GBPGD"]
["GBPGG"]
["GBPGI"]
["GBPGV"]
["GBPHD"]
["GBPHV"]
["GBPI7"]
["GBPIE"]
["GBPKA"]
["GBPKD"]
["GBPKL"]
["GBPKN"]
["GBPKR"]
["GBPLN"]
["GBPLO"]
["GBPLP"]
["GBPLR"]
["GBPLV"]
["GBPLY"]
["GBPMD"]
["GBPME"]
["GBPMK"]
["GBPMM"]
["GBPMR"]
["GBPMY"]
["GBPNA"]
["GBPNB"]
["GBPNE"]
["GBPNG"]
["GBPNH"]
["GBPNV"]
["GBPOC"]
["GBPOG"]
["GBPOH"]
["GBPOI"]
["GBPOO"]
["GBPOR"]
["GBPPE"]
["GBPPG"]
["GBPPK"]
["GBPPO"]
["GBPPW"]
["GBPQT"]
["GBPRE"]
["GBPRJ"]
["GBPRL"]
["GBPRN"]
["GBPRP"]
["GBPRT"]
["GBPRU"]
["GBPRY"]
["GBPRZ"]
["GBPSB"]
["GBPSC"]
["GBPSE"]
["GBPSM"]
["GBPST"]
["GBPSU"]
["GBPSW"]
["GBPSY"]
["GBPTB"]
["GBPTC"]
["GBPTD"]
["GBPTG"]
["GBPTH"]
["GBPTL"]
["GBPTR"]
["GBPTS"]
["GBPTT"]
["GBPVD"]
["GBPVG"]
["GBPWE"]
["GBPWI"]
["GBPWL"]
["GBPWM"]
["GBQDL"]
["GBQGT"]
["GBQUB"]
["GBQWR"]
["GBQZL"]
["GBRAP"]
["GBRAS"]
["GBRAV"]
["GBRAY"]
["GBRBB"]
["GBRBD"]
["GBRBL"]
["GBRCB"]
["GBRCD"]
["GBRCS"]
["GBRDA"]
["GBRDH"]
["GBRDN"]
["GBRDS"]
["GBREA"]
["GBREB"]
["GBRED"]
["GBREJ"]
["GBREM"]
["GBREN"]
["GBRER"]
["GBREV"]
["GBRFD"]
["GBRFR"]
["GBRGH"]
["GBRGL"]
["GBRGN"]
["GBRHB"]
["GBRHS"]
["GBRHU"]
["GBRHY"]
["GBRIC"]
["GBRID"]
["GBRIE"]
["GBRIG"]
["GBRLG"]
["GBRLW"]
["GBRMB"]
["GBRME"]
["GBRMG"]
["GBRNE"]
["GBRNN"]
["GBRNR"]
["GBROC"]
["GBROR"]
["GBROU"]
["GBROW"]
["GBROY"]
["GBRPH"]
["GBRRB"]
["GBRRD"]
["GBRRO"]
["GBRRR"]
["GBRSB"]
["GBRSH"]
["GBRSL"]
["GBRST"]
["GBRSY"]
["GBRTH"]
["GBRTL"]
["GBRTY"]
["GBRUM"]
["GBRUN"]
["GBRVF"]
["GBRWS"]
["GBRYD"]
["GBRYE"]
["GBRYL"]
["GBSAA"]
["GBSAD"]
["GBSAG"]
["GBSAI"]
["GBSAU"]
["GBSAV"]
["GBSBA"]
["GBSBI"]
["GBSCA"]
["GBSCB"]
["GBSCC"]
["GBSCF"]
["GBSCG"]
["GBSCH"]
["GBSCM"]
["GBSCN"]
["GBSCO"]
["GBSCP"]
["GBSCR"]
["GBSCT"]
["GBSDL"]
["GBSDM"]
["GBSDO"]
["GBSDQ"]
["GBSDS"]
["GBSDT"]
["GBSDW"]
["GBSEA"]
["GBSEC"]
["GBSED"]
["GBSEF"]
["GBSES"]
["GBSEZ"]
["GBSF5"]
["GBSFK"]
["GBSFR"]
["GBSFU"]
["GBSFW"]
["GBSFY"]
["GBSGC"]
["GBSGM"]
["GBSGP"]
["GBSGT"]
["GBSHE"]
["GBSHG"]
["GBSHK"]
["GBSHN"]
["GBSHO"]
["GBSHS"]
["GBSHT"]
["GBSHU"]
["GBSHV"]
["GBSHX"]
["GBSHY"]
["GBSID"]
["GBSIL"]
["GBSJJ"]
["GBSJL"]
["GBSJU"]
["GBSJY"]
["GBSKE"]
["GBSKR"]
["GBSKV"]
["GBSKZ"]
["GBSLB"]
["GBSLC"]
["GBSLV"]
["GBSMA"]
["GBSMC"]
["GBSMH"]
["GBSMM"]
["GBSMP"]
["GBSMU"]
["GBSMV"]
["GBSMW"]
["GBSNC"]
["GBSND"]
["GBSNJ"]
["GBSNK"]
["GBSNS"]
["GBSNV"]
["GBSNW"]
["GBSOA"]
["GBSOQ"]
["GBSOT"]
["GBSOU"]
["GBSOW"]
["GBSPI"]
["GBSPQ"]
["GBSPT"]
["GBSPY"]
["GBSQK"]
["GBSRC"]
["GBSRH"]
["GBSRI"]
["GBSRQ"]
["GBSRT"]
["GBSRX"]
["GBSRY"]
["GBSRZ"]
["GBSSH"]
["GBSSK"]
["GBSSS"]
["GBSSY"]
["GBST2"]
["GBSTH"]
["GBSTO"]
["GBSTQ"]
["GBSTR"]
["GBSTT"]
["GBSTZ"]
["GBSUH"]
["GBSUL"]
["GBSUN"]
["GBSUT"]
["GBSVI"]
["GBSVN"]
["GBSVS"]
["GBSVT"]
["GBSVW"]
["GBSVZ"]
["GBSWA"]
["GBSWC"]
["GBSWD"]
["GBSWE"]
["GBSWN"]
["GBSWY"]
["GBSXE"]
["GBSYL"]
["GBSYM"]
["GBSYR"]
["GBSYY"]
["GBSZB"]
["GBSZC"]
["GBSZT"]
["GBTAB"]
["GBTAD"]
["GBTAI"]
["GBTAM"]
["GBTAR"]
["GBTAY"]
["GBTBN"]
["GBTBR"]
["GBTBY"]
["GBTDI"]
["GBTED"]
["GBTEE"]
["GBTEN"]
["GBTEZ"]
["GBTFO"]
["GBTFR"]
["GBTFT"]
["GBTGU"]
["GBTHF"]
["GBTHM"]
["GBTHP"]
["GBTHR"]
["GBTHS"]
["GBTHT"]
["GBTIG"]
["GBTIL"]
["GBTLD"]
["GBTLE"]
["GBTLI"]
["GBTLN"]
["GBTND"]
["GBTNG"]
["GBTNM"]
["GBTNN"]
["GBTNR"]
["GBTOB"]
["GBTOI"]
["GBTOL"]
["GBTOR"]
["GBTPB"]
["GBTPO"]
["GBTRA"]
["GBTRD"]
["GBTRL"]
["GBTRN"]
["GBTRO"]
["GBTRR"]
["GBTRS"]
["GBTRU"]
["GBTSO"]
["GBTTL"]
["GBTVD"]
["GBTWL"]
["GBTYD"]
["GBTYM"]
["GBTYN"]
["GBUCN"]
["GBUEN"]
["GBUFY"]
["GBUGH"]
["GBUIG"]
["GBULF"]
["GBULL"]
["GBULS"]
["GBUNS"]
["GBUPH"]
["GBUPI"]
["GBUPR"]
["GBURT"]
["GBUTS"]
["GBUYE"]
["GBVEN"]
["GBVGI"]
["GBVID"]
["GBVOE"]
["GBVVE"]
["GBWAB"]
["GBWAF"]
["GBWAT"]
["GBWAX"]
["GBWBF"]
["GBWBY"]
["GBWCB"]
["GBWDN"]
["GBWEX"]
["GBWEY"]
["GBWFD"]
["GBWFT"]
["GBWGD"]
["GBWGN"]
["GBWGW"]
["GBWHB"]
["GBWHE"]
["GBWHH"]
["GBWHL"]
["GBWHV"]
["GBWIC"]
["GBWIG"]
["GBWIS"]
["GBWIV"]
["GBWJH"]
["GBWKI"]
["GBWKM"]
["GBWKO"]
["GBWL2"]
["GBWLA"]
["GBWLG"]
["GBWLK"]
["GBWLS"]
["GBWLZ"]
["GBWMB"]
["GBWMD"]
["GBWMF"]
["GBWMS"]
["GBWND"]
["GBWNL"]
["GBWNS"]
["GBWNZ"]
["GBWOL"]
["GBWOR"]
["GBWOT"]
["GBWPT"]
["GBWRB"]
["GBWRE"]
["GBWRH"]
["GBWRN"]
["GBWRY"]
["GBWSM"]
["GBWSP"]
["GBWTB"]
["GBWTE"]
["GBWTS"]
["GBWTW"]
["GBWUF"]
["GBWWE"]
["GBWWL"]
["GBWWW"]
["GBWXW"]
["GBWYC"]
["GBWYK"]
["GBWYR"]
["GBWYS"]
["GBWYX"]
["GBXSS"]
["GBYAP"]
["GBYFR"]
["GBYKE"]
["GBYLL"]
["GBYLW"]
["GBYLY"]
["GBYMO"]
["GBYNT"]
["GBYOS"]
["GBYRK"]
["GBYTH"]
["GBYVZ"]
["GBZOY"]
["GD888"]
["GDGRE"]
["GDHIL"]
["GDSTG"]
["GE888"]
["GEABK"]
["GEBUS"]
["GEIES"]
["GEKUL"]
["GEPTI"]
["GESPS"]
["GF888"]
["GFCAY"]
["GFDDC"]
["GFQKR"]
["GFREM"]
["GFSLM"]
["GG888"]
["GGACI"]
["GGGCI"]
["GGSPT"]
["GH888"]
["GHADA"]
["GHAUR"]
["GHAXI"]
["GHCCT"]
["GHJUB"]
["GHKIT"]
["GHSEK"]
["GHSHA"]
["GHSPD"]
["GHTEM"]
["GHTKD"]
["GHWEA"]
["GI888"]
["GIGIB"]
["GL888"]
["GLAGM"]
["GLDAN"]
["GLFHN"]
["GLGOH"]
["GLIUT"]
["GLJAV"]
["GLJCH"]
["GLJEG"]
["GLJFR"]
["GLJGO"]
["GLJGR"]
["GLJHS"]
["GLJJU"]
["GLJNN"]
["GLJNS"]
["GLJSU"]
["GLKAN"]
["GLKUL"]
["GLKUN"]
["GLKUS"]
["GLMML"]
["GLMRG"]
["GLNAL"]
["GLNAQ"]
["GLOBY"]
["GLSEQ"]
["GLTHU"]
["GLTNT"]
["GLTOV"]
["GLUAK"]
["GLUMD"]
["GM888"]
["GMBJL"]
["GMSUK"]
["GN888"]
["GNBEL"]
["GNBFA"]
["GNBRP"]
["GNBTY"]
["GNCKY"]
["GNDKA"]
["GNDPL"]
["GNKMC"]
["GNKMR"]
["GNKTG"]
["GNPMT"]
["GNSBY"]
["GP888"]
["GPBBR"]
["GPBMH"]
["GPCBE"]
["GPFAE"]
["GPGOS"]
["GPGRB"]
["GPJAR"]
["GPMSB"]
["GPPTL"]
["GPPTP"]
["GPSFC"]
["GQ888"]
["GQATE"]
["GQBSG"]
["GQBUL"]
["GQCOG"]
["GQLUB"]
["GQPET"]
["GQSER"]
["GQSSG"]
["GQZAF"]
["GR888"]
["GR88P"]
["GR88R"]
["GRACL"]
["GRADL"]
["GRAEF"]
["GRAEG"]
["GRAEN"]
["GRAGA"]
["GRAGE"]
["GRAGF"]
["GRAGG"]
["GRAGK"]
["GRAGM"]
["GRAGN"]
["GRAGO"]
["GRAGT"]
["GRAID"]
["GRAIG"]
["GRAIO"]
["GRAKH"]
["GRAKI"]
["GRAKM"]
["GRAKO"]
["GRAKT"]
["GRALG"]
["GRALO"]
["GRALY"]
["GRAMF"]
["GRAMI"]
["GRAML"]
["GRAMR"]
["GRANA"]
["GRAND"]
["GRANI"]
["GRANL"]
["GRANP"]
["GRANT"]
["GRAOK"]
["GRAOR"]
["GRAPE"]
["GRAPL"]
["GRAPV"]
["GRARD"]
["GRARK"]
["GRARM"]
["GRARS"]
["GRARX"]
["GRASF"]
["GRASS"]
["GRAST"]
["GRATA"]
["GRATK"]
["GRATL"]
["GRATN"]
["GRATS"]
["GRAVA"]
["GRAXD"]
["GRCFU"]
["GRCHQ"]
["GRCHR"]
["GRCLK"]
["GRCSF"]
["GRDAF"]
["GRDIA"]
["GRDIK"]
["GRDMB"]
["GRDON"]
["GRDOS"]
["GRDPA"]
["GRDRE"]
["GRDSD"]
["GREDI"]
["GREEU"]
["GREGI"]
["GRELN"]
["GRELT"]
["GREPI"]
["GRERE"]
["GRERK"]
["GRERM"]
["GRERY"]
["GRETK"]
["GREYD"]
["GRFAM"]
["GRFIS"]
["GRFLS"]
["GRFNR"]
["GRFOL"]
["GRFOU"]
["GRGAD"]
["GRGAL"]
["GRGAV"]
["GRGFD"]
["GRGLO"]
["GRGLX"]
["GRGLY"]
["GRGMA"]
["GRGPA"]
["GRGYT"]
["GRHAL"]
["GRHER"]
["GRHRK"]
["GRHYD"]
["GRIER"]
["GRIES"]
["GRIGO"]
["GRINO"]
["GRIOS"]
["GRITA"]
["GRITH"]
["GRITM"]
["GRJKH"]
["GRJMK"]
["GRJNX"]
["GRJSH"]
["GRJSI"]
["GRJSY"]
["GRJTR"]
["GRJTY"]
["GRKAG"]
["GRKAH"]
["GRKAI"]
["GRKAK"]
["GRKAP"]
["GRKAR"]
["GRKAS"]
["GRKDM"]
["GRKEA"]
["GRKEF"]
["GRKEI"]
["GRKEM"]
["GRKER"]
["GRKGS"]
["GRKIM"]
["GRKIN"]
["GRKIO"]
["GRKIP"]
["GRKIS"]
["GRKLD"]
["GRKLI"]
["GRKLL"]
["GRKLM"]
["GRKLX"]
["GRKMI"]
["GRKMS"]
["GRKNS"]
["GRKOF"]
["GRKPS"]
["GRKRE"]
["GRKRM"]
["GRKRT"]
["GRKSI"]
["GRKSJ"]
["GRKSK"]
["GRKSP"]
["GRKST"]
["GRKTP"]
["GRKTS"]
["GRKVA"]
["GRKYL"]
["GRKYM"]
["GRKYT"]
["GRLAR"]
["GRLAV"]
["GRLDR"]
["GRLEF"]
["GRLEV"]
["GRLFK"]
["GRLGA"]
["GRLIA"]
["GRLII"]
["GRLIN"]
["GRLIP"]
["GRLIX"]
["GRLND"]
["GRLRS"]
["GRLRY"]
["GRLTR"]
["GRLVR"]
["GRM8L"]
["GRMDR"]
["GRMEA"]
["GRMEG"]
["GRMEL"]
["GRMEN"]
["GRMET"]
["GRMGL"]
["GRMGN"]
["GRMHI"]
["GRMJT"]
["GRMKP"]
["GRMOL"]
["GRMON"]
["GRMOU"]
["GRMRM"]
["GRMRS"]
["GRMSA"]
["GRMTR"]
["GRMVO"]
["GRMXK"]
["GRMYB"]
["GRMYL"]
["GRMYR"]
["GRNAF"]
["GRNAR"]
["GRNAS"]
["GRNEA"]
["GRNGL"]
["GRNID"]
["GRNIS"]
["GRNKA"]
["GRNKV"]
["GRNMA"]
["GRNPK"]
["GRNPY"]
["GRNST"]
["GROIK"]
["GRORE"]
["GRORO"]
["GROTH"]
["GROUR"]
["GRP5T"]
["GRPAA"]
["GRPAO"]
["GRPAR"]
["GRPAS"]
["GRPAX"]
["GRPCH"]
["GRPEB"]
["GRPEL"]
["GRPEP"]
["GRPER"]
["GRPFA"]
["GRPGM"]
["GRPHE"]
["GRPIA"]
["GRPIL"]
["GRPIR"]
["GRPIS"]
["GRPIT"]
["GRPKE"]
["GRPKK"]
["GRPLC"]
["GRPLG"]
["GRPLI"]
["GRPLM"]
["GRPLO"]
["GRPLV"]
["GRPME"]
["GRPMS"]
["GRPNT"]
["GRPOA"]
["GRPPI"]
["GRPRE"]
["GRPRO"]
["GRPRR"]
["GRPSA"]
["GRPSE"]
["GRPSF"]
["GRPSK"]
["GRPTE"]
["GRPTI"]
["GRPTK"]
["GRPTL"]
["GRPTR"]
["GRPVK"]
["GRPYL"]
["GRPYR"]
["GRPYT"]
["GRPYV"]
["GRRAF"]
["GRRET"]
["GRREV"]
["GRRHO"]
["GRRIO"]
["GRRIZ"]
["GRROU"]
["GRSAI"]
["GRSAL"]
["GRSAM"]
["GRSAT"]
["GRSCR"]
["GRSDH"]
["GRSER"]
["GRSFN"]
["GRSGB"]
["GRSGI"]
["GRSGR"]
["GRSGT"]
["GRSHA"]
["GRSHC"]
["GRSHI"]
["GRSII"]
["GRSIK"]
["GRSKA"]
["GRSKD"]
["GRSKG"]
["GRSKM"]
["GRSKO"]
["GRSKU"]
["GRSLA"]
["GRSMI"]
["GRSNK"]
["GRSOG"]
["GRSOI"]
["GRSOR"]
["GRSOS"]
["GRSOU"]
["GRSPE"]
["GRSTI"]
["GRSTN"]
["GRSUD"]
["GRSYM"]
["GRSYS"]
["GRSYV"]
["GRTEM"]
["GRTHM"]
["GRTHP"]
["GRTIL"]
["GRTIN"]
["GRTKO"]
["GRTLA"]
["GRTRK"]
["GRTRS"]
["GRTRY"]
["GRTSI"]
["GRTSO"]
["GRTVR"]
["GRVAB"]
["GRVLC"]
["GRVLM"]
["GRVOL"]
["GRVOM"]
["GRVRI"]
["GRVSS"]
["GRVTH"]
["GRXKB"]
["GRXZX"]
["GRYAL"]
["GRYER"]
["GRYLI"]
["GRZAQ"]
["GRZTH"]
["GS888"]
["GSGRV"]
["GSLEH"]
["GT888"]
["GTCHR"]
["GTE8C"]
["GTELE"]
["GTLAA"]
["GTLIV"]
["GTPBR"]
["GTPRQ"]
["GTRIO"]
["GTSNJ"]
["GTSTC"]
["GTTUC"]
["GTVIN"]
["GU888"]
["GUAPR"]
["GUBRR"]
["GUGUM"]
["GW888"]
["GWBNT"]
["GWBOL"]
["GWBQE"]
["GWCAC"]
["GWCJA"]
["GWFAR"]
["GWOXB"]
["GY888"]
["GYANT"]
["GYEVR"]
["GYGEO"]
["GYGFO"]
["GYLDN"]
["GYNAM"]
["HK888"]
["HK9YM"]
["HKABD"]
["HKALC"]
["HKCWB"]
["HKHKC"]
["HKHKG"]
["HKKWN"]
["HKLAM"]
["HKTOL"]
["HKTST"]
["HKVIC"]
["HKWNI"]
["HKYUE"]
["HM888"]
["HMHEA"]
["HMMCD"]
["HN888"]
["HNAMP"]
["HNGJA"]
["HNHNN"]
["HNLCE"]
["HNOMO"]
["HNPCA"]
["HNPCR"]
["HNRTB"]
["HNSAP"]
["HNSLO"]
["HNTEA"]
["HNTGU"]
["HNTJI"]
["HR888"]
["HR88P"]
["HR88R"]
["HR9SA"]
["HRALJ"]
["HRANA"]
["HRANN"]
["HRATL"]
["HRBAK"]
["HRBAS"]
["HRBAT"]
["HRBLC"]
["HRBLE"]
["HRBNM"]
["HRBOL"]
["HRBOR"]
["HRBRB"]
["HRBRI"]
["HRBRV"]
["HRBZA"]
["HRCRA"]
["HRCRS"]
["HRCVT"]
["HRDAL"]
["HRDBV"]
["HRDLJ"]
["HRDNC"]
["HRDRK"]
["HRDUR"]
["HRERD"]
["HRFIL"]
["HRFNA"]
["HRGNA"]
["HRHVA"]
["HRIDA"]
["HRIDB"]
["HRIDC"]
["HRIKA"]
["HRIKB"]
["HRIKJ"]
["HRILO"]
["HRIRI"]
["HRIST"]
["HRIVA"]
["HRIVB"]
["HRIVC"]
["HRIVD"]
["HRIVE"]
["HRIVK"]
["HRIZJ"]
["HRIZS"]
["HRJAB"]
["HRJDR"]
["HRJSA"]
["HRKAB"]
["HRKAL"]
["HRKAT"]
["HRKFR"]
["HRKJV"]
["HRKLK"]
["HRKMN"]
["HRKMZ"]
["HRKOR"]
["HRKOS"]
["HRKPR"]
["HRKRA"]
["HRKRK"]
["HRKRM"]
["HRKUK"]
["HRKZA"]
["HRLAM"]
["HRLKR"]
["HRLPD"]
["HRLPR"]
["HRLST"]
["HRLSZ"]
["HRMAK"]
["HRMAL"]
["HRMAR"]
["HRMAS"]
["HRMET"]
["HRMHV"]
["HRMIL"]
["HRMIZ"]
["HRMNK"]
["HRMOD"]
["HRMOM"]
["HRMRG"]
["HRMRJ"]
["HRMTA"]
["HRMUR"]
["HRN9F"]
["HRNDD"]
["HRNOV"]
["HRNRZ"]
["HRNVD"]
["HRNVG"]
["HRNVL"]
["HROMI"]
["HROMS"]
["HRONJ"]
["HROPA"]
["HROPT"]
["HRORB"]
["HROSI"]
["HRPAG"]
["HRPAS"]
["HRPCA"]
["HRPLA"]
["HRPLE"]
["HRPLM"]
["HRPMN"]
["HRPNT"]
["HRPOR"]
["HRPRE"]
["HRPRI"]
["HRPRN"]
["HRPRP"]
["HRPRS"]
["HRPRV"]
["HRPRZ"]
["HRPUY"]
["HRPVK"]
["HRRAB"]
["HRRAS"]
["HRRBC"]
["HRRES"]
["HRRGC"]
["HRRGN"]
["HRRJK"]
["HRROV"]
["HRRVC"]
["HRSAL"]
["HRSBD"]
["HRSBR"]
["HRSDR"]
["HRSEN"]
["HRSGD"]
["HRSGR"]
["HRSIB"]
["HRSIL"]
["HRSIS"]
["HRSLA"]
["HRSLC"]
["HRSLO"]
["HRSLT"]
["HRSMN"]
["HRSPL"]
["HRSPU"]
["HRSRD"]
["HRSRG"]
["HRSSK"]
["HRSTM"]
["HRSTO"]
["HRSTP"]
["HRSUC"]
["HRSUP"]
["HRSUR"]
["HRSUS"]
["HRSUT"]
["HRSVJ"]
["HRSVK"]
["HRTKN"]
["HRTNO"]
["HRTNR"]
["HRTRI"]
["HRTRJ"]
["HRTRK"]
["HRTRO"]
["HRTUR"]
["HRUBL"]
["HRUMG"]
["HRUNJ"]
["HRUVM"]
["HRVDC"]
["HRVES"]
["HRVGN"]
["HRVIS"]
["HRVIZ"]
["HRVLB"]
["HRVLK"]
["HRVLN"]
["HRVRA"]
["HRVRG"]
["HRVRK"]
["HRVRR"]
["HRVRS"]
["HRVUK"]
["HRXXX"]
["HRZAD"]
["HRZAG"]
["HRZGL"]
["HRZLR"]
["HRZUT"]
["HT888"]
["HTACA"]
["HTCAP"]
["HTCRC"]
["HTFLI"]
["HTFOM"]
["HTGVS"]
["HTJAK"]
["HTJEE"]
["HTLFF"]
["HTLFT"]
["HTMIR"]
["HTPAP"]
["HTPEG"]
["HTPLH"]
["HTSMC"]
["HU888"]
["HUADY"]
["HUAFU"]
["HUAKT"]
["HUALS"]
["HUASZ"]
["HUBDA"]
["HUBRS"]
["HUBUD"]
["HUBZE"]
["HUBZO"]
["HUCMR"]
["HUCPE"]
["HUDEB"]
["HUDPA"]
["HUDRE"]
["HUDUU"]
["HUDVE"]
["HUEBS"]
["HUERC"]
["HUERD"]
["HUEST"]
["HUFVS"]
["HUGNY"]
["HUGYO"]
["HUHAL"]
["HUHRT"]
["HUHYF"]
["HUJKZ"]
["HUKAR"]
["HUKCO"]
["HUKET"]
["HUKIA"]
["HUKKU"]
["HUKOM"]
["HUKOR"]
["HULAB"]
["HULMY"]
["HUMCQ"]
["HUMKN"]
["HUMOH"]
["HUMTY"]
["HUNGB"]
["HUNSZ"]
["HUNZA"]
["HUOOD"]
["HUPAL"]
["HUPES"]
["HURSP"]
["HUSZD"]
["HUSZE"]
["HUSZM"]
["HUTAC"]
["HUTHT"]
["HUTOJ"]
["HUUPS"]
["HUVIG"]
["HUXEL"]
["HUXXX"]
["HUZAR"]
["HUZSI"]
["HUZTK"]
["ID888"]
["IDADB"]
["IDAGR"]
["IDAJN"]
["IDAKE"]
["IDAMA"]
["IDAMP"]
["IDAMQ"]
["IDANG"]
["IDANO"]
["IDANR"]
["IDAPN"]
["IDARB"]
["IDASI"]
["IDAUN"]
["IDBAK"]
["IDBAL"]
["IDBAM"]
["IDBDJ"]
["IDBEK"]
["IDBEN"]
["IDBET"]
["IDBGD"]
["IDBGG"]
["IDBIK"]
["IDBIR"]
["IDBIT"]
["IDBJU"]
["IDBKS"]
["IDBLH"]
["IDBLI"]
["IDBLL"]
["IDBLT"]
["IDBLV"]
["IDBLW"]
["IDBMT"]
["IDBMU"]
["IDBNG"]
["IDBNT"]
["IDBOA"]
["IDBPN"]
["IDBTM"]
["IDBTN"]
["IDBTW"]
["IDBUA"]
["IDBUG"]
["IDBUR"]
["IDBXT"]
["IDBYQ"]
["IDCBN"]
["IDCEB"]
["IDCER"]
["IDCIW"]
["IDCSA"]
["IDCTO"]
["IDCXP"]
["IDDAS"]
["IDDIV"]
["IDDJA"]
["IDDJB"]
["IDDJJ"]
["IDDMA"]
["IDDOB"]
["IDDOG"]
["IDDUM"]
["IDELA"]
["IDENO"]
["IDEXS"]
["IDFKQ"]
["IDFTG"]
["IDGEE"]
["IDGIL"]
["IDGNS"]
["IDGRE"]
["IDGRG"]
["IDGTO"]
["IDGTS"]
["IDIBT"]
["IDINA"]
["IDJBK"]
["IDJBT"]
["IDJEP"]
["IDJIP"]
["IDJKT"]
["IDJOR"]
["IDJPU"]
["IDJWA"]
["IDKAH"]
["IDKAM"]
["IDKAR"]
["IDKAS"]
["IDKAU"]
["IDKBH"]
["IDKDI"]
["IDKDW"]
["IDKEM"]
["IDKGH"]
["IDKHY"]
["IDKID"]
["IDKKA"]
["IDKKB"]
["IDKMD"]
["IDKNL"]
["IDKNT"]
["IDKOE"]
["IDKOJ"]
["IDKOK"]
["IDKOL"]
["IDKPL"]
["IDKPN"]
["IDKRG"]
["IDKSE"]
["IDKSO"]
["IDKTG"]
["IDKTJ"]
["IDKUA"]
["IDKUM"]
["IDLAH"]
["IDLAS"]
["IDLAT"]
["IDLBM"]
["IDLBO"]
["IDLBR"]
["IDLIF"]
["IDLKI"]
["IDLLA"]
["IDLOM"]
["IDLSW"]
["IDLTT"]
["IDLUW"]
["IDLVN"]
["IDMAI"]
["IDMAJ"]
["IDMAK"]
["IDMAL"]
["IDMAR"]
["IDMBK"]
["IDMDC"]
["IDMDR"]
["IDMEQ"]
["IDMES"]
["IDMGB"]
["IDMIT"]
["IDMJU"]
["IDMKJ"]
["IDMKQ"]
["IDMKW"]
["IDMLI"]
["IDMNT"]
["IDMOF"]
["IDMOR"]
["IDMOW"]
["IDMPN"]
["IDMRB"]
["IDMRI"]
["IDMRK"]
["IDMSB"]
["IDMSK"]
["IDMTU"]
["IDMUB"]
["IDMUD"]
["IDMUO"]
["IDMUP"]
["IDMUW"]
["IDNIP"]
["IDNNX"]
["IDNPL"]
["IDOBI"]
["IDOJA"]
["IDOKA"]
["IDOLO"]
["IDPAG"]
["IDPAL"]
["IDPAS"]
["IDPAZ"]
["IDPBB"]
["IDPBJ"]
["IDPDG"]
["IDPDJ"]
["IDPER"]
["IDPEX"]
["IDPGA"]
["IDPGK"]
["IDPGM"]
["IDPGX"]
["IDPIR"]
["IDPJM"]
["IDPKN"]
["IDPKR"]
["IDPKS"]
["IDPLA"]
["IDPLM"]
["IDPMG"]
["IDPMK"]
["IDPNG"]
["IDPNJ"]
["IDPNK"]
["IDPNN"]
["IDPNT"]
["IDPOL"]
["IDPOT"]
["IDPPO"]
["IDPPS"]
["IDPRN"]
["IDPRO"]
["IDPSJ"]
["IDPSS"]
["IDPTL"]
["IDPUM"]
["IDPUT"]
["IDPWG"]
["IDREO"]
["IDRGT"]
["IDRNI"]
["IDSAD"]
["IDSAN"]
["IDSAP"]
["IDSAS"]
["IDSAT"]
["IDSBG"]
["IDSBM"]
["IDSBS"]
["IDSDA"]
["IDSDJ"]
["IDSEB"]
["IDSEP"]
["IDSEQ"]
["IDSGO"]
["IDSGU"]
["IDSIA"]
["IDSID"]
["IDSKI"]
["IDSKK"]
["IDSKP"]
["IDSKW"]
["IDSLG"]
["IDSMB"]
["IDSMQ"]
["IDSNG"]
["IDSOQ"]
["IDSPA"]
["IDSPH"]
["IDSRG"]
["IDSRI"]
["IDSSO"]
["IDSTN"]
["IDSTU"]
["IDSUA"]
["IDSUB"]
["IDSUG"]
["IDSUK"]
["IDSUM"]
["IDSUN"]
["IDSUP"]
["IDSUQ"]
["IDSUS"]
["IDSWQ"]
["IDSWT"]
["IDSZA"]
["IDSZH"]
["IDTAB"]
["IDTAL"]
["IDTAN"]
["IDTAR"]
["IDTAX"]
["IDTBG"]
["IDTBL"]
["IDTBN"]
["IDTBO"]
["IDTBR"]
["IDTBT"]
["IDTBU"]
["IDTEG"]
["IDTER"]
["IDTJB"]
["IDTJQ"]
["IDTKA"]
["IDTLI"]
["IDTME"]
["IDTMK"]
["IDTMO"]
["IDTNJ"]
["IDTPN"]
["IDTRH"]
["IDTRK"]
["IDTSE"]
["IDTTE"]
["IDTUA"]
["IDTZD"]
["IDUDG"]
["IDUPG"]
["IDUTC"]
["IDUTE"]
["IDWAI"]
["IDWAN"]
["IDWED"]
["IDWGP"]
["IDWID"]
["IDWSS"]
["IE888"]
["IE88P"]
["IE88R"]
["IEACR"]
["IEALQ"]
["IEARD"]
["IEARH"]
["IEARK"]
["IEARO"]
["IEATN"]
["IEAUG"]
["IEBBG"]
["IEBGY"]
["IEBHT"]
["IEBIF"]
["IEBIT"]
["IEBLL"]
["IEBNA"]
["IEBNG"]
["IEBTH"]
["IEBTM"]
["IEBUC"]
["IEBUR"]
["IEBVD"]
["IEBYT"]
["IECAR"]
["IECBR"]
["IECCT"]
["IECDF"]
["IECFI"]
["IECFN"]
["IECHE"]
["IECLC"]
["IECLG"]
["IECLI"]
["IECOB"]
["IECRO"]
["IECRS"]
["IECSW"]
["IECTB"]
["IEDCN"]
["IEDDK"]
["IEDFA"]
["IEDFB"]
["IEDFC"]
["IEDFM"]
["IEDFT"]
["IEDFY"]
["IEDGV"]
["IEDIN"]
["IEDLG"]
["IEDMF"]
["IEDNM"]
["IEDPP"]
["IEDRO"]
["IEDUB"]
["IEDWE"]
["IEEBF"]
["IEEKY"]
["IEESB"]
["IEFCW"]
["IEFEN"]
["IEFGY"]
["IEFID"]
["IEFIN"]
["IEFOV"]
["IEFPD"]
["IEFPL"]
["IEFRW"]
["IEFTD"]
["IEGGA"]
["IEGOW"]
["IEGRE"]
["IEGRN"]
["IEGRT"]
["IEGWY"]
["IEHAU"]
["IEHOW"]
["IEKBS"]
["IEKIC"]
["IEKKA"]
["IEKLA"]
["IEKLN"]
["IEKLR"]
["IEKNG"]
["IELAR"]
["IELEA"]
["IELMK"]
["IEMAG"]
["IEMAP"]
["IEMAR"]
["IEMOT"]
["IEMOV"]
["IEMRT"]
["IEMTL"]
["IENAY"]
["IENET"]
["IENEX"]
["IENMT"]
["IENRR"]
["IENRS"]
["IEORK"]
["IEPAP"]
["IEPAT"]
["IEPAW"]
["IERAT"]
["IERAV"]
["IERDM"]
["IERDT"]
["IERIN"]
["IEROE"]
["IEROS"]
["IERPT"]
["IERRR"]
["IERSM"]
["IERSV"]
["IERTN"]
["IERUS"]
["IERVM"]
["IESAJ"]
["IESKL"]
["IESLI"]
["IESNN"]
["IESNR"]
["IETAR"]
["IETIV"]
["IETLK"]
["IETME"]
["IETOB"]
["IETQY"]
["IETRA"]
["IETRP"]
["IEWAT"]
["IEWCQ"]
["IEWES"]
["IEWEX"]
["IEWGI"]
["IEWHI"]
["IEWIC"]
["IEWID"]
["IEWIL"]
["IEYOU"]
["IL888"]
["IL8UH"]
["ILACR"]
["ILAKK"]
["ILAKL"]
["ILAS2"]
["ILASH"]
["ILBGV"]
["ILETH"]
["ILHAD"]
["ILHFA"]
["ILJUL"]
["ILKFV"]
["ILKY7"]
["ILM8A"]
["ILMSP"]
["ILNAB"]
["ILNAT"]
["ILOFR"]
["ILTIB"]
["ILTLV"]
["IM888"]
["IMCTN"]
["IMDGS"]
["IMPEL"]
["IMPSM"]
["IMRAM"]
["IMSAN"]
["IN888"]
["INABG"]
["INACH"]
["INADI"]
["INAIS"]
["INALA"]
["INALF"]
["INAMI"]
["INANG"]
["INANL"]
["INATU"]
["INAZK"]
["INBAW"]
["INBBP"]
["INBDA"]
["INBDG"]
["INBDH"]
["INBDQ"]
["INBDR"]
["INBED"]
["INBET"]
["INBEY"]
["INBGW"]
["INBHM"]
["INBHU"]
["INBKT"]
["INBLK"]
["INBLM"]
["INBLP"]
["INBND"]
["INBOM"]
["INBPL"]
["INBPQ"]
["INBPT"]
["INBRH"]
["INBRM"]
["INBRU"]
["INBRY"]
["INBSN"]
["INBSR"]
["INBTK"]
["INBTR"]
["INBUD"]
["INBWN"]
["INBYT"]
["INCAM"]
["INCAP"]
["INCAR"]
["INCBL"]
["INCCJ"]
["INCCU"]
["INCDL"]
["INCHI"]
["INCHR"]
["INCOK"]
["INCOL"]
["INCOO"]
["INCRN"]
["INCTI"]
["INDAH"]
["INDAM"]
["INDEG"]
["INDHP"]
["INDHR"]
["INDHU"]
["INDIG"]
["INDIU"]
["INDIV"]
["INDMA"]
["INDMQ"]
["INDMT"]
["INDRK"]
["INDRL"]
["INDSK"]
["INDTW"]
["INDWA"]
["INEKM"]
["INENR"]
["INERO"]
["INESH"]
["INGAN"]
["INGAU"]
["INGGA"]
["INGGV"]
["INGHA"]
["INGND"]
["INGNO"]
["INGPR"]
["INGRR"]
["INHAL"]
["INHGT"]
["INHIP"]
["INHON"]
["INHRN"]
["INHWR"]
["INHZA"]
["INICD"]
["INIXE"]
["INIXJ"]
["INIXM"]
["INIXY"]
["INIXZ"]
["INJAK"]
["INJBD"]
["INJDA"]
["INJDG"]
["INJGD"]
["INJTP"]
["INKAK"]
["INKAL"]
["INKAR"]
["INKAT"]
["INKBT"]
["INKDI"]
["INKDP"]
["INKHO"]
["INKIW"]
["INKKM"]
["INKKR"]
["INKKU"]
["INKLY"]
["INKMB"]
["INKND"]
["INKOD"]
["INKOI"]
["INKOK"]
["INKON"]
["INKPI"]
["INKRI"]
["INKRK"]
["INKRN"]
["INKRP"]
["INKRW"]
["INKSG"]
["INKSH"]
["INKSP"]
["INKTD"]
["INKTI"]
["INKTK"]
["INKTP"]
["INKTW"]
["INKVI"]
["INKVL"]
["INKVT"]
["INLNG"]
["INLPR"]
["INMAA"]
["INMAH"]
["INMAL"]
["INMAP"]
["INMCI"]
["INMDA"]
["INMDK"]
["INMDP"]
["INMDV"]
["INMDW"]
["INMGR"]
["INMHA"]
["INMLI"]
["INMLP"]
["INMLW"]
["INMNR"]
["INMNW"]
["INMOB"]
["INMRA"]
["INMRI"]
["INMRK"]
["INMRM"]
["INMTW"]
["INMUG"]
["INMUN"]
["INMUR"]
["INMYB"]
["INNAN"]
["INNAV"]
["INNDG"]
["INNEE"]
["INNEL"]
["INNGC"]
["INNHV"]
["INNML"]
["INNPT"]
["INNSA"]
["INNTU"]
["INNVB"]
["INNVP"]
["INNVT"]
["INNWP"]
["INOKH"]
["INONJ"]
["INORS"]
["INPAN"]
["INPAV"]
["INPBD"]
["INPDD"]
["INPER"]
["INPID"]
["INPIN"]
["INPMB"]
["INPNF"]
["INPNJ"]
["INPNM"]
["INPNN"]
["INPNY"]
["INPPJ"]
["INPPT"]
["INPPV"]
["INPRG"]
["INPRN"]
["INPRT"]
["INPSH"]
["INPST"]
["INPUL"]
["INPUR"]
["INQUI"]
["INRAM"]
["INRED"]
["INRGT"]
["INRJP"]
["INRJR"]
["INRKG"]
["INRNC"]
["INRNR"]
["INROZ"]
["INRRI"]
["INRTC"]
["INRVD"]
["INSAD"]
["INSAL"]
["INSAM"]
["INSBH"]
["INSHI"]
["INSHP"]
["INSIK"]
["INSIL"]
["INSIM"]
["INSKK"]
["INSMR"]
["INSRV"]
["INSTP"]
["INSTV"]
["INSWA"]
["INSWD"]
["INTAD"]
["INTEL"]
["INTHL"]
["INTHN"]
["INTIV"]
["INTJA"]
["INTKS"]
["INTMP"]
["INTNA"]
["INTND"]
["INTNK"]
["INTPH"]
["INTPN"]
["INTRA"]
["INTRP"]
["INTUN"]
["INTUT"]
["INTYR"]
["INULW"]
["INUMB"]
["INUMR"]
["INURA"]
["INUTN"]
["INVAD"]
["INVEN"]
["INVEP"]
["INVIG"]
["INVKM"]
["INVNG"]
["INVRD"]
["INVRU"]
["INVSI"]
["INVSV"]
["INVTZ"]
["INVVA"]
["INVYD"]
["INVZJ"]
["INWAD"]
["INZUM"]
["IO888"]
["IQ888"]
["IQALF"]
["IQASD"]
["IQBGW"]
["IQBSR"]
["IQFAO"]
["IQHIL"]
["IQIKD"]
["IQKAR"]
["IQKAZ"]
["IQKHA"]
["IQKIK"]
["IQMAB"]
["IQMAN"]
["IQNAS"]
["IQNJF"]
["IQNSR"]
["IQOSM"]
["IQSAM"]
["IQTJI"]
["IQTQD"]
["IQUQR"]
["IQZAO"]
["IR888"]
["IRABD"]
["IRAMD"]
["IRAMP"]
["IRASA"]
["IRAZD"]
["IRBAH"]
["IRBAM"]
["IRBAZ"]
["IRBIK"]
["IRBKK"]
["IRBKM"]
["IRBMR"]
["IRBND"]
["IRBPA"]
["IRBRG"]
["IRBSR"]
["IRBUZ"]
["IRCYT"]
["IRDAY"]
["IRFKR"]
["IRIFN"]
["IRIMH"]
["IRKAS"]
["IRKHK"]
["IRKHO"]
["IRKSH"]
["IRLIN"]
["IRLVP"]
["IRMRX"]
["IRNEK"]
["IRNKA"]
["IRNSH"]
["IRRBA"]
["IRSBR"]
["IRSIX"]
["IRSRA"]
["IRSRP"]
["IRSXI"]
["IRSYZ"]
["IRTBZ"]
["IRTMB"]
["IRZBR"]
["IS888"]
["IS88P"]
["IS88R"]
["ISAEY"]
["ISAKR"]
["ISAKU"]
["ISASS"]
["ISBAK"]
["ISBGJ"]
["ISBIL"]
["ISBLO"]
["ISBOI"]
["ISBOL"]
["ISBOR"]
["ISBRE"]
["ISBRJ"]
["ISBUD"]
["ISDAL"]
["ISDJU"]
["ISDPV"]
["ISDRA"]
["ISEFJ"]
["ISESK"]
["ISFAS"]
["ISFEY"]
["ISFLA"]
["ISGRB"]
["ISGRD"]
["ISGRE"]
["ISGRF"]
["ISGRI"]
["ISGRT"]
["ISGRY"]
["ISGUF"]
["ISHAF"]
["ISHEL"]
["ISHFN"]
["ISHJA"]
["ISHNR"]
["ISHOF"]
["ISHRI"]
["ISHUS"]
["ISHVK"]
["ISHVM"]
["ISHVR"]
["ISISA"]
["ISKEF"]
["ISKEV"]
["ISKJF"]
["ISKOP"]
["ISKOV"]
["ISKRO"]
["ISLAN"]
["ISLSA"]
["ISMJH"]
["ISMJO"]
["ISMOS"]
["ISNES"]
["ISNJA"]
["ISNOU"]
["ISOLF"]
["ISOLV"]
["ISOSP"]
["ISPAT"]
["ISRAU"]
["ISREY"]
["ISRFJ"]
["ISRHA"]
["ISRIF"]
["ISSAN"]
["ISSAU"]
["ISSEY"]
["ISSIG"]
["ISSKA"]
["ISSTD"]
["ISSTR"]
["ISSTY"]
["ISSUD"]
["ISSUV"]
["ISSVA"]
["ISTAL"]
["ISTEY"]
["ISTHH"]
["ISTHN"]
["ISTHO"]
["ISVES"]
["ISVOG"]
["ISVPN"]
["IT888"]
["IT88P"]
["IT88R"]
["ITAAS"]
["ITACL"]
["ITACT"]
["ITADA"]
["ITAEL"]
["ITAGP"]
["ITAHO"]
["ITALI"]
["ITALS"]
["ITAMA"]
["ITAMN"]
["ITAMT"]
["ITANZ"]
["ITAOA"]
["ITAOI"]
["ITAOL"]
["ITAOR"]
["ITATA"]
["ITATI"]
["ITATX"]
["ITAUG"]
["ITAVO"]
["ITAZA"]
["ITB8D"]
["ITBAI"]
["ITBCB"]
["ITBCE"]
["ITBDS"]
["ITBGH"]
["ITBLA"]
["ITBLN"]
["ITBLT"]
["ITBMA"]
["ITBMT"]
["ITBNC"]
["ITBOA"]
["ITBRI"]
["ITBVM"]
["ITCAG"]
["ITCAS"]
["ITCCB"]
["ITCCL"]
["ITCCQ"]
["ITCEC"]
["ITCEQ"]
["ITCEV"]
["ITCFU"]
["ITCGC"]
["ITCHI"]
["ITCHX"]
["ITCLF"]
["ITCLS"]
["ITCML"]
["ITCNT"]
["ITCOQ"]
["ITCPA"]
["ITCPM"]
["ITCPN"]
["ITCRQ"]
["ITCRT"]
["ITCRV"]
["ITCTA"]
["ITCTK"]
["ITCTR"]
["ITCVV"]
["ITCVX"]
["ITDIA"]
["ITDNO"]
["ITFAL"]
["ITFAO"]
["ITFAV"]
["ITFCO"]
["ITFCV"]
["ITFGE"]
["ITFME"]
["ITFNL"]
["ITFOL"]
["ITFOM"]
["ITFOR"]
["ITFPO"]
["ITFRD"]
["ITFSA"]
["ITGAE"]
["ITGAI"]
["ITGAL"]
["ITGEA"]
["ITGIA"]
["ITGII"]
["ITGIT"]
["ITGLJ"]
["ITGMA"]
["ITGOA"]
["ITGOO"]
["ITGOR"]
["ITGRD"]
["ITGSV"]
["ITGUI"]
["ITGVZ"]
["ITGZS"]
["ITICA"]
["ITIDF"]
["ITIDG"]
["ITIMP"]
["ITIOA"]
["ITIOI"]
["ITISB"]
["ITISH"]
["ITISN"]
["ITISS"]
["ITJLO"]
["ITLAD"]
["ITLAE"]
["ITLAW"]
["ITLEA"]
["ITLEC"]
["ITLEN"]
["ITLER"]
["ITLES"]
["ITLEV"]
["ITLIC"]
["ITLIP"]
["ITLIU"]
["ITLIV"]
["ITLLT"]
["ITLMP"]
["ITLOA"]
["ITLSD"]
["ITM2R"]
["ITMAH"]
["ITMAJ"]
["ITMAM"]
["ITMAZ"]
["ITMDA"]
["ITMDC"]
["ITMDW"]
["ITMFR"]
["ITMGE"]
["ITMIM"]
["ITMIS"]
["ITMIT"]
["ITMLB"]
["ITMLS"]
["ITMLU"]
["ITMLZ"]
["ITMMO"]
["ITMND"]
["ITMNF"]
["ITMNP"]
["ITMNU"]
["ITMOL"]
["ITMPA"]
["ITMPS"]
["ITMRA"]
["ITMRM"]
["ITMRP"]
["ITMSB"]
["ITMSD"]
["ITMSN"]
["ITMTH"]
["ITNAP"]
["ITNCT"]
["ITNGA"]
["ITNIG"]
["ITNLI"]
["ITNNE"]
["ITNSR"]
["ITNTA"]
["ITNTE"]
["ITNTT"]
["ITNUM"]
["ITOBT"]
["ITODB"]
["ITODG"]
["ITOGN"]
["ITOLB"]
["ITONE"]
["ITORL"]
["ITOTN"]
["ITOTO"]
["ITOZI"]
["ITPAN"]
["ITPAU"]
["ITPAZ"]
["ITPCE"]
["ITPCH"]
["ITPCN"]
["ITPDI"]
["ITPED"]
["ITPEM"]
["ITPES"]
["ITPFE"]
["ITPFX"]
["ITPGA"]
["ITPGL"]
["ITPIA"]
["ITPIM"]
["ITPIO"]
["ITPIZ"]
["ITPLI"]
["ITPLN"]
["ITPMA"]
["ITPMM"]
["ITPMO"]
["ITPMZ"]
["ITPNG"]
["ITPNL"]
["ITPNZ"]
["ITPOM"]
["ITPOQ"]
["ITPOS"]
["ITPOZ"]
["ITPPF"]
["ITPPL"]
["ITPPT"]
["ITPRF"]
["ITPRH"]
["ITPRJ"]
["ITPRL"]
["ITPRO"]
["ITPRR"]
["ITPRW"]
["ITPSR"]
["ITPSS"]
["ITPTC"]
["ITPTF"]
["ITPTH"]
["ITPTI"]
["ITPTO"]
["ITPUC"]
["ITPVE"]
["ITPVT"]
["ITPZL"]
["ITQMM"]
["ITQOS"]
["ITRAN"]
["ITRCE"]
["ITREC"]
["ITREG"]
["ITRGG"]
["ITRIN"]
["ITRMA"]
["ITRMG"]
["ITRMI"]
["ITRNS"]
["ITROC"]
["ITROM"]
["ITRPO"]
["ITRPT"]
["ITRRO"]
["ITRRV"]
["ITRSM"]
["ITRTS"]
["ITRTT"]
["ITSAL"]
["ITSAT"]
["ITSCK"]
["ITSCO"]
["ITSDB"]
["ITSEG"]
["ITSFE"]
["ITSFM"]
["ITSID"]
["ITSIG"]
["ITSIR"]
["ITSLA"]
["ITSLC"]
["ITSLL"]
["ITSLV"]
["ITSMA"]
["ITSMK"]
["ITSML"]
["ITSNR"]
["ITSOO"]
["ITSPA"]
["ITSPE"]
["ITSRE"]
["ITSRH"]
["ITSSF"]
["ITSTE"]
["ITSTR"]
["ITSVC"]
["ITSVN"]
["ITTAA"]
["ITTAL"]
["ITTAO"]
["ITTAR"]
["ITTCC"]
["ITTCS"]
["ITTEA"]
["ITTEF"]
["ITTGR"]
["ITTGV"]
["ITTLY"]
["ITTMI"]
["ITTMT"]
["ITTNI"]
["ITTOA"]
["ITTPS"]
["ITTRC"]
["ITTRH"]
["ITTRI"]
["ITTRS"]
["ITTRU"]
["ITTTN"]
["ITTVC"]
["ITUGG"]
["ITULE"]
["ITURI"]
["ITUST"]
["ITVCE"]
["ITVDA"]
["ITVDL"]
["ITVEN"]
["ITVIA"]
["ITVIE"]
["ITVSG"]
["ITVSO"]
["ITVT3"]
["ITVTI"]
["ITVTT"]
["ITVUL"]
["ITVVA"]
["ITVZN"]
["ITXXX"]
["ITZQQ"]
["JE888"]
["JESAB"]
["JESCJ"]
["JESTH"]
["JM888"]
["JMALP"]
["JMBLR"]
["JMBWN"]
["JMFMH"]
["JMKIN"]
["JMMBJ"]
["JMOCJ"]
["JMORC"]
["JMPEV"]
["JMPHE"]
["JMPKS"]
["JMPMO"]
["JMPOT"]
["JMPRH"]
["JMPRO"]
["JMRIB"]
["JMROP"]
["JMSAW"]
["JMSLM"]
["JMSRI"]
["JO888"]
["JOAQB"]
["JOAQJ"]
["JODAH"]
["JP888"]
["JPAAM"]
["JPABA"]
["JPABO"]
["JPABS"]
["JPABT"]
["JPABU"]
["JPACH"]
["JPADE"]
["JPADO"]
["JPAFG"]
["JPAGJ"]
["JPAGN"]
["JPAGR"]
["JPAGS"]
["JPAIA"]
["JPAIG"]
["JPAII"]
["JPAIK"]
["JPAIM"]
["JPAIN"]
["JPAIO"]
["JPAIW"]
["JPAIZ"]
["JPAJI"]
["JPAJK"]
["JPAJN"]
["JPAJR"]
["JPAJX"]
["JPAKA"]
["JPAKB"]
["JPAKD"]
["JPAKE"]
["JPAKG"]
["JPAKH"]
["JPAKI"]
["JPAKK"]
["JPAKM"]
["JPAKN"]
["JPAKO"]
["JPAKT"]
["JPAKW"]
["JPAKZ"]
["JPAMA"]
["JPAMG"]
["JPAMI"]
["JPAMJ"]
["JPAMM"]
["JPAMR"]
["JPAMS"]
["JPAMT"]
["JPAMU"]
["JPAMX"]
["JPAMY"]
["JPANA"]
["JPANB"]
["JPANE"]
["JPANM"]
["JPAOE"]
["JPAOG"]
["JPAOI"]
["JPAOJ"]
["JPAOK"]
["JPAOM"]
["JPAON"]
["JPAOS"]
["JPAPP"]
["JPARA"]
["JPARG"]
["JPARI"]
["JPARK"]
["JPARO"]
["JPARZ"]
["JPASA"]
["JPASB"]
["JPASH"]
["JPASI"]
["JPASJ"]
["JPASK"]
["JPASM"]
["JPASR"]
["JPAST"]
["JPASU"]
["JPASW"]
["JPASZ"]
["JPATA"]
["JPATK"]
["JPATM"]
["JPATT"]
["JPAUI"]
["JPAWA"]
["JPAWM"]
["JPAWS"]
["JPAWZ"]
["JPAXT"]
["JPAXZ"]
["JPAYU"]
["JPAZJ"]
["JPAZR"]
["JPAZU"]
["JPBDM"]
["JPBEP"]
["JPBFS"]
["JPBKW"]
["JPBOM"]
["JPBPU"]
["JPBYO"]
["JPCHB"]
["JPCHF"]
["JPCHG"]
["JPCHH"]
["JPCHI"]
["JPCHK"]
["JPCHO"]
["JPCHT"]
["JPCHU"]
["JPCHW"]
["JPCIO"]
["JPCJU"]
["JPCKM"]
["JPCNS"]
["JPCTA"]
["JPCYU"]
["JPCYZ"]
["JPDAT"]
["JPDSR"]
["JPDTU"]
["JPDZK"]
["JPEBI"]
["JPEGO"]
["JPEGS"]
["JPEII"]
["JPEIS"]
["JPEJM"]
["JPEKZ"]
["JPEMM"]
["JPEMU"]
["JPENA"]
["JPENH"]
["JPENN"]
["JPENO"]
["JPENR"]
["JPESI"]
["JPESK"]
["JPESM"]
["JPESS"]
["JPETA"]
["JPETM"]
["JPEZA"]
["JPFAE"]
["JPFCM"]
["JPFGS"]
["JPFGW"]
["JPFHR"]
["JPFJN"]
["JPFKD"]
["JPFKE"]
["JPFKH"]
["JPFKI"]
["JPFKJ"]
["JPFKK"]
["JPFKM"]
["JPFKR"]
["JPFKU"]
["JPFKY"]
["JPFMD"]
["JPFMS"]
["JPFMT"]
["JPFNA"]
["JPFNB"]
["JPFND"]
["JPFNK"]
["JPFNR"]
["JPFNS"]
["JPFNU"]
["JPFNZ"]
["JPFRA"]
["JPFRE"]
["JPFRI"]
["JPFRJ"]
["JPFRK"]
["JPFRM"]
["JPFRS"]
["JPFRU"]
["JPFRX"]
["JPFSH"]
["JPFSK"]
["JPFST"]
["JPFTE"]
["JPFTG"]
["JPFTM"]
["JPFTS"]
["JPFTT"]
["JPFTX"]
["JPFUA"]
["JPFUE"]
["JPFUJ"]
["JPFUM"]
["JPFUO"]
["JPFUR"]
["JPFUU"]
["JPFUW"]
["JPFYM"]
["JPGAM"]
["JPGKA"]
["JPGKB"]
["JPGKN"]
["JPGKS"]
["JPGNG"]
["JPGNW"]
["JPGOI"]
["JPGON"]
["JPGOO"]
["JPGOT"]
["JPGPT"]
["JPGTK"]
["JPHAA"]
["JPHAB"]
["JPHAD"]
["JPHAE"]
["JPHAG"]
["JPHAH"]
["JPHAI"]
["JPHAM"]
["JPHAN"]
["JPHAR"]
["JPHAS"]
["JPHAU"]
["JPHBB"]
["JPHBK"]
["JPHBO"]
["JPHBR"]
["JPHDA"]
["JPHDK"]
["JPHDO"]
["JPHEA"]
["JPHED"]
["JPHEI"]
["JPHES"]
["JPHET"]
["JPHGH"]
["JPHGN"]
["JPHGO"]
["JPHGS"]
["JPHGU"]
["JPHHE"]
["JPHHH"]
["JPHHM"]
["JPHHR"]
["JPHIA"]
["JPHIB"]
["JPHIC"]
["JPHIE"]
["JPHIG"]
["JPHII"]
["JPHIJ"]
["JPHIK"]
["JPHIM"]
["JPHIN"]
["JPHIO"]
["JPHIR"]
["JPHIS"]
["JPHIU"]
["JPHIZ"]
["JPHJA"]
["JPHJI"]
["JPHJM"]
["JPHJO"]
["JPHJR"]
["JPHJT"]
["JPHKD"]
["JPHKJ"]
["JPHKK"]
["JPHKM"]
["JPHKN"]
["JPHKR"]
["JPHKS"]
["JPHKT"]
["JPHKU"]
["JPHKW"]
["JPHKZ"]
["JPHMA"]
["JPHMC"]
["JPHMD"]
["JPHMG"]
["JPHMH"]
["JPHMI"]
["JPHMJ"]
["JPHMK"]
["JPHMM"]
["JPHMN"]
["JPHMR"]
["JPHMS"]
["JPHMT"]
["JPHMW"]
["JPHMX"]
["JPHNE"]
["JPHNG"]
["JPHNJ"]
["JPHNK"]
["JPHNN"]
["JPHNR"]
["JPHNS"]
["JPHNY"]
["JPHNZ"]
["JPHOD"]
["JPHOF"]
["JPHON"]
["JPHOS"]
["JPHOT"]
["JPHPP"]
["JPHRA"]
["JPHRD"]
["JPHRE"]
["JPHRH"]
["JPHRI"]
["JPHRJ"]
["JPHRK"]
["JPHRM"]
["JPHRO"]
["JPHRR"]
["JPHRS"]
["JPHRU"]
["JPHRW"]
["JPHSG"]
["JPHSH"]
["JPHSI"]
["JPHSK"]
["JPHSM"]
["JPHSN"]
["JPHSR"]
["JPHSS"]
["JPHSU"]
["JPHSW"]
["JPHTA"]
["JPHTC"]
["JPHTK"]
["JPHTM"]
["JPHTO"]
["JPHTS"]
["JPHTT"]
["JPHUD"]
["JPHUR"]
["JPHUT"]
["JPHWA"]
["JPHWS"]
["JPHYG"]
["JPHYK"]
["JPHYM"]
["JPHYR"]
["JPHYS"]
["JPHYT"]
["JPIBR"]
["JPIBS"]
["JPICD"]
["JPICH"]
["JPICK"]
["JPICO"]
["JPICW"]
["JPIDA"]
["JPIDJ"]
["JPIDM"]
["JPIEJ"]
["JPIER"]
["JPIES"]
["JPIGO"]
["JPIGR"]
["JPIHA"]
["JPIHO"]
["JPIIB"]
["JPIII"]
["JPIIN"]
["JPIKA"]
["JPIKC"]
["JPIKD"]
["JPIKE"]
["JPIKJ"]
["JPIKK"]
["JPIKN"]
["JPIKR"]
["JPIKT"]
["JPIKU"]
["JPIKW"]
["JPIMA"]
["JPIMB"]
["JPIMI"]
["JPIMM"]
["JPIMT"]
["JPIMZ"]
["JPINA"]
["JPIND"]
["JPINE"]
["JPING"]
["JPINK"]
["JPINO"]
["JPINR"]
["JPINS"]
["JPINT"]
["JPINZ"]
["JPIOU"]
["JPIRK"]
["JPISA"]
["JPISB"]
["JPISC"]
["JPISD"]
["JPISE"]
["JPISG"]
["JPISH"]
["JPISI"]
["JPISK"]
["JPISM"]
["JPISU"]
["JPISX"]
["JPISY"]
["JPITJ"]
["JPITK"]
["JPITO"]
["JPITS"]
["JPITU"]
["JPIUH"]
["JPIWA"]
["JPIWG"]
["JPIWH"]
["JPIWI"]
["JPIWK"]
["JPIWN"]
["JPIWO"]
["JPIWT"]
["JPIWY"]
["JPIYA"]
["JPIYM"]
["JPIYO"]
["JPIZH"]
["JPIZI"]
["JPIZM"]
["JPIZO"]
["JPIZS"]
["JPIZU"]
["JPIZW"]
["JPJKT"]
["JPJKW"]
["JPJON"]
["JPJTS"]
["JPKAA"]
["JPKAB"]
["JPKAC"]
["JPKAD"]
["JPKAE"]
["JPKAF"]
["JPKAG"]
["JPKAH"]
["JPKAI"]
["JPKAJ"]
["JPKAM"]
["JPKAN"]
["JPKAO"]
["JPKAR"]
["JPKAT"]
["JPKAU"]
["JPKAW"]
["JPKAX"]
["JPKAZ"]
["JPKBA"]
["JPKBI"]
["JPKBK"]
["JPKBM"]
["JPKBR"]
["JPKBS"]
["JPKBT"]
["JPKBU"]
["JPKCF"]
["JPKCH"]
["JPKCZ"]
["JPKDA"]
["JPKDI"]
["JPKDJ"]
["JPKDK"]
["JPKDM"]
["JPKDO"]
["JPKDR"]
["JPKDW"]
["JPKDX"]
["JPKEB"]
["JPKEC"]
["JPKEE"]
["JPKEG"]
["JPKEJ"]
["JPKEM"]
["JPKER"]
["JPKFU"]
["JPKGA"]
["JPKGB"]
["JPKGC"]
["JPKGE"]
["JPKGJ"]
["JPKGM"]
["JPKGO"]
["JPKGR"]
["JPKGS"]
["JPKGT"]
["JPKGU"]
["JPKHJ"]
["JPKHM"]
["JPKHR"]
["JPKHS"]
["JPKIA"]
["JPKIB"]
["JPKII"]
["JPKIJ"]
["JPKIK"]
["JPKIM"]
["JPKIN"]
["JPKIR"]
["JPKIS"]
["JPKIT"]
["JPKIW"]
["JPKJA"]
["JPKJD"]
["JPKJG"]
["JPKJI"]
["JPKJJ"]
["JPKJK"]
["JPKJM"]
["JPKJN"]
["JPKJO"]
["JPKJR"]
["JPKJT"]
["JPKJU"]
["JPKKA"]
["JPKKB"]
["JPKKE"]
["JPKKJ"]
["JPKKK"]
["JPKKL"]
["JPKKM"]
["JPKKO"]
["JPKKR"]
["JPKKT"]
["JPKKU"]
["JPKKW"]
["JPKKX"]
["JPKKZ"]
["JPKMD"]
["JPKME"]
["JPKMF"]
["JPKMH"]
["JPKMI"]
["JPKMJ"]
["JPKMK"]
["JPKMM"]
["JPKMN"]
["JPKMO"]
["JPKMQ"]
["JPKMR"]
["JPKMS"]
["JPKMT"]
["JPKMU"]
["JPKMW"]
["JPKMX"]
["JPKMY"]
["JPKNA"]
["JPKNB"]
["JPKND"]
["JPKNE"]
["JPKNG"]
["JPKNH"]
["JPKNI"]
["JPKNJ"]
["JPKNK"]
["JPKNM"]
["JPKNN"]
["JPKNO"]
["JPKNR"]
["JPKNS"]
["JPKNT"]
["JPKNU"]
["JPKNX"]
["JPKNY"]
["JPKNZ"]
["JPKOB"]
["JPKOD"]
["JPKOF"]
["JPKOG"]
["JPKOH"]
["JPKOI"]
["JPKOJ"]
["JPKOK"]
["JPKOM"]
["JPKON"]
["JPKOO"]
["JPKOR"]
["JPKOS"]
["JPKOU"]
["JPKOX"]
["JPKOY"]
["JPKOZ"]
["JPKRA"]
["JPKRB"]
["JPKRC"]
["JPKRD"]
["JPKRE"]
["JPKRH"]
["JPKRI"]
["JPKRJ"]
["JPKRK"]
["JPKRM"]
["JPKRN"]
["JPKRR"]
["JPKRS"]
["JPKRT"]
["JPKRU"]
["JPKRX"]
["JPKRY"]
["JPKSA"]
["JPKSB"]
["JPKSC"]
["JPKSD"]
["JPKSE"]
["JPKSF"]
["JPKSH"]
["JPKSK"]
["JPKSM"]
["JPKSN"]
["JPKSR"]
["JPKSS"]
["JPKST"]
["JPKSU"]
["JPKSW"]
["JPKSX"]
["JPKSY"]
["JPKTA"]
["JPKTG"]
["JPKTJ"]
["JPKTK"]
["JPKTL"]
["JPKTM"]
["JPKTN"]
["JPKTO"]
["JPKTR"]
["JPKTS"]
["JPKTU"]
["JPKTX"]
["JPKTZ"]
["JPKUC"]
["JPKUD"]
["JPKUE"]
["JPKUF"]
["JPKUG"]
["JPKUH"]
["JPKUR"]
["JPKUT"]
["JPKUU"]
["JPKUW"]
["JPKUX"]
["JPKUZ"]
["JPKWA"]
["JPKWC"]
["JPKWI"]
["JPKWJ"]
["JPKWM"]
["JPKWN"]
["JPKWR"]
["JPKWS"]
["JPKWT"]
["JPKWX"]
["JPKWZ"]
["JPKXK"]
["JPKXS"]
["JPKYA"]
["JPKYK"]
["JPKYM"]
["JPKYO"]
["JPKYR"]
["JPKZE"]
["JPKZH"]
["JPKZI"]
["JPKZJ"]
["JPKZK"]
["JPKZM"]
["JPKZR"]
["JPKZS"]
["JPKZU"]
["JPMAB"]
["JPMAD"]
["JPMAG"]
["JPMAI"]
["JPMAK"]
["JPMAM"]
["JPMAO"]
["JPMAR"]
["JPMAS"]
["JPMAT"]
["JPMAU"]
["JPMAW"]
["JPMBE"]
["JPMBR"]
["JPMBT"]
["JPMCD"]
["JPMCH"]
["JPMDJ"]
["JPMDR"]
["JPMEG"]
["JPMEI"]
["JPMEN"]
["JPMER"]
["JPMET"]
["JPMGA"]
["JPMGC"]
["JPMGM"]
["JPMGN"]
["JPMGS"]
["JPMGU"]
["JPMGY"]
["JPMHM"]
["JPMHN"]
["JPMHR"]
["JPMIH"]
["JPMII"]
["JPMIJ"]
["JPMIK"]
["JPMIN"]
["JPMIR"]
["JPMIS"]
["JPMIT"]
["JPMIY"]
["JPMIZ"]
["JPMJR"]
["JPMKA"]
["JPMKG"]
["JPMKI"]
["JPMKJ"]
["JPMKK"]
["JPMKM"]
["JPMKR"]
["JPMKS"]
["JPMKU"]
["JPMKW"]
["JPMKX"]
["JPMMA"]
["JPMMD"]
["JPMMI"]
["JPMMM"]
["JPMMT"]
["JPMMY"]
["JPMNA"]
["JPMNE"]
["JPMNG"]
["JPMNJ"]
["JPMNM"]
["JPMNN"]
["JPMNO"]
["JPMNR"]
["JPMNT"]
["JPMNY"]
["JPMOG"]
["JPMOJ"]
["JPMOM"]
["JPMOO"]
["JPMOR"]
["JPMOT"]
["JPMOU"]
["JPMOX"]
["JPMQT"]
["JPMRA"]
["JPMRE"]
["JPMRG"]
["JPMRH"]
["JPMRJ"]
["JPMRK"]
["JPMRM"]
["JPMRO"]
["JPMRS"]
["JPMRT"]
["JPMRU"]
["JPMRZ"]
["JPMSA"]
["JPMSD"]
["JPMSH"]
["JPMSI"]
["JPMSK"]
["JPMSO"]
["JPMSR"]
["JPMSS"]
["JPMST"]
["JPMSX"]
["JPMTA"]
["JPMTC"]
["JPMTE"]
["JPMTH"]
["JPMTI"]
["JPMTK"]
["JPMTM"]
["JPMTO"]
["JPMTR"]
["JPMTS"]
["JPMTU"]
["JPMTY"]
["JPMTZ"]
["JPMUG"]
["JPMUK"]
["JPMUR"]
["JPMUT"]
["JPMUX"]
["JPMUY"]
["JPMWA"]
["JPMWR"]
["JPMXT"]
["JPMYA"]
["JPMYG"]
["JPMYI"]
["JPMYJ"]
["JPMYK"]
["JPMYN"]
["JPMYT"]
["JPMYU"]
["JPMYX"]
["JPMZK"]
["JPMZM"]
["JPMZR"]
["JPMZS"]
["JPNAA"]
["JPNAB"]
["JPNAD"]
["JPNAG"]
["JPNAH"]
["JPNAI"]
["JPNAK"]
["JPNAM"]
["JPNAN"]
["JPNAO"]
["JPNAR"]
["JPNAS"]
["JPNAT"]
["JPNAY"]
["JPNAZ"]
["JPNBS"]
["JPNBU"]
["JPNCO"]
["JPNDI"]
["JPNDY"]
["JPNEJ"]
["JPNEM"]
["JPNEO"]
["JPNEX"]
["JPNEZ"]
["JPNGA"]
["JPNGD"]
["JPNGE"]
["JPNGG"]
["JPNGH"]
["JPNGI"]
["JPNGM"]
["JPNGN"]
["JPNGO"]
["JPNGR"]
["JPNGS"]
["JPNGU"]
["JPNGY"]
["JPNHA"]
["JPNHI"]
["JPNHJ"]
["JPNHM"]
["JPNHN"]
["JPNHR"]
["JPNIA"]
["JPNIC"]
["JPNID"]
["JPNIH"]
["JPNIJ"]
["JPNIK"]
["JPNIM"]
["JPNIN"]
["JPNIO"]
["JPNIS"]
["JPNIT"]
["JPNIX"]
["JPNJM"]
["JPNJR"]
["JPNKD"]
["JPNKH"]
["JPNKJ"]
["JPNKK"]
["JPNKL"]
["JPNKM"]
["JPNKN"]
["JPNKO"]
["JPNKR"]
["JPNKS"]
["JPNKT"]
["JPNKX"]
["JPNKY"]
["JPNKZ"]
["JPNMA"]
["JPNMC"]
["JPNMI"]
["JPNMK"]
["JPNMT"]
["JPNNH"]
["JPNNK"]
["JPNNO"]
["JPNNT"]
["JPNOA"]
["JPNOB"]
["JPNOH"]
["JPNOJ"]
["JPNOM"]
["JPNON"]
["JPNOU"]
["JPNQH"]
["JPNRI"]
["JPNRO"]
["JPNRS"]
["JPNRU"]
["JPNSA"]
["JPNSB"]
["JPNSH"]
["JPNSI"]
["JPNSK"]
["JPNSM"]
["JPNSR"]
["JPNST"]
["JPNSU"]
["JPNSX"]
["JPNTO"]
["JPNTX"]
["JPNTY"]
["JPNUM"]
["JPNUR"]
["JPNWA"]
["JPNXG"]
["JPNYA"]
["JPNYK"]
["JPNYZ"]
["JPOAA"]
["JPOAD"]
["JPOAR"]
["JPOAT"]
["JPOAX"]
["JPOBA"]
["JPOBB"]
["JPOBE"]
["JPOBM"]
["JPOBS"]
["JPOBX"]
["JPOCH"]
["JPODA"]
["JPODM"]
["JPODN"]
["JPODO"]
["JPODS"]
["JPOFK"]
["JPOFR"]
["JPOFT"]
["JPOGA"]
["JPOGC"]
["JPOGE"]
["JPOGF"]
["JPOGH"]
["JPOGI"]
["JPOGK"]
["JPOGM"]
["JPOGS"]
["JPOGU"]
["JPOHA"]
["JPOHM"]
["JPOHO"]
["JPOHT"]
["JPOIG"]
["JPOII"]
["JPOIM"]
["JPOIS"]
["JPOIT"]
["JPOIU"]
["JPOJI"]
["JPOJM"]
["JPOJO"]
["JPOKB"]
["JPOKC"]
["JPOKG"]
["JPOKH"]
["JPOKI"]
["JPOKJ"]
["JPOKK"]
["JPOKM"]
["JPOKN"]
["JPOKR"]
["JPOKS"]
["JPOKT"]
["JPOKU"]
["JPOKW"]
["JPOKX"]
["JPOMA"]
["JPOMC"]
["JPOMD"]
["JPOMH"]
["JPOMI"]
["JPOMJ"]
["JPOMN"]
["JPOMO"]
["JPOMR"]
["JPOMS"]
["JPOMT"]
["JPOMU"]
["JPOMW"]
["JPOMX"]
["JPOMY"]
["JPOMZ"]
["JPONA"]
["JPOND"]
["JPONE"]
["JPONG"]
["JPONI"]
["JPONJ"]
["JPONK"]
["JPONO"]
["JPONS"]
["JPONW"]
["JPONX"]
["JPOOA"]
["JPOOB"]
["JPOOC"]
["JPOOG"]
["JPOOH"]
["JPOOJ"]
["JPOOM"]
["JPOON"]
["JPOOO"]
["JPOOR"]
["JPOOW"]
["JPOPA"]
["JPORA"]
["JPORG"]
["JPORN"]
["JPORR"]
["JPORX"]
["JPOSA"]
["JPOSD"]
["JPOSE"]
["JPOSG"]
["JPOSH"]
["JPOSI"]
["JPOSJ"]
["JPOSK"]
["JPOSL"]
["JPOSM"]
["JPOSN"]
["JPOSO"]
["JPOSR"]
["JPOSS"]
["JPOST"]
["JPOSU"]
["JPOSX"]
["JPOTA"]
["JPOTG"]
["JPOTJ"]
["JPOTK"]
["JPOTM"]
["JPOTO"]
["JPOTR"]
["JPOTU"]
["JPOTW"]
["JPOUA"]
["JPOUK"]
["JPOUM"]
["JPOUR"]
["JPOUS"]
["JPOWA"]
["JPOYA"]
["JPOYB"]
["JPOYM"]
["JPOZJ"]
["JPOZU"]
["JPOZX"]
["JPQSG"]
["JPRAU"]
["JPRHK"]
["JPRKO"]
["JPRMI"]
["JPRND"]
["JPRYA"]
["JPRYG"]
["JPRYO"]
["JPRYS"]
["JPSAB"]
["JPSAC"]
["JPSAD"]
["JPSAE"]
["JPSAG"]
["JPSAI"]
["JPSAJ"]
["JPSAK"]
["JPSAM"]
["JPSAN"]
["JPSAO"]
["JPSAR"]
["JPSAS"]
["JPSAT"]
["JPSAU"]
["JPSAW"]
["JPSAZ"]
["JPSBH"]
["JPSBK"]
["JPSBS"]
["JPSBU"]
["JPSBY"]
["JPSCH"]
["JPSCR"]
["JPSDA"]
["JPSDJ"]
["JPSDK"]
["JPSDS"]
["JPSDU"]
["JPSDZ"]
["JPSEB"]
["JPSEG"]
["JPSEI"]
["JPSEK"]
["JPSEN"]
["JPSEQ"]
["JPSES"]
["JPSET"]
["JPSEZ"]
["JPSGA"]
["JPSGE"]
["JPSGI"]
["JPSGJ"]
["JPSGM"]
["JPSGR"]
["JPSGT"]
["JPSGU"]
["JPSGW"]
["JPSGX"]
["JPSHG"]
["JPSHH"]
["JPSHJ"]
["JPSHK"]
["JPSHN"]
["JPSHR"]
["JPSHS"]
["JPSHU"]
["JPSHZ"]
["JPSIA"]
["JPSID"]
["JPSIG"]
["JPSIH"]
["JPSIK"]
["JPSIM"]
["JPSIN"]
["JPSIO"]
["JPSIR"]
["JPSIS"]
["JPSIT"]
["JPSJA"]
["JPSJI"]
["JPSJM"]
["JPSJR"]
["JPSKB"]
["JPSKD"]
["JPSKH"]
["JPSKK"]
["JPSKM"]
["JPSKN"]
["JPSKO"]
["JPSKR"]
["JPSKT"]
["JPSKU"]
["JPSKW"]
["JPSKY"]
["JPSMA"]
["JPSMB"]
["JPSMD"]
["JPSME"]
["JPSMH"]
["JPSMI"]
["JPSMJ"]
["JPSMM"]
["JPSMN"]
["JPSMO"]
["JPSMR"]
["JPSMT"]
["JPSMU"]
["JPSMY"]
["JPSMZ"]
["JPSNA"]
["JPSNE"]
["JPSNI"]
["JPSNJ"]
["JPSNK"]
["JPSNM"]
["JPSNN"]
["JPSNO"]
["JPSNR"]
["JPSNU"]
["JPSNW"]
["JPSNX"]
["JPSNZ"]
["JPSOG"]
["JPSOH"]
["JPSOO"]
["JPSOR"]
["JPSOT"]
["JPSOY"]
["JPSOZ"]
["JPSRA"]
["JPSRH"]
["JPSRJ"]
["JPSRK"]
["JPSRO"]
["JPSRS"]
["JPSRT"]
["JPSRX"]
["JPSRZ"]
["JPSSA"]
["JPSSB"]
["JPSSE"]
["JPSSH"]
["JPSSI"]
["JPSSJ"]
["JPSSK"]
["JPSSM"]
["JPSSN"]
["JPSSS"]
["JPSSU"]
["JPSSZ"]
["JPSTA"]
["JPSTB"]
["JPSTD"]
["JPSTE"]
["JPSTI"]
["JPSTJ"]
["JPSTN"]
["JPSTO"]
["JPSTR"]
["JPSTT"]
["JPSTU"]
["JPSTW"]
["JPSTZ"]
["JPSUE"]
["JPSUG"]
["JPSUH"]
["JPSUK"]
["JPSUM"]
["JPSUR"]
["JPSUS"]
["JPSUT"]
["JPSUU"]
["JPSUW"]
["JPSUZ"]
["JPSWA"]
["JPSXM"]
["JPSXT"]
["JPSXZ"]
["JPSYA"]
["JPSYD"]
["JPSYG"]
["JPSYM"]
["JPSYO"]
["JPSYZ"]
["JPSZG"]
["JPSZI"]
["JPSZK"]
["JPSZU"]
["JPTAA"]
["JPTAB"]
["JPTAC"]
["JPTAD"]
["JPTAE"]
["JPTAG"]
["JPTAH"]
["JPTAJ"]
["JPTAK"]
["JPTAL"]
["JPTAM"]
["JPTAN"]
["JPTAO"]
["JPTAQ"]
["JPTAR"]
["JPTAS"]
["JPTAT"]
["JPTAW"]
["JPTAZ"]
["JPTBN"]
["JPTBO"]
["JPTBR"]
["JPTBS"]
["JPTBT"]
["JPTBU"]
["JPTCC"]
["JPTCH"]
["JPTDA"]
["JPTDJ"]
["JPTDN"]
["JPTDT"]
["JPTEA"]
["JPTEE"]
["JPTEI"]
["JPTEK"]
["JPTER"]
["JPTET"]
["JPTEU"]
["JPTGC"]
["JPTGO"]
["JPTHM"]
["JPTHR"]
["JPTHS"]
["JPTIA"]
["JPTIN"]
["JPTIS"]
["JPTJI"]
["JPTJJ"]
["JPTJK"]
["JPTJM"]
["JPTJO"]
["JPTJR"]
["JPTJS"]
["JPTKA"]
["JPTKC"]
["JPTKD"]
["JPTKE"]
["JPTKG"]
["JPTKH"]
["JPTKI"]
["JPTKJ"]
["JPTKK"]
["JPTKM"]
["JPTKO"]
["JPTKR"]
["JPTKS"]
["JPTKT"]
["JPTKU"]
["JPTKW"]
["JPTKY"]
["JPTKZ"]
["JPTMA"]
["JPTME"]
["JPTMI"]
["JPTMJ"]
["JPTMK"]
["JPTMM"]
["JPTMN"]
["JPTMO"]
["JPTMR"]
["JPTMS"]
["JPTMT"]
["JPTMU"]
["JPTMZ"]
["JPTNA"]
["JPTNB"]
["JPTND"]
["JPTNH"]
["JPTNI"]
["JPTNK"]
["JPTNO"]
["JPTNR"]
["JPTNS"]
["JPTNU"]
["JPTNW"]
["JPTNY"]
["JPTOA"]
["JPTOB"]
["JPTOC"]
["JPTOD"]
["JPTOG"]
["JPTOI"]
["JPTOJ"]
["JPTOK"]
["JPTOM"]
["JPTON"]
["JPTOS"]
["JPTOT"]
["JPTOU"]
["JPTOX"]
["JPTOY"]
["JPTRC"]
["JPTRD"]
["JPTRG"]
["JPTRH"]
["JPTRO"]
["JPTRR"]
["JPTRU"]
["JPTRZ"]
["JPTSG"]
["JPTSH"]
["JPTSI"]
["JPTSK"]
["JPTSM"]
["JPTSO"]
["JPTSS"]
["JPTST"]
["JPTSU"]
["JPTSX"]
["JPTSZ"]
["JPTTH"]
["JPTTJ"]
["JPTTK"]
["JPTTM"]
["JPTTS"]
["JPTTU"]
["JPTTY"]
["JPTUB"]
["JPTUD"]
["JPTUI"]
["JPTUR"]
["JPTUS"]
["JPTUU"]
["JPTUZ"]
["JPTWA"]
["JPTXD"]
["JPTXK"]
["JPTXN"]
["JPTYA"]
["JPTYH"]
["JPTYJ"]
["JPTYN"]
["JPTYO"]
["JPTYP"]
["JPTYR"]
["JPTYU"]
["JPTZA"]
["JPTZU"]
["JPUAO"]
["JPUBJ"]
["JPUBK"]
["JPUBY"]
["JPUCH"]
["JPUCN"]
["JPUCR"]
["JPUCU"]
["JPUDD"]
["JPUDO"]
["JPUEC"]
["JPUGA"]
["JPUGU"]
["JPUHH"]
["JPUJI"]
["JPUJY"]
["JPUKA"]
["JPUKB"]
["JPUKI"]
["JPUKJ"]
["JPUKN"]
["JPUKT"]
["JPUMG"]
["JPUNM"]
["JPUNO"]
["JPUNS"]
["JPUNT"]
["JPUNU"]
["JPUOM"]
["JPUOU"]
["JPUOZ"]
["JPURA"]
["JPURG"]
["JPURH"]
["JPURK"]
["JPURM"]
["JPURR"]
["JPURS"]
["JPURU"]
["JPUSA"]
["JPUSG"]
["JPUSH"]
["JPUSI"]
["JPUSJ"]
["JPUSK"]
["JPUSN"]
["JPUST"]
["JPUSU"]
["JPUTM"]
["JPUTS"]
["JPUTZ"]
["JPUUN"]
["JPUUR"]
["JPUWA"]
["JPUZK"]
["JPWAD"]
["JPWAI"]
["JPWAK"]
["JPWAM"]
["JPWAN"]
["JPWAT"]
["JPWDA"]
["JPWJM"]
["JPWKI"]
["JPWKJ"]
["JPWKR"]
["JPWKT"]
["JPWKW"]
["JPWKZ"]
["JPWMT"]
["JPWNA"]
["JPWNI"]
["JPWSB"]
["JPWTU"]
["JPXCA"]
["JPYAA"]
["JPYAD"]
["JPYAG"]
["JPYAM"]
["JPYAN"]
["JPYAS"]
["JPYAT"]
["JPYBK"]
["JPYBT"]
["JPYCH"]
["JPYDA"]
["JPYDM"]
["JPYGE"]
["JPYGH"]
["JPYGI"]
["JPYGR"]
["JPYHA"]
["JPYHI"]
["JPYIC"]
["JPYKK"]
["JPYKS"]
["JPYKT"]
["JPYKU"]
["JPYMA"]
["JPYMC"]
["JPYMD"]
["JPYMG"]
["JPYMN"]
["JPYMT"]
["JPYMU"]
["JPYNE"]
["JPYNI"]
["JPYNM"]
["JPYNN"]
["JPYNT"]
["JPYNZ"]
["JPYOC"]
["JPYOG"]
["JPYOK"]
["JPYOR"]
["JPYOS"]
["JPYOT"]
["JPYOU"]
["JPYQD"]
["JPYRA"]
["JPYRG"]
["JPYRO"]
["JPYSD"]
["JPYSG"]
["JPYSH"]
["JPYSM"]
["JPYSN"]
["JPYSR"]
["JPYSS"]
["JPYSU"]
["JPYSZ"]
["JPYTI"]
["JPYUA"]
["JPYUJ"]
["JPYUK"]
["JPYUR"]
["JPYUS"]
["JPYUU"]
["JPYWH"]
["JPYWN"]
["JPYWT"]
["JPYYA"]
["JPYZU"]
["JPZKA"]
["JPZMM"]
["KE888"]
["KEKIL"]
["KEKIS"]
["KELAU"]
["KEMBA"]
["KEMYD"]
["KESIA"]
["KESMN"]
["KH888"]
["KHCHE"]
["KHKKO"]
["KHKOS"]
["KHPNH"]
["KHTKH"]
["KI888"]
["KIBIR"]
["KIEBI"]
["KIFIS"]
["KIHUL"]
["KIMCK"]
["KINIK"]
["KIPHO"]
["KISYI"]
["KITRW"]
["KIWNI"]
["KM888"]
["KMAJN"]
["KMFOU"]
["KMMUT"]
["KMYVA"]
["KN888"]
["KNBAS"]
["KNCHA"]
["KNNEV"]
["KP888"]
["KPCHO"]
["KPGEN"]
["KPHAE"]
["KPHGM"]
["KPNAM"]
["KPODA"]
["KPRIW"]
["KPRJN"]
["KPSAM"]
["KPSGN"]
["KPSIN"]
["KPSON"]
["KPTCH"]
["KPWON"]
["KR888"]
["KRANJ"]
["KRAWL"]
["KRBIN"]
["KRBJG"]
["KRBNP"]
["KRBOR"]
["KRBUK"]
["KRCGY"]
["KRCHA"]
["KRCHF"]
["KRCHG"]
["KRCJA"]
["KRDBL"]
["KRDCN"]
["KRDDO"]
["KRDHS"]
["KRGDO"]
["KRGGH"]
["KRGGU"]
["KRGIN"]
["KRGMD"]
["KRGRP"]
["KRHAR"]
["KRHAS"]
["KRHDO"]
["KRHHP"]
["KRHLM"]
["KRHPO"]
["KRHSN"]
["KRINC"]
["KRJHA"]
["KRJMJ"]
["KRKAN"]
["KRKCN"]
["KRKDO"]
["KRKHN"]
["KRKJE"]
["KRKOJ"]
["KRKPO"]
["KRKUV"]
["KRKWA"]
["KRMAS"]
["KRMIP"]
["KRMOK"]
["KRMUK"]
["KRNDS"]
["KRNRD"]
["KROKK"]
["KROKP"]
["KRONS"]
["KRPTK"]
["KRPUS"]
["KRSBU"]
["KRSCP"]
["KRSEL"]
["KRSGG"]
["KRSHG"]
["KRSHO"]
["KRSMA"]
["KRSPO"]
["KRSSP"]
["KRSUK"]
["KRSUO"]
["KRSWD"]
["KRTAN"]
["KRTGA"]
["KRTGH"]
["KRTJI"]
["KRTSN"]
["KRTYG"]
["KRULL"]
["KRUSN"]
["KRWND"]
["KRYGP"]
["KRYOC"]
["KRYOS"]
["KRYPD"]
["KW888"]
["KWDOH"]
["KWJBD"]
["KWKHT"]
["KWKWI"]
["KWKWM"]
["KWMEA"]
["KWMIB"]
["KWMIS"]
["KWMZR"]
["KWSAA"]
["KWSAL"]
["KWSMY"]
["KWSWK"]
["KY888"]
["KYGEC"]
["KZ888"]
["KZAAU"]
["KZBTN"]
["KZKUR"]
["KZTAU"]
["LB888"]
["LBACT"]
["LBBEY"]
["LBBRU"]
["LBBYL"]
["LBCHK"]
["LBDRA"]
["LBJIE"]
["LBKHA"]
["LBKYE"]
["LBLN8"]
["LBOUZ"]
["LBQJN"]
["LBSAY"]
["LBSEL"]
["LBSUR"]
["LBZHR"]
["LBZUK"]
["LC888"]
["LCCAS"]
["LCCDS"]
["LCSLU"]
["LCVIF"]
["LK888"]
["LKBRW"]
["LKBTC"]
["LKCMB"]
["LKGAL"]
["LKHBA"]
["LKJAF"]
["LKJCT"]
["LKKAL"]
["LKKAY"]
["LKKCT"]
["LKKNK"]
["LKKON"]
["LKMAN"]
["LKMAW"]
["LKMUL"]
["LKOLU"]
["LKPPE"]
["LKSGT"]
["LKTAL"]
["LKTRR"]
["LKUCT"]
["LR888"]
["LRCMT"]
["LRCPA"]
["LRFIM"]
["LRGBS"]
["LRGRE"]
["LRHAR"]
["LRLOB"]
["LRMAR"]
["LRMLW"]
["LRROX"]
["LRRVC"]
["LRSAB"]
["LRSAZ"]
["LRSNI"]
["LRTRT"]
["LRUCN"]
["LT888"]
["LT88P"]
["LT88R"]
["LTBOT"]
["LTKLJ"]
["LTMLM"]
["LTMOM"]
["LTPLM"]
["LUBKM"]
["LUEZT"]
["LUHDK"]
["LULUX"]
["LUMRT"]
["LUROD"]
["LUWLG"]
["LUXXX"]
["LUZXC"]
["LV888"]
["LV88P"]
["LV88R"]
["LVEGE"]
["LVLPX"]
["LVMRX"]
["LVPVT"]
["LVRIX"]
["LVROJ"]
["LVSAL"]
["LVSKU"]
["LVVNT"]
["LVZJA"]
["LY888"]
["LYABA"]
["LYABK"]
["LYAPO"]
["LYBAR"]
["LYBEN"]
["LYBOU"]
["LYBUA"]
["LYDRX"]
["LYELK"]
["LYESI"]
["LYKHO"]
["LYLMQ"]
["LYMEH"]
["LYMEL"]
["LYMHR"]
["LYMRA"]
["LYMTH"]
["LYRLA"]
["LYSOU"]
["LYSRT"]
["LYTAG"]
["LYTIP"]
["LYTOA"]
["LYTOB"]
["LYTUK"]
["LYZAW"]
["LYZLI"]
["LYZUA"]
["LYZUE"]
["MA6KN"]
["MA888"]
["MAAGA"]
["MAAHU"]
["MAANZ"]
["MAASI"]
["MAAZE"]
["MABJD"]
["MACAS"]
["MAD2V"]
["MAELJ"]
["MAESS"]
["MAEUN"]
["MAJFL"]
["MALAR"]
["MAMOH"]
["MANDR"]
["MANNA"]
["MANPS"]
["MAPTM"]
["MARBA"]
["MAREM"]
["MARNA"]
["MASAL"]
["MASFI"]
["MASII"]
["MASMD"]
["MATEM"]
["MATNG"]
["MATTA"]
["MATTU"]
["MAVIL"]
["MC888"]
["MCMCM"]
["MCMON"]
["MD888"]
["MDGIU"]
["MDXXX"]
["ME888"]
["MEBAR"]
["MEBIJ"]
["MEBUD"]
["MEHNO"]
["MEIGL"]
["MEKOT"]
["MEPVC"]
["MERSN"]
["METIV"]
["MEULC"]
["MEZEL"]
["MFGES"]
["MFMAR"]
["MG888"]
["MGADK"]
["MGANM"]
["MGBIK"]
["MGBMD"]
["MGBPY"]
["MGBRR"]
["MGDIE"]
["MGDWB"]
["MGEHL"]
["MGFTU"]
["MGHLV"]
["MGMJN"]
["MGMNJ"]
["MGMOB"]
["MGMOQ"]
["MGMXM"]
["MGMXT"]
["MGNOS"]
["MGNOV"]
["MGPSL"]
["MGRVA"]
["MGSVB"]
["MGTLE"]
["MGTMM"]
["MGTOA"]
["MGVAT"]
["MGVEH"]
["MGVVB"]
["MGWMN"]
["MGWMR"]
["MGWVK"]
["MH888"]
["MHMAJ"]
["MHTAR"]
["MKDKJ"]
["MKNOD"]
["MKRAD"]
["MKSNI"]
["MM888"]
["MMAKY"]
["MMBIL"]
["MMBOG"]
["MMBSX"]
["MMHEB"]
["MMINS"]
["MMKYA"]
["MMKYP"]
["MMMAR"]
["MMMER"]
["MMMNU"]
["MMMUR"]
["MMMXE"]
["MMPEG"]
["MMRGN"]
["MMSNW"]
["MMTAS"]
["MMTAV"]
["MMTEN"]
["MMTER"]
["MMTHA"]
["MMTLA"]
["MMVIC"]
["MMXYE"]
["MO888"]
["MOMFM"]
["MP888"]
["MPSPN"]
["MQ888"]
["MQFDF"]
["MQLER"]
["MQQPC"]
["MQSPI"]
["MR888"]
["MRNDB"]
["MRNKC"]
["MRPCE"]
["MRROS"]
["MS888"]
["MSLTB"]
["MSPLY"]
["MT888"]
["MT88P"]
["MT88R"]
["MTBAL"]
["MTBLA"]
["MTBZE"]
["MTCKW"]
["MTDIS"]
["MTDMP"]
["MTFLO"]
["MTGHA"]
["MTGZI"]
["MTKIR"]
["MTMAR"]
["MTMGZ"]
["MTMLA"]
["MTMSA"]
["MTMSS"]
["MTMSX"]
["MTSLM"]
["MTSPB"]
["MTTAR"]
["MTWTW"]
["MU888"]
["MUABN"]
["MUBAM"]
["MUCUR"]
["MUPLU"]
["MUPMA"]
["MUTAM"]
["MV888"]
["MVADU"]
["MVBAL"]
["MVCPP"]
["MVHHE"]
["MVHID"]
["MVHTP"]
["MVKDP"]
["MVKEL"]
["MVKFP"]
["MVKUL"]
["MVMCP"]
["MVMGP"]
["MVMLE"]
["MVMMP"]
["MVRGI"]
["MVVHP"]
["MWCPK"]
["MWTHY"]
["MX4TE"]
["MX888"]
["MX9AS"]
["MXAAO"]
["MXABB"]
["MXACA"]
["MXACM"]
["MXANH"]
["MXAOB"]
["MXAPR"]
["MXARZ"]
["MXATM"]
["MXATN"]
["MXAVD"]
["MXBDR"]
["MXCAT"]
["MXCDD"]
["MXCED"]
["MXCME"]
["MXCNT"]
["MXCOA"]
["MXCPE"]
["MXCRI"]
["MXCSG"]
["MXCSL"]
["MXCTL"]
["MXCTM"]
["MXCTX"]
["MXCZM"]
["MXDBT"]
["MXDHD"]
["MXEA2"]
["MXELD"]
["MXEPM"]
["MXESE"]
["MXFRN"]
["MXGET"]
["MXGRA"]
["MXGSV"]
["MXGYM"]
["MXHTO"]
["MXHUN"]
["MXISJ"]
["MXJDZ"]
["MXJMN"]
["MXJZA"]
["MXLAP"]
["MXLTJ"]
["MXLTO"]
["MXLZC"]
["MXMAZ"]
["MXMHT"]
["MXMID"]
["MXMRE"]
["MXMTT"]
["MXMZT"]
["MXNAN"]
["MXNAU"]
["MXOBR"]
["MXPAJ"]
["MXPBJ"]
["MXPCM"]
["MXPGO"]
["MXPIB"]
["MXPIC"]
["MXPMD"]
["MXPMS"]
["MXPMX"]
["MXPNG"]
["MXPPE"]
["MXPTA"]
["MXPUL"]
["MXPVN"]
["MXPVR"]
["MXRBG"]
["MXRBV"]
["MXRST"]
["MXSBS"]
["MXSCR"]
["MXSCX"]
["MXSEY"]
["MXSGX"]
["MXSJC"]
["MXSLO"]
["MXSMI"]
["MXSN2"]
["MXSRL"]
["MXSTT"]
["MXTAB"]
["MXTAK"]
["MXTAM"]
["MXTCU"]
["MXTEN"]
["MXTIJ"]
["MXTJT"]
["MXTMP"]
["MXTPB"]
["MXTPX"]
["MXTUX"]
["MXTXC"]
["MXTXH"]
["MXVER"]
["MXVNR"]
["MXXAL"]
["MXXIH"]
["MXYKN"]
["MXYUK"]
["MXZCA"]
["MXZIH"]
["MXZIP"]
["MXZKP"]
["MXZLO"]
["MXZRZ"]
["MY888"]
["MYABU"]
["MYANG"]
["MYASQ"]
["MYBAG"]
["MYBAK"]
["MYBAT"]
["MYBAU"]
["MYBBA"]
["MYBDV"]
["MYBEA"]
["MYBEL"]
["MYBGG"]
["MYBGK"]
["MYBGR"]
["MYBGU"]
["MYBIA"]
["MYBKI"]
["MYBKP"]
["MYBLG"]
["MYBLI"]
["MYBMA"]
["MYBNG"]
["MYBNT"]
["MYBRU"]
["MYBSE"]
["MYBST"]
["MYBTG"]
["MYBTK"]
["MYBTM"]
["MYBTN"]
["MYBTU"]
["MYBTW"]
["MYBWH"]
["MYCAK"]
["MYCEN"]
["MYDDW"]
["MYDGN"]
["MYDRO"]
["MYEND"]
["MYHUM"]
["MYJAM"]
["MYJEL"]
["MYJHB"]
["MYKAB"]
["MYKBA"]
["MYKBD"]
["MYKBE"]
["MYKBR"]
["MYKBS"]
["MYKCH"]
["MYKEM"]
["MYKES"]
["MYKET"]
["MYKIJ"]
["MYKIK"]
["MYKIM"]
["MYKKH"]
["MYKKP"]
["MYKPN"]
["MYKPS"]
["MYKPU"]
["MYKRE"]
["MYKSD"]
["MYKSG"]
["MYKSL"]
["MYKSS"]
["MYKTI"]
["MYKUA"]
["MYKUD"]
["MYKUG"]
["MYKUN"]
["MYLAU"]
["MYLBH"]
["MYLBU"]
["MYLDU"]
["MYLGG"]
["MYLGK"]
["MYLMN"]
["MYLPK"]
["MYLUM"]
["MYLUN"]
["MYLUT"]
["MYLWY"]
["MYMAN"]
["MYMBK"]
["MYMEM"]
["MYMEN"]
["MYMEP"]
["MYMKM"]
["MYMKZ"]
["MYMUA"]
["MYMUD"]
["MYMUR"]
["MYMYY"]
["MYNII"]
["MYPAL"]
["MYPAN"]
["MYPAS"]
["MYPBA"]
["MYPDI"]
["MYPED"]
["MYPEN"]
["MYPGG"]
["MYPGU"]
["MYPHI"]
["MYPJK"]
["MYPKG"]
["MYPKK"]
["MYPMT"]
["MYPND"]
["MYPOW"]
["MYPPI"]
["MYPRA"]
["MYPRN"]
["MYPTB"]
["MYPUN"]
["MYRAI"]
["MYREJ"]
["MYSAM"]
["MYSAR"]
["MYSBT"]
["MYSBW"]
["MYSDK"]
["MYSDM"]
["MYSDR"]
["MYSEJ"]
["MYSEL"]
["MYSEP"]
["MYSGG"]
["MYSGM"]
["MYSHA"]
["MYSIJ"]
["MYSIL"]
["MYSIP"]
["MYSIR"]
["MYSME"]
["MYSMG"]
["MYSMJ"]
["MYSMM"]
["MYSNP"]
["MYSNR"]
["MYSPG"]
["MYSPT"]
["MYSRE"]
["MYSRK"]
["MYSUM"]
["MYSUP"]
["MYSUW"]
["MYTAG"]
["MYTAI"]
["MYTAS"]
["MYTAT"]
["MYTBA"]
["MYTBE"]
["MYTBI"]
["MYTDA"]
["MYTEN"]
["MYTGE"]
["MYTGG"]
["MYTGO"]
["MYTJH"]
["MYTKI"]
["MYTKP"]
["MYTLA"]
["MYTMB"]
["MYTMG"]
["MYTMP"]
["MYTOD"]
["MYTPP"]
["MYTRB"]
["MYTRM"]
["MYTSR"]
["MYTTE"]
["MYTUB"]
["MYTUM"]
["MYTUN"]
["MYTWU"]
["MYWAL"]
["MYWES"]
["MYXPQ"]
["MZ888"]
["MZANO"]
["MZBEL"]
["MZBEW"]
["MZIBO"]
["MZINE"]
["MZINH"]
["MZMAT"]
["MZMCU"]
["MZMEM"]
["MZMMW"]
["MZMNC"]
["MZMOR"]
["MZMPM"]
["MZMSG"]
["MZMZB"]
["MZMZQ"]
["MZNSO"]
["MZPBE"]
["MZPEB"]
["MZPOL"]
["MZUEL"]
["NA888"]
["NALUD"]
["NARUA"]
["NAWVB"]
["NC888"]
["NCBUG"]
["NCDUS"]
["NCKOU"]
["NCMTD"]
["NCNAK"]
["NCNEP"]
["NCNOU"]
["NCPAA"]
["NCPNY"]
["NCPOR"]
["NCTHI"]
["NCTON"]
["NCTUD"]
["NCVAV"]
["NCWAL"]
["NE888"]
["NF888"]
["NG888"]
["NGABF"]
["NGABM"]
["NGABO"]
["NGADO"]
["NGAKP"]
["NGANA"]
["NGANB"]
["NGANT"]
["NGAPP"]
["NGBAD"]
["NGBON"]
["NGBRA"]
["NGBUR"]
["NGCBQ"]
["NGDEN"]
["NGEAT"]
["NGEBO"]
["NGEKE"]
["NGERT"]
["NGESC"]
["NGFLM"]
["NGFOR"]
["NGGRP"]
["NGIMA"]
["NGKIR"]
["NGKOK"]
["NGKT7"]
["NGKUL"]
["NGLOS"]
["NGOBO"]
["NGODU"]
["NGOKN"]
["NGOKR"]
["NGOKW"]
["NGONN"]
["NGORO"]
["NGOSO"]
["NGOYO"]
["NGPHC"]
["NGSOT"]
["NGSPL"]
["NGTIN"]
["NGUKP"]
["NGUSA"]
["NGWAR"]
["NI888"]
["NI8LG"]
["NIBEF"]
["NICIO"]
["NIELB"]
["NILM8"]
["NIMAC"]
["NIMSP"]
["NIPIB"]
["NIPRI"]
["NIPSN"]
["NIPTI"]
["NIPUZ"]
["NIRAM"]
["NISJS"]
["NITPA"]
["NL888"]
["NL88P"]
["NL88R"]
["NLA2Z"]
["NLAAM"]
["NLABL"]
["NLAER"]
["NLAHO"]
["NLAKL"]
["NLALK"]
["NLALM"]
["NLAMB"]
["NLAME"]
["NLAML"]
["NLAMR"]
["NLAMS"]
["NLANC"]
["NLANK"]
["NLANP"]
["NLAPN"]
["NLAPP"]
["NLARC"]
["NLARI"]
["NLAWD"]
["NLBAN"]
["NLBDA"]
["NLBDR"]
["NLBEG"]
["NLBEM"]
["NLBEV"]
["NLBFD"]
["NLBGE"]
["NLBGI"]
["NLBGO"]
["NLBGW"]
["NLBHM"]
["NLBHS"]
["NLBIT"]
["NLBLU"]
["NLBNE"]
["NLBNH"]
["NLBNM"]
["NLBNN"]
["NLBNU"]
["NLBNZ"]
["NLBOG"]
["NLBON"]
["NLBOR"]
["NLBOT"]
["NLBRA"]
["NLBRD"]
["NLBRI"]
["NLBRM"]
["NLBRO"]
["NLBRR"]
["NLBRS"]
["NLBSE"]
["NLBSH"]
["NLBSK"]
["NLBSL"]
["NLBST"]
["NLBTA"]
["NLBTS"]
["NLBUD"]
["NLBUN"]
["NLBVG"]
["NLBVI"]
["NLBWE"]
["NLBWW"]
["NLBZM"]
["NLBZW"]
["NLCDP"]
["NLCOE"]
["NLCPD"]
["NLCPI"]
["NLCRI"]
["NLCUB"]
["NLCZD"]
["NLDBM"]
["NLDBR"]
["NLDEL"]
["NLDEV"]
["NLDFT"]
["NLDHE"]
["NLDHK"]
["NLDHO"]
["NLDHR"]
["NLDKO"]
["NLDMK"]
["NLDOE"]
["NLDOI"]
["NLDOK"]
["NLDON"]
["NLDOR"]
["NLDRL"]
["NLDRO"]
["NLDRP"]
["NLDSI"]
["NLDSM"]
["NLDSO"]
["NLDST"]
["NLDUG"]
["NLDUM"]
["NLDVB"]
["NLDVT"]
["NLDWA"]
["NLDZL"]
["NLECD"]
["NLEDM"]
["NLEEM"]
["NLEFE"]
["NLEHU"]
["NLEIN"]
["NLEKK"]
["NLELB"]
["NLELX"]
["NLENK"]
["NLENS"]
["NLEPL"]
["NLERA"]
["NLEUR"]
["NLEWK"]
["NLEWO"]
["NLEXZ"]
["NLFAR"]
["NLFJA"]
["NLFKP"]
["NLFOX"]
["NLGBG"]
["NLGDM"]
["NLGDO"]
["NLGDR"]
["NLGE7"]
["NLGET"]
["NLGHO"]
["NLGKN"]
["NLGLL"]
["NLGOE"]
["NLGOO"]
["NLGOR"]
["NLGOU"]
["NLGRA"]
["NLGRK"]
["NLGRQ"]
["NLGRW"]
["NLGRZ"]
["NLGSS"]
["NLGUN"]
["NLGWD"]
["NLGWO"]
["NLGWU"]
["NLHAA"]
["NLHAE"]
["NLHAG"]
["NLHAN"]
["NLHAR"]
["NLHBG"]
["NLHBK"]
["NLHDL"]
["NLHEE"]
["NLHEJ"]
["NLHFN"]
["NLHGL"]
["NLHGM"]
["NLHGS"]
["NLHIL"]
["NLHKK"]
["NLHKM"]
["NLHKO"]
["NLHLM"]
["NLHLO"]
["NLHLR"]
["NLHLW"]
["NLHME"]
["NLHMI"]
["NLHMS"]
["NLHNZ"]
["NLHOT"]
["NLHOU"]
["NLHOV"]
["NLHPE"]
["NLHPL"]
["NLHPT"]
["NLHRD"]
["NLHRE"]
["NLHRN"]
["NLHRV"]
["NLHRW"]
["NLHSK"]
["NLHSL"]
["NLHSO"]
["NLHST"]
["NLHSW"]
["NLHTB"]
["NLHTM"]
["NLHTN"]
["NLHTR"]
["NLHUK"]
["NLHUM"]
["NLHUN"]
["NLHVE"]
["NLHVH"]
["NLHVK"]
["NLHVS"]
["NLHXG"]
["NLHZK"]
["NLIJK"]
["NLIJM"]
["NLILO"]
["NLISM"]
["NLITR"]
["NLKAI"]
["NLKAM"]
["NLKAT"]
["NLKHO"]
["NLKHR"]
["NLKHV"]
["NLKKO"]
["NLKLM"]
["NLKLU"]
["NLKLV"]
["NLKLZ"]
["NLKMS"]
["NLKNT"]
["NLKPE"]
["NLKRD"]
["NLKRE"]
["NLKRI"]
["NLKSL"]
["NLKST"]
["NLKTN"]
["NLKTV"]
["NLKWR"]
["NLKZV"]
["NLLAN"]
["NLLAV"]
["NLLAW"]
["NLLDD"]
["NLLEM"]
["NLLEN"]
["NLLEO"]
["NLLES"]
["NLLEY"]
["NLLGB"]
["NLLGD"]
["NLLGI"]
["NLLID"]
["NLLIE"]
["NLLIJ"]
["NLLIT"]
["NLLKN"]
["NLLME"]
["NLLNO"]
["NLLRD"]
["NLLRU"]
["NLLTO"]
["NLLTS"]
["NLLWE"]
["NLLWG"]
["NLLWO"]
["NLLWR"]
["NLLZA"]
["NLMAK"]
["NLMAR"]
["NLMAU"]
["NLMDG"]
["NLMDI"]
["NLMDT"]
["NLMDU"]
["NLMEH"]
["NLMEP"]
["NLMEW"]
["NLMGT"]
["NLMHU"]
["NLMID"]
["NLMIE"]
["NLMIH"]
["NLMJA"]
["NLMKE"]
["NLMKM"]
["NLMKN"]
["NLMLA"]
["NLMLR"]
["NLMNH"]
["NLMNU"]
["NLMOE"]
["NLMOK"]
["NLMOL"]
["NLMSB"]
["NLMSL"]
["NLMST"]
["NLMSV"]
["NLMSW"]
["NLMUD"]
["NLMWD"]
["NLN8W"]
["NLNAM"]
["NLNAW"]
["NLNBG"]
["NLNBU"]
["NLND5"]
["NLNDB"]
["NLNDL"]
["NLNEC"]
["NLNES"]
["NLNEV"]
["NLNGV"]
["NLNIE"]
["NLNIJ"]
["NLNIU"]
["NLNKK"]
["NLNPZ"]
["NLNRG"]
["NLNSA"]
["NLNSD"]
["NLNST"]
["NLNSU"]
["NLNSZ"]
["NLNTJ"]
["NLNWG"]
["NLNWJ"]
["NLNWO"]
["NLNZ8"]
["NLNZJ"]
["NLOBL"]
["NLODL"]
["NLODR"]
["NLOGA"]
["NLOGE"]
["NLOGN"]
["NLOGP"]
["NLOHM"]
["NLOHW"]
["NLOHZ"]
["NLOIH"]
["NLOLS"]
["NLOMD"]
["NLOME"]
["NLOMH"]
["NLOOS"]
["NLORJ"]
["NLORL"]
["NLOSG"]
["NLOSK"]
["NLOSS"]
["NLOVG"]
["NLOZL"]
["NLOZU"]
["NLPAP"]
["NLPER"]
["NLPHL"]
["NLPTG"]
["NLPUM"]
["NLPZI"]
["NLQCU"]
["NLQDG"]
["NLQDS"]
["NLRAS"]
["NLRBG"]
["NLRBO"]
["NLRED"]
["NLREW"]
["NLRHD"]
["NLRID"]
["NLRIJ"]
["NLRLA"]
["NLRNK"]
["NLROC"]
["NLROZ"]
["NLRPL"]
["NLRSH"]
["NLRSL"]
["NLRST"]
["NLRSW"]
["NLRTG"]
["NLRTM"]
["NLRUK"]
["NLRUT"]
["NLRUY"]
["NLRYS"]
["NLSAB"]
["NLSAR"]
["NLSAT"]
["NLSBS"]
["NLSBU"]
["NLSCA"]
["NLSCE"]
["NLSCH"]
["NLSCI"]
["NLSDB"]
["NLSDM"]
["NLSDN"]
["NLSDW"]
["NLSHH"]
["NLSHO"]
["NLSIT"]
["NLSKG"]
["NLSKL"]
["NLSKM"]
["NLSKW"]
["NLSL7"]
["NLSLD"]
["NLSLO"]
["NLSLT"]
["NLSLU"]
["NLSMD"]
["NLSMG"]
["NLSMI"]
["NLSML"]
["NLSMO"]
["NLSMV"]
["NLSMZ"]
["NLSND"]
["NLSNN"]
["NLSON"]
["NLSOP"]
["NLSPI"]
["NLSPT"]
["NLSPV"]
["NLSRD"]
["NLSRE"]
["NLSRL"]
["NLSRT"]
["NLSSO"]
["NLSTD"]
["NLSTO"]
["NLSVG"]
["NLSVN"]
["NLSWK"]
["NLSWL"]
["NLSZL"]
["NLTEX"]
["NLTHD"]
["NLTHO"]
["NLTKM"]
["NLTKW"]
["NLTLB"]
["NLTMZ"]
["NLTNZ"]
["NLTOK"]
["NLTOR"]
["NLTRO"]
["NLTSL"]
["NLTTE"]
["NLTUL"]
["NLTWA"]
["NLUFE"]
["NLULR"]
["NLUMO"]
["NLURK"]
["NLUTG"]
["NLUTR"]
["NLVAN"]
["NLVAR"]
["NLVDM"]
["NLVDN"]
["NLVEL"]
["NLVEN"]
["NLVER"]
["NLVGB"]
["NLVIE"]
["NLVKR"]
["NLVKS"]
["NLVLA"]
["NLVLI"]
["NLVLL"]
["NLVNO"]
["NLVOB"]
["NLVOS"]
["NLVRA"]
["NLVSN"]
["NLVVL"]
["NLVWD"]
["NLWAA"]
["NLWAD"]
["NLWAS"]
["NLWBD"]
["NLWBK"]
["NLWBO"]
["NLWCM"]
["NLWDE"]
["NLWEL"]
["NLWEU"]
["NLWGD"]
["NLWGR"]
["NLWGW"]
["NLWHD"]
["NLWHO"]
["NLWHU"]
["NLWHZ"]
["NLWIG"]
["NLWIU"]
["NLWIW"]
["NLWKD"]
["NLWKG"]
["NLWKP"]
["NLWKS"]
["NLWKU"]
["NLWLK"]
["NLWMO"]
["NLWNS"]
["NLWOR"]
["NLWRG"]
["NLWRM"]
["NLWRP"]
["NLWRT"]
["NLWSC"]
["NLWSO"]
["NLWSP"]
["NLWTE"]
["NLWTN"]
["NLWTZ"]
["NLXXX"]
["NLYSK"]
["NLZAA"]
["NLZBO"]
["NLZDL"]
["NLZE5"]
["NLZEI"]
["NLZEW"]
["NLZHO"]
["NLZIE"]
["NLZLD"]
["NLZOU"]
["NLZPO"]
["NLZPS"]
["NLZUL"]
["NLZUT"]
["NLZVG"]
["NLZWI"]
["NLZWN"]
["NLZWS"]
["NO888"]
["NO88P"]
["NO88R"]
["NOAAA"]
["NOAAF"]
["NOAAN"]
["NOAAV"]
["NOABE"]
["NOABV"]
["NOADN"]
["NOADY"]
["NOAES"]
["NOAFS"]
["NOAFT"]
["NOAGD"]
["NOAGK"]
["NOAGO"]
["NOAHM"]
["NOAKK"]
["NOAKM"]
["NOALE"]
["NOALF"]
["NOALS"]
["NOALV"]
["NOAND"]
["NOANN"]
["NOANS"]
["NOARD"]
["NOARE"]
["NOARF"]
["NOARH"]
["NOARM"]
["NOARS"]
["NOASH"]
["NOASL"]
["NOASV"]
["NOASY"]
["NOATA"]
["NOATL"]
["NOAUE"]
["NOAUK"]
["NOAUL"]
["NOAUS"]
["NOAVA"]
["NOAVE"]
["NOBAF"]
["NOBAL"]
["NOBAM"]
["NOBAR"]
["NOBEJ"]
["NOBEL"]
["NOBER"]
["NOBFJ"]
["NOBGN"]
["NOBGO"]
["NOBIN"]
["NOBIS"]
["NOBJD"]
["NOBJF"]
["NOBJO"]
["NOBJU"]
["NOBJX"]
["NOBJY"]
["NOBKD"]
["NOBKS"]
["NOBKV"]
["NOBLK"]
["NOBLL"]
["NOBLO"]
["NOBLS"]
["NOBLV"]
["NOBNN"]
["NOBOE"]
["NOBOG"]
["NOBOK"]
["NOBOM"]
["NOBON"]
["NOBOO"]
["NOBOS"]
["NOBOV"]
["NOBRE"]
["NOBRH"]
["NOBRN"]
["NOBRO"]
["NOBRR"]
["NOBRS"]
["NOBRV"]
["NOBSD"]
["NOBSF"]
["NOBTH"]
["NOBTN"]
["NOBTS"]
["NOBUF"]
["NOBUG"]
["NOBUV"]
["NOBVB"]
["NOBVG"]
["NOBVK"]
["NOBVR"]
["NOBYN"]
["NOBYR"]
["NOBYS"]
["NODBY"]
["NODDY"]
["NODER"]
["NODFJ"]
["NODIM"]
["NODIR"]
["NODJU"]
["NODOL"]
["NODON"]
["NODRG"]
["NODRK"]
["NODRM"]
["NODSF"]
["NODSN"]
["NODUS"]
["NODYD"]
["NODYL"]
["NODYR"]
["NODYY"]
["NOEDD"]
["NOEDE"]
["NOEDF"]
["NOEDS"]
["NOEDT"]
["NOEFD"]
["NOEGD"]
["NOEGE"]
["NOEGG"]
["NOEID"]
["NOEIF"]
["NOEIK"]
["NOEIL"]
["NOEKF"]
["NOELL"]
["NOELN"]
["NOELO"]
["NOENG"]
["NOERF"]
["NOESP"]
["NOETN"]
["NOEVT"]
["NOEVV"]
["NOEYD"]
["NOFAN"]
["NOFAU"]
["NOFAX"]
["NOFBL"]
["NOFDE"]
["NOFED"]
["NOFFB"]
["NOFFD"]
["NOFIN"]
["NOFIS"]
["NOFIT"]
["NOFJA"]
["NOFJE"]
["NOFJL"]
["NOFKG"]
["NOFKS"]
["NOFLA"]
["NOFLM"]
["NOFLO"]
["NOFLR"]
["NOFLT"]
["NOFLY"]
["NOFND"]
["NOFNE"]
["NOFNN"]
["NOFNS"]
["NOFNY"]
["NOFOA"]
["NOFOE"]
["NOFOI"]
["NOFOL"]
["NOFON"]
["NOFOR"]
["NOFOS"]
["NOFRA"]
["NOFRE"]
["NOFRJ"]
["NOFRK"]
["NOFRN"]
["NOFRO"]
["NOFRS"]
["NOFRT"]
["NOFSD"]
["NOFSK"]
["NOFSL"]
["NOFSN"]
["NOFST"]
["NOFSV"]
["NOFUS"]
["NOFYS"]
["NOGAM"]
["NOGAU"]
["NOGHV"]
["NOGIK"]
["NOGIL"]
["NOGIS"]
["NOGJD"]
["NOGJM"]
["NOGJS"]
["NOGJV"]
["NOGLO"]
["NOGLP"]
["NOGNR"]
["NOGOO"]
["NOGOT"]
["NOGPN"]
["NOGRD"]
["NOGRF"]
["NOGRI"]
["NOGRO"]
["NOGRP"]
["NOGRR"]
["NOGRS"]
["NOGRT"]
["NOGRV"]
["NOGRY"]
["NOGTD"]
["NOGUD"]
["NOGUL"]
["NOGUR"]
["NOGUT"]
["NOHAA"]
["NOHAD"]
["NOHAE"]
["NOHAL"]
["NOHAN"]
["NOHAO"]
["NOHAR"]
["NOHAS"]
["NOHAU"]
["NOHAV"]
["NOHAZ"]
["NOHBT"]
["NOHDD"]
["NOHED"]
["NOHEF"]
["NOHEK"]
["NOHEL"]
["NOHEM"]
["NOHEN"]
["NOHER"]
["NOHES"]
["NOHET"]
["NOHEV"]
["NOHEY"]
["NOHFF"]
["NOHFL"]
["NOHFT"]
["NOHGR"]
["NOHHA"]
["NOHIT"]
["NOHJJ"]
["NOHJL"]
["NOHJO"]
["NOHKR"]
["NOHLA"]
["NOHLB"]
["NOHLE"]
["NOHLL"]
["NOHLS"]
["NOHME"]
["NOHMS"]
["NOHMV"]
["NOHMY"]
["NOHNE"]
["NOHOA"]
["NOHOF"]
["NOHOG"]
["NOHOI"]
["NOHOK"]
["NOHOL"]
["NOHOO"]
["NOHOR"]
["NOHOT"]
["NOHOY"]
["NOHRD"]
["NOHRI"]
["NOHRO"]
["NOHRR"]
["NOHRS"]
["NOHRV"]
["NOHRY"]
["NOHSA"]
["NOHSL"]
["NOHSO"]
["NOHSS"]
["NOHSV"]
["NOHSY"]
["NOHUD"]
["NOHUR"]
["NOHUS"]
["NOHVA"]
["NOHVG"]
["NOHVI"]
["NOHVK"]
["NOHVN"]
["NOHVS"]
["NOHYE"]
["NOHYL"]
["NOHYR"]
["NOIBE"]
["NOIDR"]
["NOIGE"]
["NOIGL"]
["NOIKA"]
["NOIKR"]
["NOIND"]
["NOINN"]
["NOINV"]
["NOISY"]
["NOJAN"]
["NOJEL"]
["NOJLD"]
["NOJOK"]
["NOJON"]
["NOJOS"]
["NOJOV"]
["NOJOY"]
["NOKAB"]
["NOKAF"]
["NOKAH"]
["NOKAN"]
["NOKAR"]
["NOKAT"]
["NOKAY"]
["NOKBV"]
["NOKDF"]
["NOKDL"]
["NOKGF"]
["NOKIA"]
["NOKIL"]
["NOKIO"]
["NOKIR"]
["NOKIV"]
["NOKJB"]
["NOKJE"]
["NOKJF"]
["NOKJK"]
["NOKKN"]
["NOKLD"]
["NOKLE"]
["NOKMN"]
["NOKMO"]
["NOKMS"]
["NOKMY"]
["NOKOB"]
["NOKOL"]
["NOKON"]
["NOKOP"]
["NOKPG"]
["NOKRA"]
["NOKRS"]
["NOKRV"]
["NOKSU"]
["NOKSY"]
["NOKUV"]
["NOKVD"]
["NOKVF"]
["NOKVG"]
["NOKVH"]
["NOKVK"]
["NOKVL"]
["NOKVM"]
["NOKVN"]
["NOKVR"]
["NOKVS"]
["NOKVV"]
["NOKYR"]
["NOLAD"]
["NOLAG"]
["NOLAN"]
["NOLAO"]
["NOLAR"]
["NOLAS"]
["NOLAV"]
["NOLAY"]
["NOLDS"]
["NOLEA"]
["NOLEB"]
["NOLEF"]
["NOLEK"]
["NOLEN"]
["NOLEP"]
["NOLES"]
["NOLEV"]
["NOLFF"]
["NOLGS"]
["NOLIA"]
["NOLID"]
["NOLIE"]
["NOLIL"]
["NOLIN"]
["NOLIT"]
["NOLKA"]
["NOLKN"]
["NOLKV"]
["NOLND"]
["NOLNE"]
["NOLOD"]
["NOLOE"]
["NOLON"]
["NOLOP"]
["NOLOV"]
["NOLRA"]
["NOLRD"]
["NOLRE"]
["NOLRI"]
["NOLRK"]
["NOLSU"]
["NOLUL"]
["NOLUR"]
["NOLUS"]
["NOLVG"]
["NOLVK"]
["NOLYD"]
["NOLYF"]
["NOLYN"]
["NOLYS"]
["NOMAH"]
["NOMAK"]
["NOMAL"]
["NOMAN"]
["NOMAT"]
["NOMAU"]
["NOMAV"]
["NOMAY"]
["NOMEH"]
["NOMEK"]
["NOMEL"]
["NOMEN"]
["NOMEV"]
["NOMEY"]
["NOMGR"]
["NOMID"]
["NOMIS"]
["NOMIT"]
["NOMJF"]
["NOMLD"]
["NOMLK"]
["NOMLM"]
["NOMLS"]
["NOMLT"]
["NOMOB"]
["NOMOD"]
["NOMOL"]
["NOMON"]
["NOMOR"]
["NOMOS"]
["NOMOV"]
["NOMQN"]
["NOMRV"]
["NOMSD"]
["NOMSF"]
["NOMSK"]
["NOMSN"]
["NOMSS"]
["NOMSV"]
["NOMSY"]
["NOMVV"]
["NOMYO"]
["NONAU"]
["NONEO"]
["NONEV"]
["NONFD"]
["NONFO"]
["NONGH"]
["NONHS"]
["NONIA"]
["NONKB"]
["NONOD"]
["NONOF"]
["NONOK"]
["NONOL"]
["NONOM"]
["NONOR"]
["NONRY"]
["NONSB"]
["NONSF"]
["NONSN"]
["NONST"]
["NONTY"]
["NONVK"]
["NONYE"]
["NONYH"]
["NONZC"]
["NONZL"]
["NONZY"]
["NOODD"]
["NOOKF"]
["NOOKS"]
["NOOLA"]
["NOOLD"]
["NOOLL"]
["NOOLN"]
["NOOLR"]
["NOOLT"]
["NOOLV"]
["NOOMA"]
["NOOMB"]
["NOOOS"]
["NOOPG"]
["NOORD"]
["NOORK"]
["NOORN"]
["NOORS"]
["NOORV"]
["NOOSE"]
["NOOSG"]
["NOOSL"]
["NOOSN"]
["NOOST"]
["NOOSY"]
["NOOTA"]
["NOOTB"]
["NOOTO"]
["NOOVK"]
["NOOYB"]
["NOOYG"]
["NOPAR"]
["NOPOR"]
["NORAD"]
["NORAF"]
["NORAM"]
["NORAU"]
["NORAY"]
["NORBV"]
["NORDB"]
["NORDY"]
["NOREE"]
["NOREI"]
["NOREK"]
["NOREN"]
["NOREP"]
["NORES"]
["NORET"]
["NORFJ"]
["NORIO"]
["NORIS"]
["NORIV"]
["NORMB"]
["NORMV"]
["NORNA"]
["NOROA"]
["NOROG"]
["NOROM"]
["NORON"]
["NOROV"]
["NOROY"]
["NORPV"]
["NORSD"]
["NORSE"]
["NORSH"]
["NORSS"]
["NORTL"]
["NORUB"]
["NORUN"]
["NORVK"]
["NORVR"]
["NORYF"]
["NOSAA"]
["NOSAC"]
["NOSAF"]
["NOSAG"]
["NOSAH"]
["NOSAI"]
["NOSAK"]
["NOSAL"]
["NOSAM"]
["NOSAN"]
["NOSAS"]
["NOSAT"]
["NOSAU"]
["NOSAX"]
["NOSAY"]
["NOSBA"]
["NOSBE"]
["NOSBT"]
["NOSBU"]
["NOSDI"]
["NOSDL"]
["NOSDN"]
["NOSDT"]
["NOSDZ"]
["NOSEI"]
["NOSEJ"]
["NOSEK"]
["NOSEN"]
["NOSEV"]
["NOSGH"]
["NOSGJ"]
["NOSGT"]
["NOSHT"]
["NOSID"]
["NOSIH"]
["NOSIP"]
["NOSIS"]
["NOSIT"]
["NOSIV"]
["NOSJD"]
["NOSJE"]
["NOSJH"]
["NOSJO"]
["NOSJU"]
["NOSJV"]
["NOSKB"]
["NOSKE"]
["NOSKF"]
["NOSKG"]
["NOSKH"]
["NOSKI"]
["NOSKK"]
["NOSKL"]
["NOSKN"]
["NOSKO"]
["NOSKU"]
["NOSKV"]
["NOSKX"]
["NOSKY"]
["NOSKZ"]
["NOSLA"]
["NOSLD"]
["NOSLE"]
["NOSLG"]
["NOSLH"]
["NOSLM"]
["NOSLN"]
["NOSLO"]
["NOSLV"]
["NOSLX"]
["NOSMN"]
["NOSMO"]
["NOSND"]
["NOSNE"]
["NOSNF"]
["NOSNI"]
["NOSNL"]
["NOSNS"]
["NOSNV"]
["NOSOF"]
["NOSOG"]
["NOSOJ"]
["NOSOK"]
["NOSOM"]
["NOSOR"]
["NOSOS"]
["NOSOV"]
["NOSOY"]
["NOSPG"]
["NOSPK"]
["NOSPV"]
["NOSRA"]
["NOSRD"]
["NOSRH"]
["NOSRK"]
["NOSRM"]
["NOSRN"]
["NOSRO"]
["NOSRP"]
["NOSRS"]
["NOSRV"]
["NOSRX"]
["NOSSJ"]
["NOSSO"]
["NOSSS"]
["NOSTA"]
["NOSTB"]
["NOSTD"]
["NOSTE"]
["NOSTF"]
["NOSTG"]
["NOSTH"]
["NOSTI"]
["NOSTJ"]
["NOSTK"]
["NOSTL"]
["NOSTO"]
["NOSTR"]
["NOSTS"]
["NOSTU"]
["NOSTV"]
["NOSTX"]
["NOSTY"]
["NOSTZ"]
["NOSUA"]
["NOSUL"]
["NOSUN"]
["NOSUR"]
["NOSUS"]
["NOSUZ"]
["NOSVB"]
["NOSVE"]
["NOSVG"]
["NOSVI"]
["NOSVJ"]
["NOSVL"]
["NOSVN"]
["NOSVO"]
["NOSVR"]
["NOSVT"]
["NOSVV"]
["NOSYK"]
["NOT8N"]
["NOTAA"]
["NOTAE"]
["NOTAL"]
["NOTAU"]
["NOTAV"]
["NOTBO"]
["NOTIN"]
["NOTJL"]
["NOTJO"]
["NOTJR"]
["NOTJS"]
["NOTJU"]
["NOTMV"]
["NOTNN"]
["NOTOF"]
["NOTOM"]
["NOTON"]
["NOTOR"]
["NOTOS"]
["NOTOV"]
["NOTOY"]
["NOTRD"]
["NOTRF"]
["NOTRN"]
["NOTRO"]
["NOTRY"]
["NOTSB"]
["NOTSD"]
["NOTSX"]
["NOTUF"]
["NOTUS"]
["NOTVA"]
["NOTVE"]
["NOTVI"]
["NOTYF"]
["NOTYN"]
["NOTYT"]
["NOTYV"]
["NOUBO"]
["NOULE"]
["NOULL"]
["NOULS"]
["NOUME"]
["NOUND"]
["NOUSD"]
["NOUTG"]
["NOUTH"]
["NOUTN"]
["NOUTS"]
["NOUTV"]
["NOUVK"]
["NOVAD"]
["NOVAE"]
["NOVAG"]
["NOVAK"]
["NOVAL"]
["NOVAN"]
["NOVAO"]
["NOVAT"]
["NOVAV"]
["NOVAY"]
["NOVBE"]
["NOVDA"]
["NOVDL"]
["NOVDS"]
["NOVEF"]
["NOVEG"]
["NOVEO"]
["NOVER"]
["NOVEV"]
["NOVEY"]
["NOVGN"]
["NOVGY"]
["NOVHM"]
["NOVHN"]
["NOVIF"]
["NOVIG"]
["NOVIL"]
["NOVIN"]
["NOVIS"]
["NOVKK"]
["NOVKN"]
["NOVLL"]
["NOVLS"]
["NOVMD"]
["NOVNJ"]
["NOVNN"]
["NOVNS"]
["NOVOH"]
["NOVRR"]
["NOVSM"]
["NOVSN"]
["NOVST"]
["NOVTL"]
["NOVTS"]
["NOVVG"]
["NOVVY"]
["NOYTO"]
["NOZAA"]
["NOZAC"]
["NOZAF"]
["NOZAL"]
["NOZAR"]
["NOZAZ"]
["NOZBA"]
["NOZBB"]
["NOZBC"]
["NOZBD"]
["NOZBE"]
["NOZBF"]
["NOZBG"]
["NOZBH"]
["NOZBI"]
["NOZBJ"]
["NOZBQ"]
["NOZBR"]
["NOZBS"]
["NOZBU"]
["NOZBV"]
["NOZBY"]
["NOZCB"]
["NOZCE"]
["NOZCH"]
["NOZCI"]
["NOZCJ"]
["NOZCK"]
["NOZCL"]
["NOZCQ"]
["NOZCS"]
["NOZCT"]
["NOZDA"]
["NOZDD"]
["NOZDF"]
["NOZDI"]
["NOZDK"]
["NOZDM"]
["NOZDU"]
["NOZEN"]
["NOZES"]
["NOZFA"]
["NOZFB"]
["NOZFC"]
["NOZFD"]
["NOZFE"]
["NOZFF"]
["NOZFG"]
["NOZFI"]
["NOZFJ"]
["NOZFK"]
["NOZFM"]
["NOZFN"]
["NOZFO"]
["NOZFP"]
["NOZFQ"]
["NOZFR"]
["NOZFS"]
["NOZFT"]
["NOZFV"]
["NOZFZ"]
["NOZGI"]
["NOZGJ"]
["NOZGR"]
["NOZGS"]
["NOZHB"]
["NOZHC"]
["NOZHD"]
["NOZHF"]
["NOZHI"]
["NOZHJ"]
["NOZHN"]
["NOZHO"]
["NOZHP"]
["NOZHQ"]
["NOZHT"]
["NOZHU"]
["NOZHV"]
["NOZHW"]
["NOZJU"]
["NOZKA"]
["NOZKB"]
["NOZKE"]
["NOZKF"]
["NOZKG"]
["NOZKH"]
["NOZKM"]
["NOZKO"]
["NOZKQ"]
["NOZKR"]
["NOZKS"]
["NOZKV"]
["NOZLA"]
["NOZLB"]
["NOZLC"]
["NOZLD"]
["NOZLE"]
["NOZLF"]
["NOZLH"]
["NOZLI"]
["NOZLN"]
["NOZLR"]
["NOZLS"]
["NOZLU"]
["NOZLY"]
["NOZMA"]
["NOZMB"]
["NOZMC"]
["NOZMD"]
["NOZMM"]
["NOZMN"]
["NOZMS"]
["NOZMU"]
["NOZNA"]
["NOZNC"]
["NOZND"]
["NOZNF"]
["NOZNH"]
["NOZNJ"]
["NOZNL"]
["NOZNN"]
["NOZNR"]
["NOZNS"]
["NOZNT"]
["NOZNV"]
["NOZNY"]
["NOZOC"]
["NOZOK"]
["NOZOM"]
["NOZON"]
["NOZOS"]
["NOZPP"]
["NOZQC"]
["NOZQW"]
["NOZRA"]
["NOZRB"]
["NOZRD"]
["NOZRE"]
["NOZRF"]
["NOZRM"]
["NOZRN"]
["NOZRO"]
["NOZRS"]
["NOZRT"]
["NOZRU"]
["NOZRY"]
["NOZSA"]
["NOZSB"]
["NOZSC"]
["NOZSD"]
["NOZSE"]
["NOZSF"]
["NOZSI"]
["NOZSJ"]
["NOZSK"]
["NOZSL"]
["NOZSM"]
["NOZSN"]
["NOZSO"]
["NOZSQ"]
["NOZST"]
["NOZSU"]
["NOZSV"]
["NOZSW"]
["NOZSY"]
["NOZSZ"]
["NOZTA"]
["NOZTB"]
["NOZTF"]
["NOZTG"]
["NOZTI"]
["NOZTJ"]
["NOZTO"]
["NOZTR"]
["NOZTS"]
["NOZTT"]
["NOZUL"]
["NOZVA"]
["NOZVB"]
["NOZVC"]
["NOZVD"]
["NOZVE"]
["NOZVF"]
["NOZVG"]
["NOZVH"]
["NOZVI"]
["NOZVJ"]
["NOZVL"]
["NOZVO"]
["NOZVS"]
["NOZVU"]
["NOZWS"]
["NOZXA"]
["NOZXV"]
["NOZZF"]
["NOZZS"]
["NPLLU"]
["NR888"]
["NRINU"]
["NU888"]
["NUALO"]
["NUIUE"]
["NZ888"]
["NZAKA"]
["NZAKL"]
["NZBLU"]
["NZBUW"]
["NZCSA"]
["NZDEV"]
["NZDPC"]
["NZGIS"]
["NZGLE"]
["NZGMN"]
["NZHMB"]
["NZKAU"]
["NZKBZ"]
["NZLYT"]
["NZMAB"]
["NZMAP"]
["NZMAR"]
["NZMFN"]
["NZNPE"]
["NZNPL"]
["NZNSN"]
["NZOLT"]
["NZONE"]
["NZOPX"]
["NZORR"]
["NZOTT"]
["NZOTU"]
["NZPCN"]
["NZPOE"]
["NZPON"]
["NZRAR"]
["NZRAV"]
["NZRUS"]
["NZSEA"]
["NZSHB"]
["NZTAK"]
["NZTHH"]
["NZTIU"]
["NZTKH"]
["NZTRG"]
["NZTRY"]
["NZTWI"]
["NZUMU"]
["NZWAG"]
["NZWHN"]
["NZWHR"]
["NZWKE"]
["NZWLG"]
["NZWRE"]
["NZWSZ"]
["NZWTG"]
["OM888"]
["OMDQM"]
["OMFAH"]
["OMMCT"]
["OMMFH"]
["OMMUT"]
["OMOFC"]
["OMOPQ"]
["OMQAL"]
["OMQUO"]
["OMRAY"]
["OMSHI"]
["OMSLL"]
["OMSOH"]
["OMSTQ"]
["OMSUL"]
["OMSUW"]
["PA888"]
["PAACO"]
["PAAGD"]
["PAAML"]
["PABAY"]
["PABCC"]
["PABLB"]
["PABOC"]
["PACHA"]
["PACHG"]
["PACTB"]
["PACTD"]
["PACZZ"]
["PAELE"]
["PAG8L"]
["PAGBA"]
["PAGDE"]
["PAGTN"]
["PAHER"]
["PAMEL"]
["PAMFS"]
["PAMIT"]
["PAMNP"]
["PAONX"]
["PAPAI"]
["PAPAM"]
["PAPAY"]
["PAPBE"]
["PAPBM"]
["PAPCA"]
["PAPED"]
["PAPES"]
["PAPLP"]
["PAPTY"]
["PAROD"]
["PASCL"]
["PATBG"]
["PATOC"]
["PAVAC"]
["PE888"]
["PEANC"]
["PEATI"]
["PEBAR"]
["PECAB"]
["PECHM"]
["PECHY"]
["PECLL"]
["PECON"]
["PEEEN"]
["PEGSM"]
["PEHCO"]
["PEHUY"]
["PEILQ"]
["PEIQT"]
["PELAG"]
["PELIM"]
["PELOB"]
["PELOO"]
["PELPP"]
["PEMLQ"]
["PEMRI"]
["PENGS"]
["PEPAC"]
["PEPAI"]
["PEPAM"]
["PEPCH"]
["PEPCL"]
["PEPEM"]
["PEPIO"]
["PEPLO"]
["PEPMC"]
["PEPMT"]
["PEPUB"]
["PEPUN"]
["PESJA"]
["PESNX"]
["PESUP"]
["PESVY"]
["PETAG"]
["PETDM"]
["PETRU"]
["PETYL"]
["PEYMS"]
["PF888"]
["PFAHU"]
["PFAUT"]
["PFBOB"]
["PFFAT"]
["PFHEU"]
["PFHHT"]
["PFIKI"]
["PFMOE"]
["PFOTP"]
["PFPPT"]
["PFRVV"]
["PFTAI"]
["PFTUP"]
["PFUTU"]
["PFVAI"]
["PG888"]
["PGABW"]
["PGAHO"]
["PGAIA"]
["PGAKI"]
["PGALC"]
["PGAMI"]
["PGANB"]
["PGATN"]
["PGBNA"]
["PGBOI"]
["PGBOR"]
["PGBUA"]
["PGCAU"]
["PGCFG"]
["PGDAU"]
["PGDBL"]
["PGFIN"]
["PGFUB"]
["PGGAW"]
["PGGEI"]
["PGGIL"]
["PGGMI"]
["PGGUR"]
["PGHKN"]
["PGKAI"]
["PGKIE"]
["PGKIM"]
["PGKLO"]
["PGKMA"]
["PGKOP"]
["PGKPP"]
["PGKRK"]
["PGKRX"]
["PGKUL"]
["PGKVG"]
["PGLAE"]
["PGLAK"]
["PGLAM"]
["PGLDT"]
["PGLLA"]
["PGLNV"]
["PGLOL"]
["PGLOM"]
["PGLOR"]
["PGMAG"]
["PGMAM"]
["PGMIE"]
["PGMIS"]
["PGMTK"]
["PGNAP"]
["PGPDO"]
["PGPOM"]
["PGRAB"]
["PGRAM"]
["PGRKU"]
["PGRNR"]
["PGROR"]
["PGRVI"]
["PGSAI"]
["PGSCH"]
["PGSMU"]
["PGSOI"]
["PGSPL"]
["PGSQT"]
["PGTAI"]
["PGTAM"]
["PGTAU"]
["PGTFI"]
["PGTGL"]
["PGTLW"]
["PGTMI"]
["PGTOI"]
["PGULA"]
["PGUNG"]
["PGVAI"]
["PGVLA"]
["PGWAT"]
["PGWOK"]
["PGWWK"]
["PGYEN"]
["PH888"]
["PHABU"]
["PHADL"]
["PHAHE"]
["PHAJU"]
["PHALA"]
["PHALB"]
["PHALC"]
["PHALE"]
["PHAMU"]
["PHANA"]
["PHANT"]
["PHAPR"]
["PHAQE"]
["PHARA"]
["PHAST"]
["PHATI"]
["PHBAB"]
["PHBAC"]
["PHBAG"]
["PHBAI"]
["PHBAL"]
["PHBAS"]
["PHBAT"]
["PHBAU"]
["PHBCD"]
["PHBCO"]
["PHBCT"]
["PHBCU"]
["PHBGC"]
["PHBGI"]
["PHBGR"]
["PHBGS"]
["PHBGV"]
["PHBIN"]
["PHBIY"]
["PHBLA"]
["PHBLC"]
["PHBLG"]
["PHBLN"]
["PHBLP"]
["PHBLT"]
["PHBLU"]
["PHBNG"]
["PHBNQ"]
["PHBNW"]
["PHBOA"]
["PHBOG"]
["PHBOR"]
["PHBOS"]
["PHBPH"]
["PHBQA"]
["PHBRB"]
["PHBRP"]
["PHBRT"]
["PHBSO"]
["PHBSY"]
["PHBTG"]
["PHBTN"]
["PHBTS"]
["PHBTY"]
["PHBUD"]
["PHBUG"]
["PHBUL"]
["PHBUR"]
["PHBXU"]
["PHBYB"]
["PHBYP"]
["PHBYS"]
["PHBYW"]
["PHCAB"]
["PHCAJ"]
["PHCAM"]
["PHCAZ"]
["PHCBO"]
["PHCBY"]
["PHCCG"]
["PHCDB"]
["PHCDN"]
["PHCEB"]
["PHCGG"]
["PHCGI"]
["PHCGM"]
["PHCGP"]
["PHCGT"]
["PHCGY"]
["PHCLP"]
["PHCLV"]
["PHCML"]
["PHCMO"]
["PHCNT"]
["PHCNY"]
["PHCPC"]
["PHCPL"]
["PHCRA"]
["PHCRG"]
["PHCSB"]
["PHCSI"]
["PHCST"]
["PHCTB"]
["PHCTS"]
["PHCUG"]
["PHCUJ"]
["PHCUN"]
["PHCUR"]
["PHCVE"]
["PHCWY"]
["PHDCB"]
["PHDDW"]
["PHDGL"]
["PHDGT"]
["PHDIC"]
["PHDID"]
["PHDIO"]
["PHDIR"]
["PHDIV"]
["PHDNG"]
["PHDNL"]
["PHDNO"]
["PHDPL"]
["PHDPT"]
["PHDRB"]
["PHDUL"]
["PHDVO"]
["PHENI"]
["PHGAC"]
["PHGAS"]
["PHGES"]
["PHGGG"]
["PHGGM"]
["PHGHE"]
["PHGHG"]
["PHGIN"]
["PHGMS"]
["PHGNI"]
["PHGUN"]
["PHHIJ"]
["PHHIL"]
["PHHIM"]
["PHHNB"]
["PHHNG"]
["PHHNT"]
["PHHON"]
["PHHOO"]
["PHHYB"]
["PHIGN"]
["PHILO"]
["PHINP"]
["PHIPE"]
["PHIRN"]
["PHISL"]
["PHJAG"]
["PHJAS"]
["PHJNZ"]
["PHJOL"]
["PHJPM"]
["PHKAR"]
["PHKAS"]
["PHKAT"]
["PHKIA"]
["PHKIL"]
["PHKIN"]
["PHKIP"]
["PHKIW"]
["PHKLM"]
["PHKOL"]
["PHKUM"]
["PHLAB"]
["PHLAC"]
["PHLAG"]
["PHLAM"]
["PHLAN"]
["PHLAO"]
["PHLAY"]
["PHLBK"]
["PHLEY"]
["PHLGG"]
["PHLGP"]
["PHLGU"]
["PHLIA"]
["PHLIB"]
["PHLIM"]
["PHLIN"]
["PHLNA"]
["PHLNK"]
["PHLNO"]
["PHLOM"]
["PHLOO"]
["PHLOP"]
["PHLPA"]
["PHLPU"]
["PHLPZ"]
["PHLRP"]
["PHLUC"]
["PHLUG"]
["PHLUM"]
["PHLZB"]
["PHMAB"]
["PHMAC"]
["PHMAD"]
["PHMAI"]
["PHMAK"]
["PHMAL"]
["PHMAS"]
["PHMBT"]
["PHMCD"]
["PHMCJ"]
["PHMCO"]
["PHMDN"]
["PHMGA"]
["PHMGB"]
["PHMGD"]
["PHMGG"]
["PHMGI"]
["PHMHT"]
["PHMIC"]
["PHMIL"]
["PHMIO"]
["PHMKC"]
["PHMLB"]
["PHMLL"]
["PHMLS"]
["PHMNI"]
["PHMNL"]
["PHMNN"]
["PHMNS"]
["PHMNT"]
["PHMNY"]
["PHMON"]
["PHMOR"]
["PHMSB"]
["PHMSC"]
["PHMSS"]
["PHMSY"]
["PHMTA"]
["PHMTI"]
["PHMTP"]
["PHMUL"]
["PHMVS"]
["PHMXI"]
["PHNAB"]
["PHNAL"]
["PHNAP"]
["PHNAR"]
["PHNAS"]
["PHNGH"]
["PHNID"]
["PHNON"]
["PHNOP"]
["PHNTO"]
["PHNUG"]
["PHODI"]
["PHOLO"]
["PHOPO"]
["PHORA"]
["PHORC"]
["PHORL"]
["PHORS"]
["PHOTE"]
["PHOZC"]
["PHPAG"]
["PHPAM"]
["PHPAN"]
["PHPAS"]
["PHPBA"]
["PHPCA"]
["PHPCN"]
["PHPDC"]
["PHPDR"]
["PHPGA"]
["PHPGB"]
["PHPGT"]
["PHPHD"]
["PHPIN"]
["PHPIS"]
["PHPLA"]
["PHPLB"]
["PHPLC"]
["PHPLL"]
["PHPLP"]
["PHPLW"]
["PHPMT"]
["PHPNB"]
["PHPNN"]
["PHPNT"]
["PHPPL"]
["PHPPP"]
["PHPPS"]
["PHPRA"]
["PHPRO"]
["PHPSL"]
["PHPTL"]
["PHPUG"]
["PHPUL"]
["PHQBI"]
["PHQBL"]
["PHQPT"]
["PHQUE"]
["PHQUI"]
["PHREA"]
["PHRLN"]
["PHROM"]
["PHRXS"]
["PHSAG"]
["PHSAN"]
["PHSAS"]
["PHSAY"]
["PHSBB"]
["PHSBG"]
["PHSBY"]
["PHSCA"]
["PHSCR"]
["PHSCT"]
["PHSDG"]
["PHSFE"]
["PHSFS"]
["PHSGD"]
["PHSIG"]
["PHSIN"]
["PHSIO"]
["PHSIR"]
["PHSIS"]
["PHSIY"]
["PHSJI"]
["PHSKU"]
["PHSLM"]
["PHSLU"]
["PHSMA"]
["PHSMR"]
["PHSNG"]
["PHSNI"]
["PHSOR"]
["PHSPQ"]
["PHSTE"]
["PHSUA"]
["PHSUG"]
["PHTAC"]
["PHTAG"]
["PHTAL"]
["PHTAN"]
["PHTAY"]
["PHTBC"]
["PHTBG"]
["PHTBU"]
["PHTDC"]
["PHTDG"]
["PHTGD"]
["PHTGI"]
["PHTGL"]
["PHTGN"]
["PHTGO"]
["PHTGT"]
["PHTGW"]
["PHTIB"]
["PHTIN"]
["PHTKW"]
["PHTLD"]
["PHTLG"]
["PHTLM"]
["PHTLP"]
["PHTLS"]
["PHTNU"]
["PHTOB"]
["PHTON"]
["PHTTO"]
["PHULY"]
["PHURR"]
["PHVCS"]
["PHVNV"]
["PHVTL"]
["PHVTO"]
["PHWAS"]
["PHWAW"]
["PHWNP"]
["PHXSO"]
["PHZAM"]
["PK888"]
["PKBQM"]
["PKGWD"]
["PKJIW"]
["PKKBA"]
["PKKBU"]
["PKKCT"]
["PKKHI"]
["PKKIA"]
["PKORW"]
["PKPCT"]
["PKPSI"]
["PKQCT"]
["PL6MA"]
["PL888"]
["PL88P"]
["PL88R"]
["PLBEK"]
["PLBLZ"]
["PLBRK"]
["PLBYC"]
["PLBZG"]
["PLBZI"]
["PLCDB"]
["PLCH3"]
["PLCPL"]
["PLDAR"]
["PLDCZ"]
["PLDZN"]
["PLELB"]
["PLFBK"]
["PLGDN"]
["PLGDY"]
["PLGKI"]
["PLGKZ"]
["PLHEL"]
["PLIT5"]
["PLIYC"]
["PLJDZ"]
["PLKAO"]
["PLKLY"]
["PLKMR"]
["PLKOD"]
["PLKOL"]
["PLKPW"]
["PLKRM"]
["PLKUY"]
["PLKYK"]
["PLKZ4"]
["PLLEA"]
["PLLPN"]
["PLLUU"]
["PLMA9"]
["PLMID"]
["PLMK9"]
["PLMKW"]
["PLMNN"]
["PLMRE"]
["PLNCH"]
["PLNOW"]
["PLNWA"]
["PLNXA"]
["PLOLA"]
["PLOSD"]
["PLPLC"]
["PLPNW"]
["PLPTN"]
["PLPZN"]
["PLROI"]
["PLRUC"]
["PLRWL"]
["PLSCA"]
["PLSJK"]
["PLSKJ"]
["PLSKN"]
["PLSOP"]
["PLSPA"]
["PLSWI"]
["PLSY2"]
["PLSZZ"]
["PLTBZ"]
["PLUMS"]
["PLURD"]
["PLUST"]
["PLWIU"]
["PLWLA"]
["PLWLI"]
["PLWOL"]
["PLWZO"]
["PLXXX"]
["PLZAA"]
["PLZGO"]
["PLZIC"]
["PLZIN"]
["PLZNI"]
["PM888"]
["PMFSP"]
["PN888"]
["PNPCN"]
["PR888"]
["PRARE"]
["PRARR"]
["PRBQN"]
["PRGUX"]
["PRGUY"]
["PRLAM"]
["PRMAZ"]
["PRPJO"]
["PRPSE"]
["PRPYA"]
["PRSAL"]
["PRSBS"]
["PRSJU"]
["PS888"]
["PT888"]
["PT88P"]
["PT88R"]
["PTABF"]
["PTADG"]
["PTADH"]
["PTAFR"]
["PTAGD"]
["PTAGR"]
["PTANG"]
["PTARP"]
["PTAVE"]
["PTAVP"]
["PTAZM"]
["PTBAN"]
["PTBAO"]
["PTBEI"]
["PTBNG"]
["PTBOC"]
["PTBRA"]
["PTBRG"]
["PTBTR"]
["PTBUS"]
["PTCAC"]
["PTCAL"]
["PTCAP"]
["PTCAS"]
["PTCDP"]
["PTCES"]
["PTCLS"]
["PTCML"]
["PTCNA"]
["PTCNL"]
["PTCNV"]
["PTCPL"]
["PTCRB"]
["PTCRC"]
["PTDFZ"]
["PTDOU"]
["PTEST"]
["PTFAE"]
["PTFAO"]
["PTFDF"]
["PTFDT"]
["PTFNC"]
["PTFOZ"]
["PTFUZ"]
["PTGAL"]
["PTGER"]
["PTGIF"]
["PTGUA"]
["PTGUE"]
["PTHOR"]
["PTIOR"]
["PTLAJ"]
["PTLDP"]
["PTLDR"]
["PTLE2"]
["PTLEI"]
["PTLEP"]
["PTLIS"]
["PTLMG"]
["PTLNS"]
["PTLOS"]
["PTMAD"]
["PTMAT"]
["PTMCH"]
["PTMDM"]
["PTMLR"]
["PTMRS"]
["PTMUS"]
["PTNAV"]
["PTNCA"]
["PTNGV"]
["PTNRD"]
["PTOEI"]
["PTOLA"]
["PTOLH"]
["PTOPO"]
["PTPCZ"]
["PTPDL"]
["PTPDS"]
["PTPEN"]
["PTPFT"]
["PTPMZ"]
["PTPOM"]
["PTPRG"]
["PTPRM"]
["PTPRV"]
["PTPSC"]
["PTPVC"]
["PTPVH"]
["PTPXO"]
["PTQRT"]
["PTRPX"]
["PTRQU"]
["PTSAG"]
["PTSAR"]
["PTSCF"]
["PTSCG"]
["PTSET"]
["PTSHA"]
["PTSIE"]
["PTSLZ"]
["PTSMA"]
["PTSMI"]
["PTSMO"]
["PTSMS"]
["PTSMT"]
["PTSRP"]
["PTSSB"]
["PTTER"]
["PTTGO"]
["PTTOA"]
["PTTPO"]
["PTTRF"]
["PTTUN"]
["PTVAB"]
["PTVAG"]
["PTVAR"]
["PTVDC"]
["PTVDP"]
["PTVDV"]
["PTVEL"]
["PTVFC"]
["PTVFD"]
["PTVFX"]
["PTVIC"]
["PTVIF"]
["PTVLC"]
["PTVNC"]
["PTVNR"]
["PTVRE"]
["PTVZD"]
["PTXZX"]
["PTZFM"]
["PW888"]
["PWANG"]
["PWROR"]
["PYAGT"]
["PYASU"]
["PYBCM"]
["PYCAA"]
["PYCAC"]
["PYCNP"]
["PYENO"]
["PYFNX"]
["PYFUO"]
["PYITE"]
["PYMRA"]
["PYPAN"]
["PYPCJ"]
["PYPGU"]
["PYPSA"]
["PYSAN"]
["PYTER"]
["PYVLL"]
["QA888"]
["QAASN"]
["QADOH"]
["QAHAL"]
["QAHMD"]
["QAHNA"]
["QAMES"]
["QAQAP"]
["QAQCH"]
["QARLF"]
["QARUS"]
["QASLW"]
["QAUMS"]
["RE888"]
["RELEU"]
["RELPT"]
["REPOS"]
["RESSZ"]
["RO5LI"]
["RO888"]
["RO88P"]
["RO88R"]
["ROAGI"]
["ROBAB"]
["ROBCN"]
["ROBCT"]
["ROBEZ"]
["ROBRA"]
["ROBZI"]
["ROCAF"]
["ROCAS"]
["ROCEV"]
["ROCHL"]
["ROCHN"]
["ROCND"]
["ROCNM"]
["ROCOB"]
["ROCTS"]
["RODTS"]
["ROEFS"]
["ROFET"]
["ROFTE"]
["ROGAL"]
["ROGRG"]
["ROGUU"]
["ROHAU"]
["ROHDC"]
["ROISC"]
["ROJRT"]
["ROLUM"]
["ROLUT"]
["ROMAC"]
["ROMAG"]
["ROMAH"]
["ROMED"]
["ROMGU"]
["ROMID"]
["RONDI"]
["ROOJD"]
["ROOLT"]
["ROORV"]
["ROOVI"]
["ROPAL"]
["ROPAU"]
["ROPES"]
["ROPPC"]
["ROPSE"]
["ROPTA"]
["RORDE"]
["RORNN"]
["RORVA"]
["ROSUL"]
["ROTCE"]
["ROTR5"]
["ROTUM"]
["ROTUT"]
["ROVTR"]
["ROXXX"]
["ROZIC"]
["ROZUI"]
["RS4SN"]
["RS888"]
["RSAPT"]
["RSBEG"]
["RSBPA"]
["RSBZD"]
["RSDIM"]
["RSDOB"]
["RSGNJ"]
["RSKMA"]
["RSMSD"]
["RSPHO"]
["RSSKA"]
["RSVGS"]
["RSVRA"]
["RSVS4"]
["RSXXX"]
["RU888"]
["RUABC"]
["RUABK"]
["RUAER"]
["RUAGK"]
["RUAKS"]
["RUAMU"]
["RUAMV"]
["RUARH"]
["RUARM"]
["RUASF"]
["RUAZO"]
["RUB2L"]
["RUBEL"]
["RUBEM"]
["RUBER"]
["RUBGV"]
["RUBKH"]
["RUBKN"]
["RUBKT"]
["RUBLK"]
["RUBLN"]
["RUBLT"]
["RUBNK"]
["RUBOR"]
["RUBOS"]
["RUBRK"]
["RUBVV"]
["RUCEE"]
["RUCHA"]
["RUCHB"]
["RUCHM"]
["RUCHU"]
["RUCIH"]
["RUCPC"]
["RUDBK"]
["RUDEE"]
["RUDHA"]
["RUDKA"]
["RUDUB"]
["RUDUD"]
["RUDYR"]
["RUEGV"]
["RUEKO"]
["RUFIP"]
["RUFPT"]
["RUGOJ"]
["RUGRH"]
["RUGSA"]
["RUGVY"]
["RUHZO"]
["RUIAA"]
["RUIAR"]
["RUIDG"]
["RUIKS"]
["RUIOK"]
["RUIOY"]
["RUIVO"]
["RUKAN"]
["RUKAS"]
["RUKDN"]
["RUKDT"]
["RUKEM"]
["RUKER"]
["RUKGD"]
["RUKHO"]
["RUKHV"]
["RUKIK"]
["RUKIM"]
["RUKIN"]
["RUKIY"]
["RUKJA"]
["RUKLK"]
["RUKLR"]
["RUKLT"]
["RUKLY"]
["RUKMA"]
["RUKMM"]
["RUKMU"]
["RUKMV"]
["RUKNL"]
["RUKNV"]
["RUKNY"]
["RUKOK"]
["RUKOR"]
["RUKOT"]
["RUKPA"]
["RUKRA"]
["RUKRF"]
["RUKRI"]
["RUKRR"]
["RUKRY"]
["RUKSA"]
["RUKSI"]
["RUKSL"]
["RUKSO"]
["RUKTY"]
["RUKUB"]
["RUKUF"]
["RUKUR"]
["RUKVO"]
["RUKYB"]
["RUKYI"]
["RUKYK"]
["RUKZH"]
["RUKZM"]
["RUKZP"]
["RULAZ"]
["RULBU"]
["RULDY"]
["RULED"]
["RULEO"]
["RULES"]
["RULEU"]
["RULNK"]
["RULNR"]
["RULUG"]
["RULVR"]
["RUMA2"]
["RUMAG"]
["RUMAS"]
["RUMCX"]
["RUMDY"]
["RUMEG"]
["RUMEZ"]
["RUMGO"]
["RUMKR"]
["RUMMK"]
["RUMOG"]
["RUMON"]
["RUMOW"]
["RUMSH"]
["RUMVO"]
["RUNAC"]
["RUNAR"]
["RUNDK"]
["RUNEV"]
["RUNIA"]
["RUNJC"]
["RUNJK"]
["RUNLK"]
["RUNMK"]
["RUNNM"]
["RUNOG"]
["RUNPE"]
["RUNVS"]
["RUNYP"]
["RUOHO"]
["RUOKA"]
["RUOKT"]
["RUOKZ"]
["RUOLB"]
["RUOLG"]
["RUOLO"]
["RUOLP"]
["RUOMK"]
["RUONG"]
["RUOYA"]
["RUOYE"]
["RUOZE"]
["RUOZK"]
["RUOZY"]
["RUPCE"]
["RUPEK"]
["RUPES"]
["RUPEX"]
["RUPGE"]
["RUPGN"]
["RUPHS"]
["RUPKC"]
["RUPNV"]
["RUPNY"]
["RUPOK"]
["RUPRI"]
["RUPRN"]
["RUPRY"]
["RUPSE"]
["RUPTN"]
["RUPTP"]
["RUPUD"]
["RUPVS"]
["RUPWE"]
["RUPYO"]
["RURDP"]
["RURND"]
["RUROV"]
["RURTW"]
["RURUB"]
["RURYB"]
["RURYK"]
["RURZV"]
["RUSAB"]
["RUSAK"]
["RUSEG"]
["RUSEW"]
["RUSHA"]
["RUSIZ"]
["RUSKA"]
["RUSLH"]
["RUSLK"]
["RUSNG"]
["RUSOG"]
["RUSPA"]
["RUSRM"]
["RUSSK"]
["RUSTR"]
["RUSTY"]
["RUSVE"]
["RUSVK"]
["RUSYZ"]
["RUSZZ"]
["RUTAG"]
["RUTAM"]
["RUTAU"]
["RUTAY"]
["RUTAZ"]
["RUTDO"]
["RUTMR"]
["RUTOI"]
["RUTRR"]
["RUTTI"]
["RUTUA"]
["RUTVK"]
["RUUCH"]
["RUUEL"]
["RUUGC"]
["RUUGL"]
["RUUKK"]
["RUULU"]
["RUUMB"]
["RUURA"]
["RUVAR"]
["RUVAY"]
["RUVIT"]
["RUVKR"]
["RUVLG"]
["RUVMS"]
["RUVNN"]
["RUVNY"]
["RUVOG"]
["RUVTM"]
["RUVTZ"]
["RUVVO"]
["RUVYE"]
["RUVYG"]
["RUVYK"]
["RUVYP"]
["RUVYS"]
["RUVZB"]
["RUVZH"]
["RUXC2"]
["RUYAB"]
["RUYAM"]
["RUYEY"]
["RUYTS"]
["RUZAO"]
["RUZAR"]
["RUZCA"]
["RUZDK"]
["RUZEM"]
["RWNSA"]
["RWRUB"]
["RWRW4"]
["SA888"]
["SAAHA"]
["SAALK"]
["SAAMU"]
["SAAQK"]
["SABUR"]
["SADHA"]
["SADHU"]
["SADMM"]
["SAEJH"]
["SAGIZ"]
["SAJBI"]
["SAJEC"]
["SAJED"]
["SAJUB"]
["SAJUT"]
["SAKAC"]
["SAKHU"]
["SALIT"]
["SAMAK"]
["SAMAN"]
["SAMUF"]
["SAQAH"]
["SAQAL"]
["SAQUN"]
["SAQUR"]
["SARAB"]
["SARAM"]
["SARAR"]
["SARAZ"]
["SARTA"]
["SASUH"]
["SAVLA"]
["SAYBI"]
["SAYNB"]
["SAZUY"]
["SB888"]
["SBAKS"]
["SBALB"]
["SBAOB"]
["SBCHY"]
["SBGZO"]
["SBHIR"]
["SBIRA"]
["SBLEV"]
["SBLOF"]
["SBNEM"]
["SBNOR"]
["SBRIN"]
["SBRUS"]
["SBSCZ"]
["SBSHH"]
["SBTLG"]
["SBVIU"]
["SBXYA"]
["SC888"]
["SCMAW"]
["SCPOV"]
["SCVIC"]
["SD888"]
["SDMBH"]
["SDPZU"]
["SDSWA"]
["SE001"]
["SE002"]
["SE003"]
["SE004"]
["SE005"]
["SE006"]
["SE007"]
["SE008"]
["SE009"]
["SE010"]
["SE011"]
["SE012"]
["SE013"]
["SE014"]
["SE017"]
["SE020"]
["SE023"]
["SE026"]
["SE027"]
["SE028"]
["SE029"]
["SE030"]
["SE031"]
["SE032"]
["SE033"]
["SE034"]
["SE035"]
["SE036"]
["SE037"]
["SE038"]
["SE039"]
["SE040"]
["SE041"]
["SE042"]
["SE043"]
["SE044"]
["SE046"]
["SE047"]
["SE048"]
["SE049"]
["SE050"]
["SE051"]
["SE052"]
["SE053"]
["SE054"]
["SE055"]
["SE056"]
["SE057"]
["SE058"]
["SE059"]
["SE060"]
["SE061"]
["SE062"]
["SE063"]
["SE064"]
["SE065"]
["SE066"]
["SE067"]
["SE068"]
["SE069"]
["SE070"]
["SE071"]
["SE072"]
["SE073"]
["SE074"]
["SE075"]
["SE076"]
["SE077"]
["SE078"]
["SE079"]
["SE080"]
["SE081"]
["SE082"]
["SE083"]
["SE084"]
["SE085"]
["SE086"]
["SE087"]
["SE088"]
["SE089"]
["SE090"]
["SE091"]
["SE092"]
["SE093"]
["SE094"]
["SE095"]
["SE096"]
["SE097"]
["SE098"]
["SE099"]
["SE100"]
["SE101"]
["SE102"]
["SE103"]
["SE104"]
["SE105"]
["SE108"]
["SE109"]
["SE110"]
["SE111"]
["SE112"]
["SE577"]
["SE888"]
["SE88P"]
["SE88R"]
["SE999"]
["SEAAR"]
["SEADG"]
["SEAGB"]
["SEAGE"]
["SEAGN"]
["SEAHU"]
["SEALA"]
["SEALF"]
["SEALN"]
["SEAMA"]
["SEANK"]
["SEANN"]
["SEARA"]
["SEARB"]
["SEARK"]
["SEARV"]
["SEASD"]
["SEASU"]
["SEBAA"]
["SEBAC"]
["SEBAS"]
["SEBAT"]
["SEBBH"]
["SEBDQ"]
["SEBEA"]
["SEBER"]
["SEBGA"]
["SEBJR"]
["SEBLA"]
["SEBLD"]
["SEBMN"]
["SEBOG"]
["SEBOH"]
["SEBOL"]
["SEBOM"]
["SEBRE"]
["SEBRO"]
["SEBRT"]
["SEBRU"]
["SEBTF"]
["SEBUR"]
["SEBUV"]
["SEBVK"]
["SEBYX"]
["SEDEG"]
["SEDJN"]
["SEDJP"]
["SEDJU"]
["SEDLA"]
["SEDOM"]
["SEDON"]
["SEDRT"]
["SEDYN"]
["SEELL"]
["SEELO"]
["SEENK"]
["SEESS"]
["SEFAG"]
["SEFAK"]
["SEFAR"]
["SEFBK"]
["SEFIG"]
["SEFIL"]
["SEFIS"]
["SEFJA"]
["SEFKG"]
["SEFLI"]
["SEFOR"]
["SEFRA"]
["SEFSB"]
["SEFSD"]
["SEGAM"]
["SEGKS"]
["SEGKV"]
["SEGLM"]
["SEGMS"]
["SEGNR"]
["SEGOA"]
["SEGOR"]
["SEGOT"]
["SEGRD"]
["SEGRE"]
["SEGRH"]
["SEGRU"]
["SEGUB"]
["SEGUN"]
["SEGUS"]
["SEGVN"]
["SEGVX"]
["SEHAA"]
["SEHAC"]
["SEHAD"]
["SEHAH"]
["SEHAK"]
["SEHAN"]
["SEHAS"]
["SEHBG"]
["SEHBV"]
["SEHEL"]
["SEHER"]
["SEHGS"]
["SEHLD"]
["SEHLS"]
["SEHMR"]
["SEHNB"]
["SEHND"]
["SEHNF"]
["SEHOG"]
["SEHON"]
["SEHSG"]
["SEHST"]
["SEHUN"]
["SEHUS"]
["SEHUV"]
["SEHYP"]
["SEIGG"]
["SEJAR"]
["SEJAT"]
["SEJKG"]
["SEJNA"]
["SEJOH"]
["SEKAA"]
["SEKAF"]
["SEKAG"]
["SEKAK"]
["SEKAL"]
["SEKAN"]
["SEKAS"]
["SEKAT"]
["SEKAX"]
["SEKBG"]
["SEKBK"]
["SEKBV"]
["SEKGG"]
["SEKGM"]
["SEKGR"]
["SEKHN"]
["SEKID"]
["SEKKS"]
["SEKLA"]
["SEKLD"]
["SEKLI"]
["SEKLR"]
["SEKMH"]
["SEKOG"]
["SEKOS"]
["SEKPH"]
["SEKPS"]
["SEKRF"]
["SEKRH"]
["SEKRO"]
["SEKSD"]
["SEKUA"]
["SEKUB"]
["SEKUN"]
["SEKUV"]
["SEKVA"]
["SEKVH"]
["SEKVK"]
["SEKXV"]
["SEKYR"]
["SELAA"]
["SELAV"]
["SELDK"]
["SELDO"]
["SELED"]
["SELIM"]
["SELIO"]
["SELIS"]
["SELJP"]
["SELJU"]
["SELLA"]
["SELOD"]
["SELOM"]
["SELOT"]
["SELOU"]
["SELSG"]
["SELUG"]
["SELUN"]
["SELVR"]
["SELYS"]
["SEMAD"]
["SEMAN"]
["SEMAR"]
["SEMAV"]
["SEMDM"]
["SEMEM"]
["SEMLE"]
["SEMLO"]
["SEMMA"]
["SEMON"]
["SEMOO"]
["SEMOR"]
["SEMRF"]
["SEMSD"]
["SEMSK"]
["SEMUN"]
["SEMVN"]
["SENAS"]
["SENAV"]
["SENHN"]
["SENJA"]
["SENOE"]
["SENOG"]
["SENOL"]
["SENOR"]
["SENOT"]
["SENRK"]
["SENRR"]
["SENST"]
["SENYN"]
["SENYO"]
["SEOAX"]
["SEOBB"]
["SEOCO"]
["SEOEN"]
["SEOER"]
["SEOGR"]
["SEORT"]
["SEORV"]
["SEOSB"]
["SEOSK"]
["SEOST"]
["SEOTT"]
["SEOXE"]
["SEPAS"]
["SEPHM"]
["SEPIT"]
["SERAA"]
["SERAM"]
["SERBY"]
["SERIN"]
["SERNB"]
["SERNG"]
["SERNH"]
["SEROR"]
["SEROV"]
["SERUV"]
["SESAE"]
["SESAF"]
["SESAK"]
["SESAN"]
["SESBB"]
["SESBN"]
["SESDH"]
["SESDK"]
["SESDL"]
["SESDS"]
["SESEA"]
["SESES"]
["SESFT"]
["SESGM"]
["SESGT"]
["SESIK"]
["SESIM"]
["SESIR"]
["SESKB"]
["SESKE"]
["SESKL"]
["SESKM"]
["SESKN"]
["SESKO"]
["SESKR"]
["SESKT"]
["SESLI"]
["SESMA"]
["SESMD"]
["SESMN"]
["SESMO"]
["SESMS"]
["SESND"]
["SESNR"]
["SESOE"]
["SESOG"]
["SESOL"]
["SESOO"]
["SESOR"]
["SESPP"]
["SESPR"]
["SESSR"]
["SESTA"]
["SESTD"]
["SESTE"]
["SESTG"]
["SESTJ"]
["SESTK"]
["SESTL"]
["SESTO"]
["SESTQ"]
["SESTR"]
["SESTU"]
["SESTV"]
["SESUD"]
["SESUG"]
["SESUN"]
["SESUR"]
["SESUS"]
["SESVK"]
["SESVX"]
["SETHN"]
["SETOA"]
["SETOE"]
["SETOV"]
["SETRG"]
["SETSL"]
["SETTD"]
["SETUN"]
["SEUDD"]
["SEUGN"]
["SEUKN"]
["SEULF"]
["SEUME"]
["SEUND"]
["SEUPP"]
["SEURS"]
["SEUTA"]
["SEVAA"]
["SEVAG"]
["SEVAJ"]
["SEVAK"]
["SEVAL"]
["SEVAN"]
["SEVBY"]
["SEVER"]
["SEVGN"]
["SEVGO"]
["SEVIV"]
["SEVRB"]
["SEVST"]
["SEVVK"]
["SEVXH"]
["SEWAL"]
["SEYST"]
["SG888"]
["SGAYC"]
["SGBKM"]
["SGCHG"]
["SGJUR"]
["SGKEP"]
["SGPAP"]
["SGPPT"]
["SGPUB"]
["SGSCT"]
["SGSEB"]
["SGSEM"]
["SGSIN"]
["SGSLT"]
["SGTAY"]
["SGTPG"]
["SGTPN"]
["SGTUA"]
["SH888"]
["SHASC"]
["SHASI"]
["SHRPT"]
["SHSHN"]
["SHTDC"]
["SI888"]
["SI88P"]
["SI88R"]
["SIDBO"]
["SIIZO"]
["SIJAR"]
["SIJCE"]
["SIKOP"]
["SILU6"]
["SIPIR"]
["SIPOW"]
["SIROG"]
["SIS8L"]
["SISEC"]
["SISLV"]
["SISML"]
["SITOL"]
["SIVB9"]
["SIVOJ"]
["SIVRA"]
["SIVUH"]
["SIXZA"]
["SIZ35"]
["SIZ42"]
["SIZ95"]
["SIZAB"]
["SIZAG"]
["SIZAV"]
["SIZBU"]
["SIZDO"]
["SIZET"]
["SIZGB"]
["SIZGK"]
["SIZGL"]
["SIZGP"]
["SIZGV"]
["SIZID"]
["SIZIR"]
["SIZUZ"]
["SJ888"]
["SJBAR"]
["SJBJO"]
["SJHIN"]
["SJHOP"]
["SJJAM"]
["SJLYR"]
["SJMAG"]
["SJNYA"]
["SJPYR"]
["SJSVE"]
["SJZAB"]
["SJZBI"]
["SJZBJ"]
["SJZEB"]
["SJZFI"]
["SJZFS"]
["SJZFV"]
["SJZFY"]
["SJZHN"]
["SJZHO"]
["SJZKL"]
["SJZKV"]
["SJZLH"]
["SJZLI"]
["SJZMO"]
["SJZPB"]
["SJZRA"]
["SJZRE"]
["SJZRI"]
["SJZSF"]
["SJZSM"]
["SJZSV"]
["SJZTE"]
["SJZTR"]
["SJZVA"]
["SJZVL"]
["SJZVR"]
["SJZWF"]
["SJZYM"]
["SKBAB"]
["SKBCK"]
["SKDF4"]
["SKDVO"]
["SKDXZ"]
["SKFD3"]
["SKGLT"]
["SKHIL"]
["SKK87"]
["SKKAO"]
["SKKNP"]
["SKKVE"]
["SKMAT"]
["SKMOD"]
["SKPLB"]
["SKPOP"]
["SKSLK"]
["SKTBE"]
["SKTEP"]
["SKTLM"]
["SKTNA"]
["SKTUT"]
["SKVZK"]
["SKXCV"]
["SKXXX"]
["SKZIA"]
["SL888"]
["SLBTE"]
["SLFNA"]
["SLKSY"]
["SLNIT"]
["SLPEP"]
["SLSBO"]
["SM888"]
["SMAQ8"]
["SN888"]
["SNDKR"]
["SNFOU"]
["SNKLC"]
["SNLYN"]
["SNMBA"]
["SNXLS"]
["SNZIG"]
["SO888"]
["SOBBO"]
["SOELM"]
["SOGHR"]
["SOKMU"]
["SOMER"]
["SOMGQ"]
["SR888"]
["SRABN"]
["SRAGI"]
["SRICK"]
["SRLLW"]
["SRMOJ"]
["SRPBM"]
["SRPRM"]
["SRSMA"]
["ST888"]
["STPCP"]
["STSAA"]
["STTMS"]
["SV888"]
["SVAPO"]
["SVAQJ"]
["SVBEL"]
["SVLLD"]
["SVLUN"]
["SVMAN"]
["SVMIR"]
["SVNCU"]
["SVNHZ"]
["SVSAL"]
["SVSSO"]
["SVTUE"]
["SX888"]
["SXGES"]
["SXMAR"]
["SXPHI"]
["SXSXM"]
["SY888"]
["SYALD"]
["SYARW"]
["SYBAN"]
["SYBEN"]
["SYDAM"]
["SYLTK"]
["SYTAO"]
["SYTTS"]
["SZ7DS"]
["SZMAL"]
["SZNHL"]
["TC888"]
["TC9CB"]
["TCGDT"]
["TCNCA"]
["TCPLS"]
["TCSLX"]
["TCXSC"]
["TF888"]
["TFPFR"]
["TG888"]
["TGANE"]
["TGKPE"]
["TGLFW"]
["TH888"]
["THBAI"]
["THBEN"]
["THBKK"]
["THBMT"]
["THBND"]
["THBNG"]
["THBNK"]
["THBNL"]
["THBPG"]
["THBPK"]
["THBSP"]
["THBTC"]
["THBTP"]
["THCHA"]
["THCHS"]
["THCHU"]
["THECT"]
["THERA"]
["THHOP"]
["THI6C"]
["THKAN"]
["THKHA"]
["THKLA"]
["THKLY"]
["THKNO"]
["THKPT"]
["THKRU"]
["THKRV"]
["THKSI"]
["THKSM"]
["THKYO"]
["THLAS"]
["THLCH"]
["THMAT"]
["THMEK"]
["THNHP"]
["THNIM"]
["THNKT"]
["THNRW"]
["THPHA"]
["THPKB"]
["THPKN"]
["THPKP"]
["THPKT"]
["THPLA"]
["THPPA"]
["THPPC"]
["THPTN"]
["THPTR"]
["THPYT"]
["THRNN"]
["THRVT"]
["THSAT"]
["THSBP"]
["THSCS"]
["THSGK"]
["THSHT"]
["THSIC"]
["THSRI"]
["THSSW"]
["THSTH"]
["THTAB"]
["THTAC"]
["THTHA"]
["THTPP"]
["THTRG"]
["THTTE"]
["THUCT"]
["TK888"]
["TKAFU"]
["TKFKO"]
["TKNKU"]
["TL888"]
["TLDIL"]
["TLLIB"]
["TLMDV"]
["TM888"]
["TMALT"]
["TMCHE"]
["TMHAL"]
["TMKRA"]
["TMKRW"]
["TMTMZ"]
["TN888"]
["TNARI"]
["TNASH"]
["TNBIZ"]
["TNBJC"]
["TNCHB"]
["TNDID"]
["TNDJE"]
["TNGAE"]
["TNHMM"]
["TNISI"]
["TNJAR"]
["TNKEB"]
["TNKEM"]
["TNLGN"]
["TNLSK"]
["TNMAD"]
["TNMBA"]
["TNMIR"]
["TNOUD"]
["TNRDS"]
["TNSFA"]
["TNSLN"]
["TNSUS"]
["TNTAT"]
["TNTUN"]
["TNTZE"]
["TNZRZ"]
["TO888"]
["TOHPA"]
["TONEI"]
["TOPAN"]
["TOTBU"]
["TR888"]
["TR88P"]
["TR88R"]
["TR9AK"]
["TRADA"]
["TRADY"]
["TRAKB"]
["TRAKC"]
["TRAKD"]
["TRAKY"]
["TRALA"]
["TRALI"]
["TRAMA"]
["TRAMR"]
["TRANA"]
["TRAUT"]
["TRAYA"]
["TRAYD"]
["TRAYT"]
["TRAYV"]
["TRBBI"]
["TRBBP"]
["TRBDM"]
["TRBEY"]
["TRBHN"]
["TRBOG"]
["TRBOL"]
["TRBOT"]
["TRBRS"]
["TRBTN"]
["TRBTS"]
["TRBUY"]
["TRBXN"]
["TRBZB"]
["TRBZC"]
["TRBZI"]
["TRCAM"]
["TRCES"]
["TRCEY"]
["TRCID"]
["TRCKZ"]
["TRCUB"]
["TRDAR"]
["TRDAT"]
["TRDIK"]
["TRDIL"]
["TRDRC"]
["TRDYL"]
["TREDI"]
["TREDO"]
["TRENE"]
["TRERE"]
["TRERK"]
["TREYP"]
["TRFAS"]
["TRFET"]
["TRFIN"]
["TRFOC"]
["TRFRZ"]
["TRGCA"]
["TRGCK"]
["TRGEB"]
["TRGEL"]
["TRGEM"]
["TRGIR"]
["TRGKV"]
["TRGOR"]
["TRGTA"]
["TRGUL"]
["TRGZE"]
["TRHAR"]
["TRHAS"]
["TRHAY"]
["TRHER"]
["TRHIS"]
["TRHOP"]
["TRIDM"]
["TRIDS"]
["TRIGN"]
["TRINE"]
["TRISK"]
["TRIST"]
["TRIZM"]
["TRIZT"]
["TRKAR"]
["TRKAS"]
["TRKBS"]
["TRKBY"]
["TRKFK"]
["TRKFZ"]
["TRKKY"]
["TRKMR"]
["TRKMX"]
["TRKN2"]
["TRKOC"]
["TRKPE"]
["TRKRB"]
["TRKRS"]
["TRKRT"]
["TRKSP"]
["TRKUS"]
["TRLMA"]
["TRM47"]
["TRMAD"]
["TRMAL"]
["TRMER"]
["TRMFZ"]
["TRMIM"]
["TRMPT"]
["TRMRA"]
["TRMRM"]
["TRMUD"]
["TRMVG"]
["TRNEM"]
["TRODU"]
["TRORD"]
["TRPEN"]
["TRPLP"]
["TRPZR"]
["TRRIZ"]
["TRRZY"]
["TRSER"]
["TRSIC"]
["TRSIL"]
["TRSLE"]
["TRSRL"]
["TRSRS"]
["TRSSX"]
["TRSUR"]
["TRSUT"]
["TRTAS"]
["TRTEK"]
["TRTGT"]
["TRTIR"]
["TRTUR"]
["TRTUT"]
["TRTUZ"]
["TRTZX"]
["TRUNY"]
["TRURL"]
["TRUSK"]
["TRVAK"]
["TRYAL"]
["TRYAR"]
["TRYIK"]
["TRYPO"]
["TRZEY"]
["TRZON"]
["TT888"]
["TTCHA"]
["TTCHV"]
["TTCLA"]
["TTCRN"]
["TTCVA"]
["TTFPT"]
["TTGUA"]
["TTLAB"]
["TTPLY"]
["TTPOS"]
["TTPTF"]
["TTPTG"]
["TTPTP"]
["TTPTS"]
["TTSCA"]
["TTSFE"]
["TTTEM"]
["TV888"]
["TVFUN"]
["TW888"]
["TWAPG"]
["TWBAL"]
["TWBDA"]
["TWHOP"]
["TWHTC"]
["TWHUK"]
["TWHUN"]
["TWKEL"]
["TWKHH"]
["TWLGM"]
["TWMAL"]
["TWMLI"]
["TWMZG"]
["TWNAN"]
["TWSHL"]
["TWSUO"]
["TWTNN"]
["TWTPE"]
["TWTTT"]
["TWTXG"]
["TWTYN"]
["TWWTU"]
["TWYGE"]
["TWYLN"]
["TZ888"]
["TZDAR"]
["TZIKW"]
["TZKAG"]
["TZKIK"]
["TZKIM"]
["TZLDI"]
["TZMIC"]
["TZMIK"]
["TZMKO"]
["TZMOH"]
["TZMTS"]
["TZMWZ"]
["TZMYW"]
["TZPAN"]
["TZPMA"]
["TZRIJ"]
["TZSAM"]
["TZTGT"]
["TZTKQ"]
["TZZNZ"]
["UA888"]
["UABGD"]
["UADSK"]
["UAERD"]
["UAILK"]
["UAIZM"]
["UAKEH"]
["UAKHE"]
["UAKIA"]
["UAMPW"]
["UANLV"]
["UAOCT"]
["UAODS"]
["UARNI"]
["UASKD"]
["UAUDY"]
["UAVYL"]
["UAYUZ"]
["UAZPR"]
["UGJIN"]
["UGMKN"]
["UGYMB"]
["UM888"]
["UMAWK"]
["UMJON"]
["UMMDY"]
["US2BY"]
["US2OG"]
["US2PA"]
["US2SI"]
["US2TO"]
["US2TT"]
["US3BR"]
["US3DC"]
["US3DU"]
["US3DV"]
["US3OL"]
["US3SD"]
["US3TR"]
["US3TU"]
["US3VC"]
["US3WA"]
["US4CP"]
["US4HE"]
["US4NJ"]
["US4NM"]
["US4TP"]
["US4WR"]
["US5BL"]
["US5MN"]
["US6ER"]
["US6TT"]
["US7AL"]
["US7BA"]
["US7CA"]
["US7OL"]
["US7SD"]
["US7YT"]
["US888"]
["US8DC"]
["US8DD"]
["US8MN"]
["US8PR"]
["US8QA"]
["US8TT"]
["US8UY"]
["US8XC"]
["US8XD"]
["US8YI"]
["US999"]
["US99W"]
["US9AI"]
["US9CP"]
["US9DK"]
["US9IU"]
["US9OH"]
["US9QA"]
["US9WA"]
["USA22"]
["USA8C"]
["USAA2"]
["USAA9"]
["USAAF"]
["USAB3"]
["USABC"]
["USACC"]
["USACJ"]
["USACQ"]
["USAEK"]
["USAEO"]
["USAEZ"]
["USAF5"]
["USAFA"]
["USAFH"]
["USAFK"]
["USAFM"]
["USAFV"]
["USAFW"]
["USAGQ"]
["USAGV"]
["USAHU"]
["USAHZ"]
["USAKJ"]
["USAL3"]
["USAL5"]
["USAL7"]
["USALB"]
["USALC"]
["USAMF"]
["USAMG"]
["USANC"]
["USANP"]
["USANW"]
["USAOU"]
["USAPY"]
["USAQJ"]
["USAQQ"]
["USAQW"]
["USAR5"]
["USARB"]
["USASF"]
["USASS"]
["USAST"]
["USASX"]
["USASZ"]
["USATR"]
["USATW"]
["USATX"]
["USAV9"]
["USAVD"]
["USAWS"]
["USAWY"]
["USAXR"]
["USAXZ"]
["USAY5"]
["USAY7"]
["USAZL"]
["USB27"]
["USB2N"]
["USB2V"]
["USB44"]
["USB7S"]
["USBA3"]
["USBA7"]
["USBAL"]
["USBAY"]
["USBB8"]
["USBBA"]
["USBCG"]
["USBCH"]
["USBCI"]
["USBCL"]
["USBCM"]
["USBCW"]
["USBD3"]
["USBDB"]
["USBDE"]
["USBDR"]
["USBDS"]
["USBE8"]
["USBEL"]
["USBEX"]
["USBF6"]
["USBFJ"]
["USBFO"]
["USBFY"]
["USBG7"]
["USBGR"]
["USBHB"]
["USBHC"]
["USBHF"]
["USBHI"]
["USBHJ"]
["USBI2"]
["USBI8"]
["USBKO"]
["USBKQ"]
["USBLI"]
["USBM3"]
["USBM4"]
["USBMH"]
["USBN9"]
["USBNA"]
["USBNB"]
["USBNC"]
["USBNH"]
["USBNI"]
["USBNP"]
["USBOC"]
["USBOS"]
["USBOY"]
["USBPT"]
["USBPV"]
["USBRA"]
["USBRO"]
["USBS9"]
["USBSM"]
["USBTH"]
["USBTR"]
["USBTV"]
["USBU2"]
["USBUF"]
["USBUI"]
["USBUJ"]
["USBUP"]
["USBV6"]
["USBV8"]
["USBVV"]
["USBW5"]
["USBWB"]
["USBWH"]
["USBYZ"]
["USBZJ"]
["USBZZ"]
["USC25"]
["USC35"]
["USC3A"]
["USC3B"]
["USC4H"]
["USC4N"]
["USC55"]
["USC74"]
["USC8T"]
["USCA3"]
["USCAP"]
["USCBD"]
["USCBS"]
["USCBT"]
["USCC2"]
["USCC8"]
["USCCJ"]
["USCCS"]
["USCCT"]
["USCD4"]
["USCDD"]
["USCDE"]
["USCDF"]
["USCDU"]
["USCDV"]
["USCDY"]
["USCDZ"]
["USCEC"]
["USCFF"]
["USCFG"]
["USCG4"]
["USCGE"]
["USCGF"]
["USCGJ"]
["USCGP"]
["USCGW"]
["USCGX"]
["USCHI"]
["USCHS"]
["USCHT"]
["USCI6"]
["USCIB"]
["USCJ8"]
["USCJC"]
["USCJO"]
["USCK2"]
["USCK9"]
["USCKG"]
["USCKI"]
["USCLA"]
["USCLE"]
["USCLM"]
["USCLQ"]
["USCLY"]
["USCM9"]
["USCMU"]
["USCN3"]
["USCNM"]
["USCO3"]
["USCO9"]
["USCOB"]
["USCOJ"]
["USCP6"]
["USCPT"]
["USCR5"]
["USCRB"]
["USCRM"]
["USCRP"]
["USCRW"]
["USCS4"]
["USCS6"]
["USCSF"]
["USCSJ"]
["USCU2"]
["USCU6"]
["USCUM"]
["USCUQ"]
["USCUU"]
["USCUZ"]
["USCVG"]
["USCVI"]
["USCWF"]
["USCWQ"]
["USCWU"]
["USCWW"]
["USCWX"]
["USCWZ"]
["USCXV"]
["USCY2"]
["USCYI"]
["USCZI"]
["USD5W"]
["USDA8"]
["USDAV"]
["USDBQ"]
["USDC6"]
["USDCB"]
["USDCI"]
["USDCY"]
["USDD6"]
["USDDR"]
["USDE3"]
["USDE5"]
["USDEC"]
["USDET"]
["USDFU"]
["USDGE"]
["USDHA"]
["USDHB"]
["USDIA"]
["USDIJ"]
["USDIV"]
["USDKH"]
["USDKK"]
["USDLH"]
["USDM4"]
["USDN2"]
["USDNE"]
["USDOG"]
["USDP5"]
["USDPH"]
["USDR3"]
["USDRW"]
["USDSH"]
["USDSL"]
["USDSM"]
["USDSR"]
["USDST"]
["USDT4"]
["USDTC"]
["USDTP"]
["USDTT"]
["USDU3"]
["USDU5"]
["USDUH"]
["USDUP"]
["USDUT"]
["USDVA"]
["USDVN"]
["USDVQ"]
["USDVT"]
["USDVV"]
["USDWD"]
["USDWQ"]
["USDWX"]
["USDXX"]
["USDY2"]
["USDZM"]
["USE2D"]
["USE2L"]
["USE2T"]
["USE3K"]
["USE5P"]
["USEAZ"]
["USEB4"]
["USEBZ"]
["USECH"]
["USECP"]
["USECR"]
["USEDL"]
["USEDV"]
["USEE8"]
["USEFN"]
["USEFS"]
["USEGH"]
["USEHI"]
["USEHL"]
["USEIE"]
["USEIF"]
["USEJK"]
["USEKA"]
["USEKB"]
["USEKI"]
["USEKT"]
["USEKZ"]
["USEL3"]
["USEL4"]
["USELS"]
["USEM4"]
["USEM7"]
["USEMG"]
["USEMY"]
["USEN5"]
["USENW"]
["USEOG"]
["USEOM"]
["USEOW"]
["USEOY"]
["USEPA"]
["USEPE"]
["USEPM"]
["USEPY"]
["USEQ4"]
["USEQE"]
["USEQW"]
["USEQZ"]
["USER2"]
["USERE"]
["USERI"]
["USERN"]
["USERY"]
["USESC"]
["USESG"]
["USETI"]
["USETT"]
["USETW"]
["USEU3"]
["USEUD"]
["USEUU"]
["USEV6"]
["USEV7"]
["USEVV"]
["USEWB"]
["USEWG"]
["USEWO"]
["USEWR"]
["USEYW"]
["USF2S"]
["USFA2"]
["USFA3"]
["USFAH"]
["USFAI"]
["USFAU"]
["USFAV"]
["USFBF"]
["USFCC"]
["USFCV"]
["USFDE"]
["USFDF"]
["USFEB"]
["USFEL"]
["USFFO"]
["USFGQ"]
["USFGX"]
["USFH2"]
["USFI3"]
["USFI7"]
["USFIK"]
["USFJY"]
["USFL8"]
["USFLL"]
["USFLZ"]
["USFMU"]
["USFMW"]
["USFNB"]
["USFNE"]
["USFNF"]
["USFO9"]
["USFOB"]
["USFOC"]
["USFPL"]
["USFPO"]
["USFPR"]
["USFPT"]
["USFR6"]
["USFSP"]
["USFSQ"]
["USFSY"]
["USFTA"]
["USFTC"]
["USFTM"]
["USFU7"]
["USFVP"]
["USFVR"]
["USFW2"]
["USFWZ"]
["USFZZ"]
["USG2H"]
["USG44"]
["USG77"]
["USG8Y"]
["USGA7"]
["USGAJ"]
["USGBC"]
["USGBV"]
["USGCA"]
["USGCL"]
["USGDJ"]
["USGDR"]
["USGEB"]
["USGEZ"]
["USGG2"]
["USGGE"]
["USGHC"]
["USGHE"]
["USGHN"]
["USGID"]
["USGJQ"]
["USGKX"]
["USGLA"]
["USGLC"]
["USGLH"]
["USGLO"]
["USGLS"]
["USGM2"]
["USGME"]
["USGNC"]
["USGNR"]
["USGNS"]
["USGOH"]
["USGON"]
["USGOP"]
["USGP2"]
["USGP4"]
["USGPT"]
["USGPW"]
["USGQJ"]
["USGQQ"]
["USGRA"]
["USGRB"]
["USGRR"]
["USGRY"]
["USGSF"]
["USGSQ"]
["USGT4"]
["USGT9"]
["USGTG"]
["USGUG"]
["USGUM"]
["USGVA"]
["USGVB"]
["USGVR"]
["USGVZ"]
["USGXH"]
["USGXR"]
["USGYY"]
["USGZB"]
["USGZI"]
["USH2N"]
["USH4H"]
["USH8N"]
["USH99"]
["USH9R"]
["USH9S"]
["USHA7"]
["USHAH"]
["USHB3"]
["USHB4"]
["USHBK"]
["USHCO"]
["USHEZ"]
["USHG2"]
["USHGU"]
["USHGW"]
["USHH7"]
["USHHK"]
["USHHT"]
["USHID"]
["USHIF"]
["USHJD"]
["USHJS"]
["USHKG"]
["USHL5"]
["USHLJ"]
["USHLM"]
["USHM3"]
["USHM4"]
["USHM7"]
["USHMR"]
["USHN9"]
["USHNL"]
["USHNS"]
["USHO7"]
["USHOM"]
["USHOR"]
["USHOU"]
["USHPY"]
["USHQ2"]
["USHQJ"]
["USHR3"]
["USHR4"]
["USHR5"]
["USHRM"]
["USHRQ"]
["USHS2"]
["USHS3"]
["USHS6"]
["USHSF"]
["USHU8"]
["USHV2"]
["USHVG"]
["USHVN"]
["USHWJ"]
["USHWN"]
["USHWX"]
["USHXD"]
["USHXF"]
["USHXG"]
["USHXK"]
["USHXU"]
["USHZA"]
["USHZZ"]
["USIA2"]
["USIA3"]
["USIAB"]
["USIAM"]
["USICH"]
["USIEG"]
["USIFL"]
["USIFT"]
["USIGS"]
["USIIM"]
["USIIW"]
["USIJM"]
["USILG"]
["USILM"]
["USILW"]
["USINL"]
["USINV"]
["USINX"]
["USIO2"]
["USIOA"]
["USIOH"]
["USIOR"]
["USIPR"]
["USIPX"]
["USIR2"]
["USIS3"]
["USITN"]
["USITO"]
["USITV"]
["USIUH"]
["USIUK"]
["USIVA"]
["USIVG"]
["USIVK"]
["USIWO"]
["USIYH"]
["USIZK"]
["USJ3C"]
["USJA2"]
["USJAM"]
["USJAX"]
["USJAY"]
["USJBG"]
["USJBK"]
["USJCQ"]
["USJDT"]
["USJE2"]
["USJE7"]
["USJEC"]
["USJFZ"]
["USJHO"]
["USJJQ"]
["USJKF"]
["USJMB"]
["USJMC"]
["USJMX"]
["USJNP"]
["USJNU"]
["USJO4"]
["USJOA"]
["USJON"]
["USJPY"]
["USJQJ"]
["USJQK"]
["USJQQ"]
["USJS3"]
["USJSA"]
["USJSY"]
["USJUK"]
["USJUY"]
["USJVL"]
["USJWQ"]
["USJWY"]
["USJYR"]
["USK99"]
["USKA7"]
["USKAB"]
["USKAG"]
["USKAJ"]
["USKAY"]
["USKCK"]
["USKDC"]
["USKE7"]
["USKGM"]
["USKHB"]
["USKHW"]
["USKIH"]
["USKIS"]
["USKJH"]
["USKKV"]
["USKL9"]
["USKLS"]
["USKMR"]
["USKPP"]
["USKQC"]
["USKSH"]
["USKTN"]
["USKTT"]
["USKTZ"]
["USKU4"]
["USKUB"]
["USKW2"]
["USKW7"]
["USKWM"]
["USKWU"]
["USKXK"]
["USKYP"]
["USL2D"]
["USL2P"]
["USL3Y"]
["USL54"]
["USL55"]
["USL5A"]
["USL99"]
["USL9G"]
["USL9K"]
["USLA2"]
["USLAT"]
["USLAX"]
["USLB2"]
["USLB9"]
["USLBQ"]
["USLC2"]
["USLCF"]
["USLCH"]
["USLCJ"]
["USLDK"]
["USLDM"]
["USLE3"]
["USLEQ"]
["USLG2"]
["USLGB"]
["USLGK"]
["USLGZ"]
["USLH7"]
["USLHK"]
["USLIB"]
["USLIZ"]
["USLLB"]
["USLLC"]
["USLLJ"]
["USLLM"]
["USLLU"]
["USLMY"]
["USLN5"]
["USLO7"]
["USLO8"]
["USLO9"]
["USLOG"]
["USLOR"]
["USLP2"]
["USLPQ"]
["USLR3"]
["USLRC"]
["USLRP"]
["USLS4"]
["USLTG"]
["USLTZ"]
["USLU7"]
["USLU8"]
["USLUF"]
["USLUI"]
["USLUU"]
["USLVU"]
["USLW5"]
["USLWD"]
["USLWE"]
["USLWM"]
["USLWY"]
["USLX8"]
["USLXQ"]
["USLXW"]
["USLYM"]
["USLYR"]
["USLZC"]
["USLZV"]
["USM2B"]
["USM2P"]
["USM2S"]
["USM44"]
["USM47"]
["USM4I"]
["USM4U"]
["USM4X"]
["USM5V"]
["USM8N"]
["USM9O"]
["USMAH"]
["USMCD"]
["USMCR"]
["USMD5"]
["USMEM"]
["USMES"]
["USMF6"]
["USMG5"]
["USMGF"]
["USMGQ"]
["USMH2"]
["USMH8"]
["USMI3"]
["USMIA"]
["USMKC"]
["USMKE"]
["USMKG"]
["USMKI"]
["USMKJ"]
["USMKW"]
["USMKZ"]
["USMN5"]
["USMNH"]
["USMOB"]
["USMP2"]
["USMP5"]
["USMP7"]
["USMPP"]
["USMR2"]
["USMRH"]
["USMRQ"]
["USMRT"]
["USMS6"]
["USMSY"]
["USMT5"]
["USMT6"]
["USMTK"]
["USMTM"]
["USMTW"]
["USMU4"]
["USMW3"]
["USMW4"]
["USMXP"]
["USMY3"]
["USMY6"]
["USMYC"]
["USMYG"]
["USN2R"]
["USN3E"]
["USN4B"]
["USN5B"]
["USN5T"]
["USN8P"]
["USN99"]
["USNAK"]
["USNAU"]
["USNB4"]
["USNBD"]
["USNBL"]
["USNCM"]
["USNCX"]
["USNCY"]
["USNDA"]
["USNDB"]
["USNE5"]
["USNED"]
["USNEJ"]
["USNEW"]
["USNFE"]
["USNFR"]
["USNGZ"]
["USNH2"]
["USNHM"]
["USNHN"]
["USNHQ"]
["USNI2"]
["USNIJ"]
["USNIX"]
["USNJF"]
["USNJQ"]
["USNK3"]
["USNKO"]
["USNLI"]
["USNM2"]
["USNMA"]
["USNMH"]
["USNNS"]
["USNOQ"]
["USNOW"]
["USNOZ"]
["USNP7"]
["USNPC"]
["USNPO"]
["USNPT"]
["USNPX"]
["USNQH"]
["USNQV"]
["USNQZ"]
["USNRP"]
["USNSB"]
["USNSC"]
["USNSV"]
["USNSX"]
["USNTD"]
["USNTR"]
["USNTS"]
["USNVA"]
["USNVV"]
["USNW2"]
["USNWZ"]
["USNXL"]
["USNXR"]
["USNXZ"]
["USNY5"]
["USNYC"]
["USNYI"]
["USNYU"]
["USNYX"]
["USNZQ"]
["USO82"]
["USOAK"]
["USOAM"]
["USOAX"]
["USOB2"]
["USOBC"]
["USOBI"]
["USOC7"]
["USOCP"]
["USOCX"]
["USODT"]
["USOEG"]
["USOEN"]
["USOFX"]
["USOGG"]
["USOGS"]
["USOGY"]
["USOI7"]
["USOIS"]
["USOIT"]
["USOJL"]
["USOK9"]
["USOKV"]
["USOKX"]
["USOL2"]
["USOLM"]
["USOLS"]
["USOMA"]
["USOMD"]
["USOME"]
["USOMM"]
["USOMU"]
["USOMW"]
["USONA"]
["USONG"]
["USOO9"]
["USOOM"]
["USOPB"]
["USOR8"]
["USORF"]
["USORH"]
["USOS3"]
["USOSM"]
["USOSV"]
["USOSW"]
["USOSZ"]
["USOT5"]
["USOTH"]
["USOTL"]
["USOTM"]
["USOV3"]
["USOW4"]
["USOWB"]
["USOXR"]
["USOYH"]
["USOYY"]
["USOZN"]
["USP2L"]
["USP3N"]
["USP43"]
["USP64"]
["USP77"]
["USP9O"]
["USPA2"]
["USPA9"]
["USPAA"]
["USPAE"]
["USPAH"]
["USPAL"]
["USPAS"]
["USPAU"]
["USPAY"]
["USPB4"]
["USPB7"]
["USPB9"]
["USPBE"]
["USPBI"]
["USPCP"]
["USPCV"]
["USPDI"]
["USPDX"]
["USPE2"]
["USPEA"]
["USPEB"]
["USPEF"]
["USPFN"]
["USPG8"]
["USPGE"]
["USPGH"]
["USPGL"]
["USPGQ"]
["USPGX"]
["USPGY"]
["USPGZ"]
["USPHL"]
["USPHN"]
["USPI7"]
["USPIE"]
["USPIS"]
["USPIT"]
["USPIW"]
["USPK3"]
["USPKT"]
["USPLL"]
["USPLP"]
["USPLU"]
["USPLV"]
["USPM3"]
["USPM4"]
["USPM8"]
["USPME"]
["USPMV"]
["USPMZ"]
["USPNJ"]
["USPNS"]
["USPO2"]
["USPO7"]
["USPO8"]
["USPOA"]
["USPOB"]
["USPOD"]
["USPOJ"]
["USPOW"]
["USPP3"]
["USPP4"]
["USPP5"]
["USPP9"]
["USPPS"]
["USPQM"]
["USPQN"]
["USPRS"]
["USPRY"]
["USPS3"]
["USPS6"]
["USPS9"]
["USPSJ"]
["USPSL"]
["USPSM"]
["USPT7"]
["USPTJ"]
["USPTM"]
["USPVC"]
["USPVD"]
["USPWG"]
["USPWM"]
["USPWQ"]
["USPWT"]
["USPXD"]
["USPY6"]
["USPYB"]
["USPZH"]
["USQAC"]
["USQAI"]
["USQAP"]
["USQCB"]
["USQCC"]
["USQCH"]
["USQCN"]
["USQCQ"]
["USQCZ"]
["USQDM"]
["USQDQ"]
["USQDU"]
["USQDV"]
["USQDY"]
["USQEB"]
["USQEI"]
["USQEO"]
["USQET"]
["USQEV"]
["USQEW"]
["USQEY"]
["USQFA"]
["USQFC"]
["USQFI"]
["USQFM"]
["USQFU"]
["USQFY"]
["USQGB"]
["USQGT"]
["USQGX"]
["USQHA"]
["USQHE"]
["USQHG"]
["USQHH"]
["USQHK"]
["USQHS"]
["USQHT"]
["USQIL"]
["USQIM"]
["USQIS"]
["USQJB"]
["USQJC"]
["USQJZ"]
["USQKC"]
["USQKK"]
["USQKM"]
["USQLF"]
["USQLH"]
["USQLI"]
["USQLO"]
["USQLR"]
["USQLT"]
["USQLY"]
["USQMC"]
["USQMK"]
["USQMM"]
["USQMU"]
["USQMW"]
["USQNE"]
["USQNM"]
["USQNN"]
["USQNV"]
["USQOA"]
["USQOC"]
["USQOP"]
["USQOR"]
["USQOT"]
["USQPD"]
["USQPH"]
["USQPM"]
["USQPN"]
["USQPR"]
["USQPS"]
["USQPX"]
["USQPY"]
["USQPZ"]
["USQQN"]
["USQQX"]
["USQR5"]
["USQRI"]
["USQRL"]
["USQSG"]
["USQSK"]
["USQST"]
["USQSW"]
["USQTB"]
["USQTF"]
["USQTH"]
["USQTI"]
["USQTN"]
["USQTO"]
["USQTY"]
["USQUI"]
["USQUS"]
["USQWD"]
["USQWI"]
["USQWL"]
["USQWW"]
["USQXY"]
["USQYL"]
["USQZJ"]
["USQZN"]
["USR2V"]
["USR34"]
["USR3O"]
["USR55"]
["USR5W"]
["USR63"]
["USR88"]
["USRA3"]
["USRAC"]
["USRAF"]
["USRAI"]
["USRAJ"]
["USRBO"]
["USRC6"]
["USRCH"]
["USRCY"]
["USRD4"]
["USRDK"]
["USRF5"]
["USRG6"]
["USRGA"]
["USRGJ"]
["USRGS"]
["USRH2"]
["USRHG"]
["USRHY"]
["USRI4"]
["USRIC"]
["USRIM"]
["USRJQ"]
["USRJT"]
["USRKD"]
["USRKY"]
["USRL5"]
["USRLT"]
["USRMA"]
["USRNN"]
["USRO2"]
["USROC"]
["USROJ"]
["USRP3"]
["USRR6"]
["USRRT"]
["USRSG"]
["USRSK"]
["USRUX"]
["USRV4"]
["USRV5"]
["USRV9"]
["USRWC"]
["USRWK"]
["USRWQ"]
["USRWX"]
["USRXF"]
["USRXO"]
["USRXR"]
["USRYF"]
["USRYK"]
["USRYN"]
["USS2B"]
["USS3G"]
["USS44"]
["USS4Y"]
["USS67"]
["USS7I"]
["USS7K"]
["USS7T"]
["USS7Y"]
["USS8K"]
["USS8T"]
["USSA3"]
["USSA6"]
["USSAB"]
["USSAC"]
["USSAN"]
["USSAV"]
["USSBA"]
["USSBB"]
["USSBQ"]
["USSCK"]
["USSE3"]
["USSE4"]
["USSEA"]
["USSFO"]
["USSFY"]
["USSG3"]
["USSGI"]
["USSGN"]
["USSGY"]
["USSI2"]
["USSI7"]
["USSIB"]
["USSJC"]
["USSK3"]
["USSK4"]
["USSKT"]
["USSKY"]
["USSKZ"]
["USSLM"]
["USSO9"]
["USSOD"]
["USSOH"]
["USSP2"]
["USSPQ"]
["USSPT"]
["USSR4"]
["USSR9"]
["USSRE"]
["USSRN"]
["USSRP"]
["USSRU"]
["USSS3"]
["USSSI"]
["USSSM"]
["USST9"]
["USSTG"]
["USSTH"]
["USSTL"]
["USSTP"]
["USSTZ"]
["USSUL"]
["USSUT"]
["USSUW"]
["USSUX"]
["USSXF"]
["USSYP"]
["USSYR"]
["UST2R"]
["UST5W"]
["UST9X"]
["USTA2"]
["USTA3"]
["USTAJ"]
["USTAW"]
["USTB3"]
["USTBH"]
["USTBJ"]
["USTBW"]
["USTBZ"]
["USTC4"]
["USTCH"]
["USTDI"]
["USTE8"]
["USTEP"]
["USTFG"]
["USTFO"]
["USTFR"]
["USTFT"]
["USTGB"]
["USTHF"]
["USTHN"]
["USTHU"]
["USTIE"]
["USTIS"]
["USTIW"]
["USTJB"]
["USTJJ"]
["USTK9"]
["USTKN"]
["USTL8"]
["USTLQ"]
["USTMM"]
["USTMN"]
["USTMZ"]
["USTNE"]
["USTNI"]
["USTNV"]
["USTO3"]
["USTOL"]
["USTOU"]
["USTOZ"]
["USTP2"]
["USTPA"]
["USTPC"]
["USTPS"]
["USTPW"]
["USTQT"]
["USTRK"]
["USTRY"]
["USTS4"]
["USTSA"]
["USTSI"]
["USTSL"]
["USTSN"]
["USTSO"]
["USTSX"]
["USTSZ"]
["USTT9"]
["USTTS"]
["USTTV"]
["USTUB"]
["USTUV"]
["USTW2"]
["USTWD"]
["USTWM"]
["USTWZ"]
["USTX3"]
["USTXQ"]
["USTXT"]
["USTXU"]
["USTXX"]
["USTYY"]
["USU3V"]
["USUA7"]
["USUCR"]
["USUDC"]
["USUFG"]
["USUGE"]
["USUGN"]
["USUHI"]
["USUHO"]
["USUIT"]
["USUKK"]
["USULO"]
["USUMO"]
["USUMQ"]
["USUO4"]
["USUQQ"]
["USURE"]
["USURR"]
["USUSA"]
["USUSB"]
["USUT2"]
["USUTA"]
["USUTS"]
["USUWC"]
["USUWH"]
["USUXX"]
["USUXZ"]
["USUYU"]
["USV7X"]
["USVAN"]
["USVAU"]
["USVBE"]
["USVDZ"]
["USVE9"]
["USVED"]
["USVFR"]
["USVGS"]
["USVIR"]
["USVIX"]
["USVJ2"]
["USVKB"]
["USVKS"]
["USVKY"]
["USVLS"]
["USVMD"]
["USVN3"]
["USVNT"]
["USVOT"]
["USVOW"]
["USVQV"]
["USVR9"]
["USVRD"]
["USVSE"]
["USVTD"]
["USVTP"]
["USVTT"]
["USVVC"]
["USVVZ"]
["USVWR"]
["USVXJ"]
["USVZZ"]
["USW26"]
["USW6T"]
["USW9A"]
["USWA4"]
["USWA7"]
["USWAB"]
["USWBM"]
["USWC4"]
["USWCO"]
["USWCP"]
["USWCW"]
["USWDZ"]
["USWE2"]
["USWEP"]
["USWEQ"]
["USWFB"]
["USWG2"]
["USWGB"]
["USWGX"]
["USWH7"]
["USWKT"]
["USWLQ"]
["USWMA"]
["USWMJ"]
["USWMP"]
["USWMU"]
["USWNF"]
["USWNH"]
["USWNK"]
["USWNS"]
["USWO4"]
["USWO7"]
["USWOT"]
["USWOV"]
["USWPB"]
["USWPF"]
["USWPT"]
["USWQA"]
["USWQU"]
["USWQZ"]
["USWR3"]
["USWR4"]
["USWRP"]
["USWTN"]
["USWTU"]
["USWU7"]
["USWUP"]
["USWUR"]
["USWUS"]
["USWVA"]
["USWW9"]
["USWWI"]
["USWXB"]
["USWXS"]
["USWY2"]
["USWY7"]
["USWZS"]
["USXAE"]
["USXAK"]
["USXAM"]
["USXAR"]
["USXAS"]
["USXBW"]
["USXEH"]
["USXFO"]
["USXKW"]
["USXLT"]
["USXMY"]
["USXNA"]
["USXNW"]
["USXOR"]
["USXOT"]
["USXPE"]
["USXPG"]
["USXPT"]
["USXPY"]
["USXRA"]
["USXRC"]
["USXRT"]
["USXSD"]
["USXSG"]
["USXSH"]
["USXSI"]
["USXSJ"]
["USXSK"]
["USXSS"]
["USXSY"]
["USXTE"]
["USXTK"]
["USXTM"]
["USXTN"]
["USXTR"]
["USXTS"]
["USXTY"]
["USXUY"]
["USXVB"]
["USXVN"]
["USXVR"]
["USXWE"]
["USXWO"]
["USXWT"]
["USXXL"]
["USXXO"]
["USXXX"]
["USXXY"]
["USXY2"]
["USXYB"]
["USXYS"]
["USXYT"]
["USXZA"]
["USXZD"]
["USXZS"]
["USXZW"]
["USYAN"]
["USYAO"]
["USYAS"]
["USYAZ"]
["USYBD"]
["USYBG"]
["USYBN"]
["USYBY"]
["USYBZ"]
["USYCD"]
["USYCE"]
["USYCG"]
["USYCK"]
["USYCP"]
["USYCU"]
["USYCZ"]
["USYDE"]
["USYDO"]
["USYDP"]
["USYEB"]
["USYEC"]
["USYEJ"]
["USYEM"]
["USYEP"]
["USYER"]
["USYFA"]
["USYFQ"]
["USYFX"]
["USYFZ"]
["USYGL"]
["USYGS"]
["USYHB"]
["USYHE"]
["USYHM"]
["USYHR"]
["USYIG"]
["USYIL"]
["USYKB"]
["USYKL"]
["USYL2"]
["USYL9"]
["USYLB"]
["USYLD"]
["USYLO"]
["USYLP"]
["USYLR"]
["USYLT"]
["USYLU"]
["USYLY"]
["USYMD"]
["USYMK"]
["USYMR"]
["USYMV"]
["USYNA"]
["USYNJ"]
["USYNN"]
["USYNO"]
["USYOB"]
["USYOC"]
["USYOK"]
["USYOQ"]
["USYP5"]
["USYPB"]
["USYPF"]
["USYPH"]
["USYPN"]
["USYPR"]
["USYRD"]
["USYRE"]
["USYRF"]
["USYRG"]
["USYRO"]
["USYRP"]
["USYRX"]
["USYRY"]
["USYSB"]
["USYSC"]
["USYSD"]
["USYSG"]
["USYSH"]
["USYSJ"]
["USYSK"]
["USYSP"]
["USYSS"]
["USYST"]
["USYSV"]
["USYSY"]
["USYTA"]
["USYTC"]
["USYTH"]
["USYTJ"]
["USYTL"]
["USYTO"]
["USYTW"]
["USYU5"]
["USYUD"]
["USYUG"]
["USYUP"]
["USYVI"]
["USYVO"]
["USYVR"]
["USYWA"]
["USYWD"]
["USYWE"]
["USYWH"]
["USYWI"]
["USYWR"]
["USYWW"]
["USYWZ"]
["USYXB"]
["USYYG"]
["USYYX"]
["USZ4X"]
["USZAD"]
["USZAL"]
["USZAN"]
["USZAO"]
["USZAY"]
["USZBA"]
["USZBI"]
["USZBK"]
["USZBP"]
["USZCB"]
["USZCC"]
["USZCE"]
["USZCG"]
["USZCS"]
["USZCT"]
["USZCV"]
["USZCW"]
["USZCY"]
["USZCZ"]
["USZDC"]
["USZDE"]
["USZDG"]
["USZDQ"]
["USZDS"]
["USZDZ"]
["USZEC"]
["USZEF"]
["USZEH"]
["USZEM"]
["USZEN"]
["USZEO"]
["USZEP"]
["USZET"]
["USZEV"]
["USZEW"]
["USZFI"]
["USZFM"]
["USZGE"]
["USZGG"]
["USZGN"]
["USZGP"]
["USZGQ"]
["USZGT"]
["USZGU"]
["USZGZ"]
["USZHB"]
["USZHE"]
["USZHM"]
["USZHT"]
["USZHU"]
["USZHW"]
["USZIC"]
["USZIK"]
["USZIW"]
["USZIX"]
["USZJ9"]
["USZKL"]
["USZKN"]
["USZLG"]
["USZLO"]
["USZLP"]
["USZLT"]
["USZLW"]
["USZMG"]
["USZMP"]
["USZMQ"]
["USZMU"]
["USZMW"]
["USZMY"]
["USZNH"]
["USZNR"]
["USZNT"]
["USZOD"]
["USZOH"]
["USZOI"]
["USZOP"]
["USZOR"]
["USZOT"]
["USZOW"]
["USZPB"]
["USZPP"]
["USZPT"]
["USZPU"]
["USZPW"]
["USZQC"]
["USZQE"]
["USZQU"]
["USZQZ"]
["USZR9"]
["USZRB"]
["USZRC"]
["USZRE"]
["USZRH"]
["USZRR"]
["USZRY"]
["USZS2"]
["USZSB"]
["USZSD"]
["USZSG"]
["USZSI"]
["USZSO"]
["USZSP"]
["USZST"]
["USZSU"]
["USZTB"]
["USZTG"]
["USZTK"]
["USZTP"]
["USZTR"]
["USZTU"]
["USZUC"]
["USZUM"]
["USZVA"]
["USZVB"]
["USZVY"]
["USZWB"]
["USZWC"]
["USZWK"]
["USZWM"]
["USZWZ"]
["USZXE"]
["USZXQ"]
["USZXZ"]
["USZYF"]
["USZYH"]
["USZYI"]
["USZYK"]
["USZYL"]
["USZYN"]
["USZYT"]
["USZYX"]
["USZYY"]
["USZZB"]
["USZZC"]
["USZZH"]
["USZZX"]
["UY888"]
["UYCAR"]
["UYCPP"]
["UYCYR"]
["UYDZO"]
["UYFZB"]
["UYJIT"]
["UYJLC"]
["UYLAP"]
["UYMER"]
["UYMVD"]
["UYNVP"]
["UYPDP"]
["UYPDU"]
["UYPIR"]
["UYSTY"]
["UZAKT"]
["UZASA"]
["VC888"]
["VCBQU"]
["VCCAN"]
["VCCRP"]
["VCGRG"]
["VCKTN"]
["VCMQS"]
["VCSVD"]
["VCUNI"]
["VE888"]
["VEAMY"]
["VEARA"]
["VEBAV"]
["VEBJV"]
["VECAR"]
["VECBL"]
["VECBS"]
["VECGU"]
["VECHQ"]
["VECHV"]
["VECMR"]
["VECUM"]
["VECUP"]
["VECXA"]
["VECZE"]
["VEEGU"]
["VEELC"]
["VEELP"]
["VEETV"]
["VEGUA"]
["VEGUB"]
["VEGUI"]
["VEGUT"]
["VEJOT"]
["VELAG"]
["VELCV"]
["VELEC"]
["VELGY"]
["VELSP"]
["VELSV"]
["VELVL"]
["VEMAR"]
["VEMIV"]
["VEMOR"]
["VEMTV"]
["VEPAR"]
["VEPBL"]
["VEPCA"]
["VEPCN"]
["VEPCO"]
["VEPCT"]
["VEPCU"]
["VEPCZ"]
["VEPFI"]
["VEPHO"]
["VEPLA"]
["VEPLV"]
["VEPMP"]
["VEPMR"]
["VEPPD"]
["VEPPZ"]
["VEPRC"]
["VEPRG"]
["VEPSU"]
["VEPTZ"]
["VEPYH"]
["VEPZO"]
["VESFD"]
["VESFX"]
["VESLV"]
["VETJV"]
["VETUR"]
["VEYUR"]
["VG888"]
["VGEIS"]
["VGJVD"]
["VGNIS"]
["VGPUR"]
["VGRAD"]
["VGSHO"]
["VGTOV"]
["VI888"]
["VICHA"]
["VICTD"]
["VICZB"]
["VIENP"]
["VIFRD"]
["VIHOC"]
["VILIB"]
["VIPAX"]
["VISTT"]
["VN888"]
["VNBAN"]
["VNBAO"]
["VNBCD"]
["VNBDG"]
["VNBDU"]
["VNBEN"]
["VNBHO"]
["VNBLG"]
["VNBMH"]
["VNBNG"]
["VNBNO"]
["VNBSE"]
["VNCCA"]
["VNCCU"]
["VNCLI"]
["VNCLN"]
["VNCLO"]
["VNCMT"]
["VNCMY"]
["VNCPH"]
["VNCRB"]
["VNCSG"]
["VNCUA"]
["VNCUV"]
["VNCVE"]
["VNDAD"]
["VNDMO"]
["VNDN3"]
["VNDNA"]
["VNDOH"]
["VNDQT"]
["VNDTH"]
["VNDTS"]
["VNDVU"]
["VNDXA"]
["VNDXN"]
["VNGDA"]
["VNGDB"]
["VNHAA"]
["VNHAN"]
["VNHAT"]
["VNHCH"]
["VNHDG"]
["VNHIA"]
["VNHLP"]
["VNHNH"]
["VNHON"]
["VNHPH"]
["VNHPP"]
["VNHSN"]
["VNHUI"]
["VNHYN"]
["VNIPH"]
["VNITX"]
["VNKHU"]
["VNKYH"]
["VNKYQ"]
["VNLAP"]
["VNLBN"]
["VNLBT"]
["VNLMP"]
["VNLPO"]
["VNLTH"]
["VNMOC"]
["VNMTH"]
["VNMUT"]
["VNNCN"]
["VNNGH"]
["VNNGT"]
["VNNHA"]
["VNNHD"]
["VNNHT"]
["VNNIH"]
["VNNMD"]
["VNNVT"]
["VNOCL"]
["VNONB"]
["VNOSP"]
["VNOTW"]
["VNPHA"]
["VNPHB"]
["VNPHG"]
["VNPHH"]
["VNPHL"]
["VNPHU"]
["VNQBH"]
["VNQNH"]
["VNQNT"]
["VNQUL"]
["VNQUT"]
["VNRDG"]
["VNRQU"]
["VNSAD"]
["VNSDP"]
["VNSGN"]
["VNSH9"]
["VNSIT"]
["VNSON"]
["VNSPC"]
["VNSTD"]
["VNSTR"]
["VNTAM"]
["VNTBB"]
["VNTBI"]
["VNTCG"]
["VNTCN"]
["VNTHD"]
["VNTHO"]
["VNTHU"]
["VNTMT"]
["VNTNA"]
["VNTNO"]
["VNTOT"]
["VNTPP"]
["VNTRE"]
["VNTTD"]
["VNTVN"]
["VNUIH"]
["VNVAG"]
["VNVCA"]
["VNVCH"]
["VNVHG"]
["VNVIC"]
["VNVLG"]
["VNVLO"]
["VNVNH"]
["VNVPH"]
["VNVRO"]
["VNVUT"]
["VNXNG"]
["VU888"]
["VULUG"]
["VUPSA"]
["VUSAN"]
["VUVLI"]
["WF888"]
["WFMAU"]
["WFSIG"]
["WS888"]
["WSAAU"]
["WSAPW"]
["XX888"]
["XZAAD"]
["XZALV"]
["XZANT"]
["XZANU"]
["XZBAL"]
["XZBIS"]
["XZBLA"]
["XZBRA"]
["XZBSE"]
["XZBUV"]
["XZCAH"]
["XZCGH"]
["XZCMT"]
["XZDHS"]
["XZDHT"]
["XZDRA"]
["XZDTL"]
["XZECN"]
["XZEUI"]
["XZEUO"]
["XZEUP"]
["XZFRM"]
["XZGIB"]
["XZGJO"]
["XZGOF"]
["XZGOL"]
["XZGRA"]
["XZHEI"]
["XZHUL"]
["XZKAT"]
["XZKBJ"]
["XZKMT"]
["XZKRI"]
["XZLAM"]
["XZLGT"]
["XZMEX"]
["XZMKL"]
["XZMVI"]
["XZNAO"]
["XZNJO"]
["XZNNE"]
["XZNTE"]
["XZOCA"]
["XZOFB"]
["XZOFF"]
["XZOFH"]
["XZOFN"]
["XZPAN"]
["XZSAO"]
["XZSBY"]
["XZSHA"]
["XZSHV"]
["XZSIM"]
["XZSKA"]
["XZSTP"]
["XZSUE"]
["XZSUU"]
["XZSYG"]
["XZTGR"]
["XZTHA"]
["XZTUN"]
["XZURD"]
["XZVFK"]
["XZVGD"]
["XZVIL"]
["XZVOV"]
["XZVSU"]
["XZWRT"]
["XZYET"]
["XZYGT"]
["XZZNO"]
["YE888"]
["YEADE"]
["YEAHW"]
["YEELK"]
["YEHAR"]
["YEHAU"]
["YEHOD"]
["YEKHO"]
["YELAD"]
["YEMKX"]
["YEMOK"]
["YEMYN"]
["YEPRM"]
["YERAI"]
["YERAK"]
["YESAL"]
["YESCT"]
["YESYE"]
["YT888"]
["YTDZA"]
["YTLON"]
["YTMAM"]
["ZA2WC"]
["ZA3WC"]
["ZA7WC"]
["ZA888"]
["ZA8GT"]
["ZAAOB"]
["ZABGR"]
["ZABWA"]
["ZACPT"]
["ZACTP"]
["ZADRU"]
["ZADUR"]
["ZADWK"]
["ZAEBY"]
["ZAEDG"]
["ZAELS"]
["ZAFHK"]
["ZAGRH"]
["ZAGSF"]
["ZAGTY"]
["ZAIVI"]
["ZAJOH"]
["ZAJTP"]
["ZAKKN"]
["ZAKOM"]
["ZAKOO"]
["ZAKOS"]
["ZAKUU"]
["ZAKYA"]
["ZALER"]
["ZAMD3"]
["ZAMDE"]
["ZAMWT"]
["ZAMZY"]
["ZANGG"]
["ZANGQ"]
["ZANNL"]
["ZANOL"]
["ZANUF"]
["ZAPED"]
["ZAPEN"]
["ZAPHX"]
["ZAPIT"]
["ZAPLZ"]
["ZAPNL"]
["ZARCB"]
["ZARSS"]
["ZARWC"]
["ZASDB"]
["ZASHM"]
["ZASID"]
["ZASMN"]
["ZASNL"]
["ZASTD"]
["ZASTR"]
["ZATHR"]
["ZAVAC"]
["ZAWAT"]
["ZAWTN"]
["ZAWWC"]
["ZAZE4"]
["ZMSIA"]
["ZWCHE"]
["ZWFLU"]
["ZWGWA"]
["ZWRSP"]
["ZWZMZ"]
["ZZCAN"]
["ZZUKN"]

{"sheet":"Version","index":10,"n_rows":23,"n_cols":6,"rows_kept":23,"cut":false,"hidden":true,"merged":[]}
["Version #","1.2.0","Version date","2022-10-18"]
[]
["Version history"]
["Version #","0.1","Version date","2021-09-27"]
["Version #","0.2","Version date","2021-10-04"]
["Version #","0.9","Version date","2021-10-05",null,"Do akceptacji"]
["Version #","0.9.1","Version date","2021-10-06",null,"Poprawione: wysokość i szerokość kolumn"]
["Version #","0.9.2","Version date","2021-10-06",null,"Poprawione: wysokość i szerokość kolumn, formatowanie dat w zakładkach"]
["Version #","0.9.3","Version date","2021-10-07",null,"Usunięte restrykcje z pól daty"]
["Version #","0.9.4","Version date","2021-10-07",null,"Cofnięte restrykcje z pól daty, poprawa validacji pol"]
["Version #","0.9.5","Version date","2021-10-08",null,"Poprawa validacji pol"]
["Version #","0.9.6","Version date","2021-10-11",null,"Poprawa validacji pol"]
["Version #","0.9.7","Version date","2021-10-13",null,"Poprawa validacji pol"]
["Version #","0.9.8","Version date","2021-10-18",null,"Poprawa validacji pol"]
["Version #","0.9.10","Version date","2021-10-19",null,"Nowa zakladka Waste receipt"]
["Version #","0.9.11","Version date","2021-10-21",null,"Nowy słownik Hazmat 2021-09-29"]
["Version #","0.9.12","Version date","2021-10-26",null,"Słownik Hazmat 2021-09-29 - usunięto klasę IBC-TPA"]
["Version #","0.9.13","Version date","2021-11-09",null,"Poprawki w Security"]
["Version #","0.9.14","Version date","2021-12-02",null,"Poprawki w Health"]
["Version #","0.9.15","Version date","2022-01-04",null,"Poprawki w Health, Waste i zawijanie tekstu w wypełnianych polach"]
["Version #","1.0.0","Version date","2022-01-27",null,"Korekta kodów Waste - wersja produkcyjna"]
["Version #","1.1","Version date","2022-02-04",null,"Korekta kodów Waste"]
["Version #","1.2","Version date","2022-10-18",null,"Nowy słownik Waste SSN5"]