{"text_format":"1","workbook":"xlsx","n_sheets":11,"sheets":["FAL 7","Languages","Slowniki_Dictionaries","DangerousGood","FuelType","DicWaste","RecProvider","Kraje_Countries","PackType","Porty_Ports","Version"],"not_rendered":{"charts":0,"images":1,"macros":1,"external_links":0,"defined_names":40,"comments":0,"pivot_tables":0},"unopened":[],"bounds":{"document_bytes":16777216,"sheet_cells":100000,"rows_first":2000,"rows_last":500,"rows_between":2000,"halvings":0,"cell_chars":16384,"cell_head_chars":4096},"cells_cut":0,"cells_raw":0,"read":"whole","date_system":"1900"}

{"sheet":"FAL 7","index":0,"n_rows":10,"n_cols":15,"rows_kept":10,"cut":false,"hidden":false,"merged":[]}
[{"$f":"\"Ver: \" & Version!B1","v":"Ver: 1.2.0"}]
[{"$f":"INDEX((Languages!$A$8:$B$8),0,MATCH(B4,Languages,0))","v":"Dangerous and polluting goods notification form"}]
[]
["Wybierz język / Choose language","English",null,null,null,"* Pole obowiązkowe / Mandatory field"]
[null,{"$f":"INDEX((Languages!$V$3:$W$3),0,MATCH(B4,Languages,0))","v":"Date of signing"},{"$f":"INDEX((Languages!$V$4:$W$4),0,MATCH(B4,Languages,0))","v":"Place of signing"},{"$f":"INDEX((Languages!$V$5:$W$5),0,MATCH(B4,Languages,0))","v":"Ship's position"},{"$f":"INDEX((Languages!$V$6:$W$6),0,MATCH(B4,Languages,0))","v":"INF class"},{"$f":"INDEX((Languages!$V$8:$W$8),0,MATCH(B4,Languages,0))","v":"DG confirmation *"},{"$f":"INDEX((Languages!$V$7:$W$7),0,MATCH(B4,Languages,0))","v":"Additional information"}]
[]
[{"$f":"INDEX((Languages!$V$9:$W$9),0,MATCH(B4,Languages,0))","v":"Contact details of the institution from which detailed information on dangerous or polluting goods can be obtained"},{"$f":"INDEX((Languages!$V$10:$W$10),0,MATCH(B4,Languages,0))","v":"Contact name"},{"$f":"INDEX((Languages!$V$11:$W$11),0,MATCH(B4,Languages,0))","v":"Address"},{"$f":"INDEX((Languages!$V$12:$W$12),0,MATCH(B4,Languages,0))","v":"Phone *"},{"$f":"INDEX((Languages!$V$13:$W$13),0,MATCH(B4,Languages,0))","v":"Fax"},{"$f":"INDEX((Languages!$V$14:$W$14),0,MATCH(B4,Languages,0))","v":"E-mail"}]
[]
[]
[{"$f":"INDEX((Languages!$S$3:$T$3),0,MATCH(B4,Languages,0))","v":"Booking / Reference number"},{"$f":"INDEX((Languages!$S$4:$T$4),0,MATCH(B4,Languages,0))","v":"Marks and numbers *"},{"$f":"INDEX((Languages!$S$5:$T$5),0,MATCH(B4,Languages,0))","v":"No. of packages"},{"$f":"INDEX((Languages!$S$6:$T$6),0,MATCH(B4,Languages,0))","v":"Kind of packages"},{"$f":"INDEX((Languages!$S$7:$T$7),0,MATCH(B4,Languages,0))","v":"Transport document"},{"$f":"INDEX((Languages!$S$8:$T$8),0,MATCH(B4,Languages,0))","v":"Transport equipment"},{"$f":"INDEX((Languages!$S$11:$T$11),0,MATCH(B4,Languages,0))","v":"hazmatID / Packing group / Proper shipping name *"},{"$f":"INDEX((Languages!$S$15:$T$15),0,MATCH(B4,Languages,0))","v":"Flashpoint"},{"$f":"INDEX((Languages!$S$17:$T$17),0,MATCH(B4,Languages,0))","v":"Mass/Volume of goods *"},{"$f":"INDEX((Languages!$S$18:$T$18),0,MATCH(B4,Languages,0))","v":"Netto quantity"},{"$f":"INDEX((Languages!$S$19:$T$19),0,MATCH(B4,Languages,0))","v":"Unit of measure *"},{"$f":"INDEX((Languages!$S$20:$T$20),0,MATCH(B4,Languages,0))","v":"Emergency procedures EmS"},{"$f":"INDEX((Languages!$S$21:$T$21),0,MATCH(B4,Languages,0))","v":"Location on board *"},{"$f":"INDEX((Languages!$S$22:$T$22),0,MATCH(B4,Languages,0))","v":"Port of loading *"},{"$f":"INDEX((Languages!$S$23:$T$23),0,MATCH(B4,Languages,0))","v":"Port of discharge *"}]
{"$rows_left_out":1}
{"sheet":"Languages","index":1,"n_rows":24,"n_cols":68,"rows_kept":24,"cut":false,"hidden":true,"merged":[]}
["English","Polski",null,"English","Polski",null,"English","Polski",null,"English","Polski",null,"English","Polski",null,"English","Polski",null,"English","Polski",null,"English","Polski",null,"English","Polski",null,"English","Polski",null,"English","Polski",null,"English","Polski",null,"English","Polski",null,"English","Polski",null,"English","Polski",null,"English","Polski",null,"English","Polski",null,"English","Polski",null,"English","Polski",null,"English","Polski",null,"English","Polski",null,"English","Polski",null,"English","Polski"]
["Language – Title","Język – Nagłówki",null,"Language – FAL 2","Język – FAL 2",null,"Language - FAL 3","Język - FAL 3",null,"Language – FAL 4","Język – FAL 4",null,"Language – FAL 5","Język – FAL 5",null,"Language – FAL 6","Język – FAL 6",null,"Language – FAL 7","Język – FAL 7",null,"Language – FAL 7 Headline","Język – FAL 7 Nagłówek",null,"Language – PSC","Język – PSC",null,"Language – HEALTH Headline","Język – HEALTH  Nagłówek",null,"Language – HEALTH Infected area","Język – HEALTH Zawinięcia na obszarze dotkniętym",null,"Language – HEALTH Sanitary measure","Język – HEALTH Zastosowanie środków sanitarnych",null,"Language – HEALTH Anex to the Maritime Declaration","Język – HEALTH Zal do morskiej dekl",null,"Language – WASTE Headline","Język – WASTE Nagłówek",null,"Language – Waste items","Język – Waste Pozycje",null,"Language – Waste receipt","Język – Waste Pokwitowanie",null,"Language – ISPS Headline","Język – ISPS Nagłówek",null,"Language – ISPS for the last 10 calls","Język – ISPS for the last 10 calls",null,"Language - Ship to ship activities","Język - Ship to ship activities",null,"Language - FAL 3 Bunker","Język - FAL 3 Bunker",null,"Language - Ferry Manifest","Język - Manifest Promowy",null,"Language - Ballast","Język - Wody balastowe",null,"Language - Ballast Hist","Język - Wody balastowe Hist"]
["Cargo notification form","Zgłoszenie ładunku",null,"Transport document","Dokument transportowy",null,"Ship’s stores (name of article) *","Nazwa artykułu *",null,"Family name *","Nazwisko *",null,"Family name *","Nazwisko *",null,"Family name *","Nazwisko *",null,"Booking / Reference number","Numer bukingowy / referencyjny",null,"Date of signing","Data podpisania",null,"Planned duration of the call *","Planowany czas postoju *",null,"Place of signing","Miejsce podpisania",null,"Date of visit","Data zawinięcia na dotkniętym obszarze"," ","Sanitary measure date","Data zastosowania środków sanitarnych"," ","Crew or passenger","Załoga czy pasażer",null,"Are you delivering waste? *","Czy statek zamierza zdawać odpady? *",null,"Type of waste ","Rodzaj odpadów",null,"Port reception facility provider *","Dostawca portowych urządzeń do odbioru odpadów *",null,"Does the ship have a valid International Ship Security Certificate (ISSC)? *","Czy statek posiada ważny Międzynarodowy certyfikat ochrony statku (ISSC)? *",null,"Date from *","Data zawinięcia *",null,"Date from *","Data początkowa *",null,"Type / category of bunkers *","Typ / kategoria paliwa bunkrowego *",null,"Carrier name","Nazwa przewoźnika",null,"Date of submission *","Data przekazania *",null,"Tanks / Holds","Zbiorniki / Ładownie"]
["Ship's store notification form","Zgłoszenie zasobów statku",null,"No. of packages","Ilość opakowań",null,"Quantity *","Ilość zasobów  *",null,"First names *","Imiona *",null,"First names *","Imiona *",null,"First names *","Imiona *",null,"Marks and numbers *","Znaki i numery *",null,"Place of signing","Miejsce podpisania",null,"Planned operations (loading, unloading, other) *","Planowane działania (przeładunkowe, bunkrowania) *",null,"Date of signing","Data podpisania",null,"Port of call","Port zawinięcia na obszarze dotkniętym"," ","Sanitary measure type","Typ zastosowanych środków sanitarnych"," ","Person name","Nazwisko osoby",null,"Last port of delivery *","Ostatni port zdania odpadów *",null,"Code of waste ","Kod odpadu",null,"Treatment facility provider - if different from PRF provider","Podmiot świadczący usługi przetwarzania odpadów - jeżeli inny niż dostawca",null,"Cause of invalid International Ship Security Certificate","Powody nieważności Międzynarodowego certyfikatu ochrony statku (ISSC)",null,"Date to *","Data wyjścia *",null,"Date to *","Data końcowa *",null,"Bunker description","Opis paliwa bunkrowego",null,"Family name","Nazwisko",null,"Amended form? *","Formularz zmieniony? *",null,"Tank capacity (m3)","Pojemność zbiornika (m3)"]
["Crew's effects notification form","Zgłoszenie rzeczy załogi",null,"Kind of packages","Typ opakowania",null,"Unit *","Jednostka *",null,"Rank/post *","Stopień/stanowisko *",null,"Gender *","Płeć *",null,"Gender *","Płeć *",null,"No. of packages","Ilość paczek",null,"Ship's position","Pozycja statku",null,"Planned inspections, surveys, maintenance and repair works *","Planowane inspekcje, przeglądy, prace remontowe *",null,"Valid Sanitation Control Exemption/Control Certificate carried on board?","Czy na pokładzie statku znajduje się ważne Świadectwo SSCEC / SSCC?"," ",null,null,null,"Sanitary measure place","Miejsce zastosowania środków sanitarnych"," ","Age","Wiek",null,"Date of last delivery *","Data ostatniego zdania odpadów *",null,"Description","Dodatkowy opis",null,"Waste delivery date/time, from *","Data/czas początkowa odprowadzenia odpadów *",null,"Security certificate status *","Status Certyfikatu ISSC *",null,"UN/LOCODE *","Kod portu *",null,"UN/LOCODE","Kod portu",null,"Quantity *","Ilość *",null,"First name","Imię",null,"Total ballast water on board (m3) *","Całkowita ilość wód balastowych na statku (m3) *",null,"Date","Data"]
["Crew notification form ","Zgłoszenie listy załogi",null,"Description of the goods *","Opis towaru *",null,"Official Use *","Użytek służbowy *",null,"Crew effect *","Mienie załogi *",null,"Nationality *","Obywatelstwo *",null,"Nationality *","Obywatelstwo *",null,"Kind of packages","Typ opakowania",null,"INF class","Klasa INF",null,"Hull configuration (for tankers)","Konstrukcja kadłuba (zbiornikowce)",null,"Place of issue","Miejsce wystawienia Świadectwa",null,null,null,null,null,null,null,"Gender","Płeć",null,"Next port of waste delivery","Następny port odprowadzenia odpadów",null,"Waste to be delivered (m3)","Ilość odpadów do zdania (w m3)",null,"Waste delivery date/time, to *","Data/czas końcowa odprowadzenia odpadów *",null,"Type of organization issuing ISSC","Typ organizacji wystawiającej ISSC",null,"Port facility *","Obiekt portowy *",null,"Location description","Opis lokalizacji działania",null,"Unit *","Jednostka *",null,"Ticket number","Nr biletu",null,"Number of tanks and holds in ballast *","Liczba zbiorników i ładowni pod balastem *",null,"Location","Lokalizacja"]
["Passenger notification form ","Zgłoszenie listy pasażerów",null,"HS code","Kod towaru HS",null,"Location on board *","Lokalizacja na pokładzie *",null,"Quantity","Zgłaszana ilość",null,"Country of birth *","Kraj urodzenia *",null,"Country of birth *","Kraj urodzenia *",null,"Transport document","Dokument transportowy",null,"Additional information","Dodatkowe informacje",null,"Volume and nature of the cargo (for tankers)","Ilość i rodzaj ładunku(zbiornikowce)",null,"Date of issue","Data wystawienia Świadectwa",null,null,null,null,null,null,null,"Nationality","Obywatelstwo",null,"Accurate details *","Dokładne dane *",null,"Maximum dedicated storage capacity (m3)","Maksymalna pojemność zbiornika na odpady (w m3)",null,"Type of waste delivered *","Rodzaj odprowadzonych odpadów *",null,"ISSC issuer *","Organizacja wystawiająca ISSC *",null,"Security level *","Poziom ochrony statku *",null,"Location latitude\n(numeric from -90 to +90)","Szerokość geograficzna lokalizacji\n(numeric from -90 to +90)",null,"Quantity delivered at port *","Ilość dostarczona w porcie *",null,"Vehicle reg no","Nr pojazdu",null,"Total ballast water capacity (m3) *","Całkowita pojemność zbiorników balastowych (m3) *",null,"Volume (m3)","Ilość (m3)"]
["Dangerous and polluting goods notification form","Zgłoszenie ładunków niebezpiecznych lub zanieczyszczających",null,"Mass/Volume of goods *","Masa/Ilość towaru *",null,null,null,null,"Unit of items","Jednostka miary",null,"Date of birth *","Data urodzenia *",null,"Date of birth *","Data urodzenia *",null,"Transport equipment","Środek transportu",null,"DG confirmation *","Potwierdzenie deklaracji DG *",null,"Condition of the cargo and ballast tanks (for tankers)","Stan zapełnienia zbiorników (zbiornikowce)",null,"Re-inspection required?","Czy jest wymagana ponowna inspekcja?",null,null,null,null,null,null,null,"Embarkation port","Port zaokrętowania",null,"Sufficient capacity *","Wystarczające miejsce *",null,"Amount of waste retained on board (m3)","Ilość odpadów które pozostaną na statku (w m3)",null,"Description","Dodatkowy opis",null,"ISSC expiry date *","Data wygaśnięcia ISSC *",null,"Special or additional security measures taken by the ship","Specjalne lub dodatkowe środki ochrony wprowadzone na statku",null,"Location longitude\n(numeric from -180 to +180)","Długość geograficzna lokalizacji\n(numeric from -180 to +180)",null,"Date of delivery *","Data dostawy paliwa *",null,"Vehicle type","Typ pojazdu",null,"Total number of tanks and holds *","Liczba zbiorników i ładowni balastowych *",null,"Date","Data"]
["PSC expanded inspection information","Informacje o rozszerzonej inspekcji PSC",null,"Unit *","Jednostka *",null,null,null,null,null,null,null,"Birth place *","Miejsce urodzenia *",null,"Birth place *","Miejsce urodzenia *",null,"Type of classification *","Typ klasyfikacji *",null,"Contact details of the institution from which detailed information on dangerous or polluting goods can be obtained","Dane kontaktowe instytucji, od której można uzyskać szczegółowe informacje na temat ładunków niebezpiecznych lub zanieczyszczających",null,"Date of last expanded inspection in the Paris MoU region","Data ostatniej rozszerzonej inspekcji",null,"Has ship/vessel visited an affected area identified by the WHO?","Czy statek przebywał na obszarze określonym przez Światową Organizację Zdrowia za dotknięty?",null,null,null,null,null,null,null,"Date of embarkation","Data zaokrętowania",null,"Contact","Kontakt",null,"Port at which remaining waste will be delivered","Port w którym zostaną zdane odpady pozostające na statku",null,"Amount of waste delivered (m3) *","Ilość odprowadzonych odpadów (m3) *",null,"Current ship security level *","Aktualny poziom ochrony statku *",null,null,null,null,"Ship-to-ship activity *","Działanie między statkami *",null,"Bunker delivery receipt *","Potwierdzenie dostawy paliwa *",null,"Trailer reg no","Nr przyczepy",null,"Number of ballast water tanks to be discharged *","Liczba zbiorników balastowych, z których zostanie usunięta WB *",null,"Start point","Rozpoczęcie"]
["Ballast Water notification form","Zgłoszenie wód balastowych",null,"Netto quantity","Ilość netto",null,null,null,null,null,null,null,"Rank/post *","Stopień/ranga *",null,"Identify Document Type *","Typ dokumentu *",null,"UN number","Numer UN",null,"Contact name","Nazwa podmiotu",null,null,null,null,"Has any person died on board during the voyage otherwise than as a result of accident?","Czy na pokładzie podczas podróży zmarła jakakolwiek osoba z przyczyn innych niż wypadek?",null,null,null,null,null,null,null,"Nature of illness","Natura choroby",null,"Comment","Komentarz",null,"Estimated amount of waste to be generated between this notification and arrival at next port of call (m3)","Szacunkowa ilość odpadów, które powstaną od momentu przekazania tej informacji do czasu zawinięcia do następnego portu (w m3)",null,null,null,null,"Location of ship at the time this report is made","Położenie statku w chwili dokonania zgłoszenia",null,null,null,null,"Security measures applied in lieu of those stated in SSP","Środki ochrony podjęte zamiast środków określonych w planie ochrony statku",null,null,null,null,"Cargo description","Opis ładunku",null,"Number of ballast water tanks underwent exchange *","Liczba zbiorników balastowych, dla których dokonano wymiany WB *",null,"End point","Zakończenie"]
{"$rows_left_out":15}
{"sheet":"Slowniki_Dictionaries","index":2,"n_rows":24,"n_cols":27,"rows_kept":24,"cut":false,"hidden":true,"merged":[]}
["Arr/Dep","Checkbox","Checkbox","Units ","Jednostki","Units ","Jednostki","Document Type crew / passenger ","Gender","Plec","INF class ","Type of dangerous goods ","Marine pollutant ","Does ship intend to dispose waste? ","Informacja czy statek zamierza zdać odpady","ISSC Type","Typ dokumentu ISSC","ISSC issuing authority code ","Current ship security level ","Packing Group","Rating","Rating","Destination / Activity ","Tanks / Zbiorniki","Method / Metoda","Tankers","Vehicle Type"]
["Arrival","Yes","Tak","BLL - Barrel","BLL - Beczki","KGM - Kilogram","KGM - Kilogramy","MusterBook","Unknown","Nieznana","INF1","IMDG","P","Yes for all","Tak, wszystkie","Full","Pełny","GVT","SL1","I","Crew","Załoga","1 - Cargo operations : Discharging and/or loading of cargo.","AP - Rufowy / Aftpeak","DM - Rozcieńczania / Dilution","DHT - Double hull tanker","CAR - CAR | Samochód osobowy | Passenger car"]
["Departure","No","Nie","CMT - Centimetre","CMT - Centymetry","M3 - Cubic metre","M3 - Metry sześcienne","Passport","Female","Kobieta","INF2","IGC","X","Yes for some","Tak, część","Interim","Okresowy","RSO","SL2","II","Passenger","Pasażer","2 - Passenger movement : Embarking and/or disembarking of passengers.","CH - Ładownia / Cargo Hold","FM - Przepływowa / Flow through","SHT - Single hull tanker","COA - COACH | Autobus | Bus"]
[null,null,null,"CT - Carton","CT - Kartony","TNE - Metric ton","TNE - Tony","ResidentialPermit","Male","Mężczyzna","INF3","IBC","Y","Not intending","Nie zamierza",null,null,null,"SL3","III",null,null,"3 - Taking bunkers : Taking bunker (refuelling).","DB - Podwójny / Double Bottom","SM - Sekwencyjna / Sequential","SHT-SBT - Single hull with segregated ballast tanks (SBT)","CT - CAR + TRAILER | Samochód osobowy z przyczepą | Passenger car with trailer"]
[null,null,null,"FOT - Foot","FOT - Stopy",null,null,"PictureId",null,null,null,"MARPOL_ANNEX1","Z",null,null,null,null,null,null,null,null,null,"4 - Changing crew : Changing crew member(s).","FP - Dziobowy / Forepeak","T - Obróbka / Treatment",null,"LO - LORRY | Ciągnik siodłowy | Road tractor for semi-trailer"]
[null,null,null,"GRM - Gram","GRM - Gramy",null,null,"Other",null,null,null,"IMSBC","OS",null,null,null,null,null,null,null,null,null,"5 - Goodwill visit : Friendly visit.","TS - Szczytowy / Topside",null,null,"MBUS - BUS | Mini Bus | Mini Bus"]
[null,null,null,"KGM - Kilogram","KGM - Kilogramy",null,null,null,null,null,null,null,null,null,null,null,null,null,null,null,null,null,"6 - Taking supplies : Taking supplies.","WT - Burtowy / Wing",null,null,"MC - MOTORCYCLE | Motocykl | Motorbike"]
[null,null,null,"LTR - Litre","LTR - Litry",null,null,null,null,null,null,null,null,null,null,null,null,null,null,null,null,null,"7 - Repair : To effect repair.","O - Inny / Other",null,null,"TRL - TRAILER | Przyczepa/Naczepa | Trailer/semi-trailer"]
[null,null,null,"M3 - Cubic metre","M3 - Metry sześcienne",null,null,null,null,null,null,null,null,null,null,null,null,null,null,null,null,null,"8 - Laid-upInactive service.",null,null,null,"SE - LORRY + TRAILER | Zestaw ciężarowy – ciągnik z przyczepą/naczepą | Truck combination - road tractor with trailer/semi-trailer"]
[null,null,null,"MTR - Metre","MTR - Metry",null,null,null,null,null,null,null,null,null,null,null,null,null,null,null,null,null,"9 - Awaiting orders : Awaiting job order.",null,null,null,"SHO - TRUCK | Ciężarówka | Truck"]
{"$rows_left_out":15}
{"sheet":"DangerousGood","index":3,"n_rows":4116,"n_cols":4,"rows_kept":4116,"cut":false,"hidden":true,"merged":[]}
["Słownik ładunków niebezpiecznych / Dangerous goods dictionary"]
["HazmatID / Packing group / Proper shipping name","Packing group","Marine Pollutant","EmS"]
["IBC_0000_10000/ /Triethylbenzene",null,"X"]
["IBC_0000_10041/ /Triethylenetetramine",null,"Y"]
["IBC_0000_10042/ /Triethyl phosphate",null,"Z"]
["IBC_0000_10043/ /Triethyl phosphite",null,"Z"]
["IBC_0000_10044/ /Triisopropanolamine",null,"Z"]
["IBC_0000_10045/ /Triisopropylated phenyl phosphates",null,"X"]
["IBC_0000_10046/ /Trimethylacetic acid",null,"Y"]
["IBC_0000_10047/ /Trimethylamine solution (30% or less)",null,"Z"]
{"$rows_left_out":4107}
{"sheet":"FuelType","index":4,"n_rows":2,"n_cols":1,"rows_kept":2,"cut":false,"hidden":true,"merged":[]}
["Fuel - Id"]
["MGO - Marine gas oil"]

{"sheet":"DicWaste","index":5,"n_rows":2,"n_cols":1,"rows_kept":2,"cut":false,"hidden":true,"merged":[]}
["Waste - Id"]
["101 - Oily Bilge water"]

{"sheet":"RecProvider","index":6,"n_rows":2,"n_cols":1,"rows_kept":2,"cut":false,"hidden":true,"merged":[]}
["Provider"]
["Aqua-Port Ltd. - Mjr. H. Sucharskiego str. 69;Gdańsk 80-601"]

{"sheet":"Kraje_Countries","index":7,"n_rows":2,"n_cols":2,"rows_kept":2,"cut":false,"hidden":true,"merged":[]}
["Country - Id","Country - Name"]
["AD","Andorra"]

{"sheet":"PackType","index":8,"n_rows":379,"n_cols":1,"rows_kept":379,"cut":false,"hidden":true,"merged":[]}
["Pack - ID"]
["1A - Drum, steel"]
["1B - Drum, aluminium"]
["1D - Drum, plywood"]
["1F - Container, flexible"]
["1G - Drum, fibre"]
["1W - Drum, wooden"]
["2C - Barrel, wooden"]
["3A - Jerrican, steel"]
["3H - Jerrican, plastic"]
{"$rows_left_out":370}
{"sheet":"Porty_Ports","index":9,"n_rows":18397,"n_cols":4,"rows_kept":18397,"cut":false,"hidden":true,"merged":[]}
["Port - Id","Port - Name","Port_call - Id","Port_call - Name"]
["AE888",null,"PLDAR - Darlowo"]
["AEABU"]
["AEAJM"]
["AEAJP"]
["AEAMF"]
["AEAMU"]
["AEARP"]
["AEAUH"]
["AEDAS"]
{"$rows_left_out":18388}
{"sheet":"Version","index":10,"n_rows":23,"n_cols":6,"rows_kept":23,"cut":false,"hidden":true,"merged":[]}
["Version #","1.2.0","Version date","2022-10-18"]
[]
["Version history"]
["Version #","0.1","Version date","2021-09-27"]
["Version #","0.2","Version date","2021-10-04"]
["Version #","0.9","Version date","2021-10-05",null,"Do akceptacji"]
["Version #","0.9.1","Version date","2021-10-06",null,"Poprawione: wysokość i szerokość kolumn"]
["Version #","0.9.2","Version date","2021-10-06",null,"Poprawione: wysokość i szerokość kolumn, formatowanie dat w zakładkach"]
["Version #","0.9.3","Version date","2021-10-07",null,"Usunięte restrykcje z pól daty"]
["Version #","0.9.4","Version date","2021-10-07",null,"Cofnięte restrykcje z pól daty, poprawa validacji pol"]
{"$rows_left_out":13}